lucene-dev mailing list archives

Site index · List index
Message view « Date » · « Thread »
Top « Date » · « Thread »
From Policeman Jenkins Server <jenk...@thetaphi.de>
Subject [JENKINS] Lucene-Solr-6.x-MacOSX (64bit/jdk1.8.0) - Build # 682 - Still Unstable!
Date Tue, 07 Feb 2017 02:57:48 GMT
Build: https://jenkins.thetaphi.de/job/Lucene-Solr-6.x-MacOSX/682/
Java: 64bit/jdk1.8.0 -XX:-UseCompressedOops -XX:+UseParallelGC

8 tests failed.
FAILED:  org.apache.solr.cloud.CustomCollectionTest.testRouteFieldForHashRouter

Error Message:
Collection not found: routeFieldColl

Stack Trace:
org.apache.solr.common.SolrException: Collection not found: routeFieldColl
	at __randomizedtesting.SeedInfo.seed([B6ACBFE4FDEFB4EB:1E9A2139628E5FB1]:0)
	at org.apache.solr.client.solrj.impl.CloudSolrClient.getCollectionNames(CloudSolrClient.java:1376)
	at org.apache.solr.client.solrj.impl.CloudSolrClient.requestWithRetryOnStaleState(CloudSolrClient.java:1072)
	at org.apache.solr.client.solrj.impl.CloudSolrClient.request(CloudSolrClient.java:1042)
	at org.apache.solr.client.solrj.SolrRequest.process(SolrRequest.java:160)
	at org.apache.solr.client.solrj.request.UpdateRequest.commit(UpdateRequest.java:232)
	at org.apache.solr.cloud.CustomCollectionTest.testRouteFieldForHashRouter(CustomCollectionTest.java:166)
	at sun.reflect.NativeMethodAccessorImpl.invoke0(Native Method)
	at sun.reflect.NativeMethodAccessorImpl.invoke(NativeMethodAccessorImpl.java:62)
	at sun.reflect.DelegatingMethodAccessorImpl.invoke(DelegatingMethodAccessorImpl.java:43)
	at java.lang.reflect.Method.invoke(Method.java:498)
	at com.carrotsearch.randomizedtesting.RandomizedRunner.invoke(RandomizedRunner.java:1713)
	at com.carrotsearch.randomizedtesting.RandomizedRunner$8.evaluate(RandomizedRunner.java:907)
	at com.carrotsearch.randomizedtesting.RandomizedRunner$9.evaluate(RandomizedRunner.java:943)
	at com.carrotsearch.randomizedtesting.RandomizedRunner$10.evaluate(RandomizedRunner.java:957)
	at com.carrotsearch.randomizedtesting.rules.SystemPropertiesRestoreRule$1.evaluate(SystemPropertiesRestoreRule.java:57)
	at org.apache.lucene.util.TestRuleSetupTeardownChained$1.evaluate(TestRuleSetupTeardownChained.java:49)
	at org.apache.lucene.util.AbstractBeforeAfterRule$1.evaluate(AbstractBeforeAfterRule.java:45)
	at org.apache.lucene.util.TestRuleThreadAndTestName$1.evaluate(TestRuleThreadAndTestName.java:48)
	at org.apache.lucene.util.TestRuleIgnoreAfterMaxFailures$1.evaluate(TestRuleIgnoreAfterMaxFailures.java:64)
	at org.apache.lucene.util.TestRuleMarkFailure$1.evaluate(TestRuleMarkFailure.java:47)
	at com.carrotsearch.randomizedtesting.rules.StatementAdapter.evaluate(StatementAdapter.java:36)
	at com.carrotsearch.randomizedtesting.ThreadLeakControl$StatementRunner.run(ThreadLeakControl.java:368)
	at com.carrotsearch.randomizedtesting.ThreadLeakControl.forkTimeoutingTask(ThreadLeakControl.java:817)
	at com.carrotsearch.randomizedtesting.ThreadLeakControl$3.evaluate(ThreadLeakControl.java:468)
	at com.carrotsearch.randomizedtesting.RandomizedRunner.runSingleTest(RandomizedRunner.java:916)
	at com.carrotsearch.randomizedtesting.RandomizedRunner$5.evaluate(RandomizedRunner.java:802)
	at com.carrotsearch.randomizedtesting.RandomizedRunner$6.evaluate(RandomizedRunner.java:852)
	at com.carrotsearch.randomizedtesting.RandomizedRunner$7.evaluate(RandomizedRunner.java:863)
	at com.carrotsearch.randomizedtesting.rules.StatementAdapter.evaluate(StatementAdapter.java:36)
	at com.carrotsearch.randomizedtesting.rules.SystemPropertiesRestoreRule$1.evaluate(SystemPropertiesRestoreRule.java:57)
	at org.apache.lucene.util.AbstractBeforeAfterRule$1.evaluate(AbstractBeforeAfterRule.java:45)
	at com.carrotsearch.randomizedtesting.rules.StatementAdapter.evaluate(StatementAdapter.java:36)
	at org.apache.lucene.util.TestRuleStoreClassName$1.evaluate(TestRuleStoreClassName.java:41)
	at com.carrotsearch.randomizedtesting.rules.NoShadowingOrOverridesOnMethodsRule$1.evaluate(NoShadowingOrOverridesOnMethodsRule.java:40)
	at com.carrotsearch.randomizedtesting.rules.NoShadowingOrOverridesOnMethodsRule$1.evaluate(NoShadowingOrOverridesOnMethodsRule.java:40)
	at com.carrotsearch.randomizedtesting.rules.StatementAdapter.evaluate(StatementAdapter.java:36)
	at com.carrotsearch.randomizedtesting.rules.StatementAdapter.evaluate(StatementAdapter.java:36)
	at com.carrotsearch.randomizedtesting.rules.StatementAdapter.evaluate(StatementAdapter.java:36)
	at org.apache.lucene.util.TestRuleAssertionsRequired$1.evaluate(TestRuleAssertionsRequired.java:53)
	at org.apache.lucene.util.TestRuleMarkFailure$1.evaluate(TestRuleMarkFailure.java:47)
	at org.apache.lucene.util.TestRuleIgnoreAfterMaxFailures$1.evaluate(TestRuleIgnoreAfterMaxFailures.java:64)
	at org.apache.lucene.util.TestRuleIgnoreTestSuites$1.evaluate(TestRuleIgnoreTestSuites.java:54)
	at com.carrotsearch.randomizedtesting.rules.StatementAdapter.evaluate(StatementAdapter.java:36)
	at com.carrotsearch.randomizedtesting.ThreadLeakControl$StatementRunner.run(ThreadLeakControl.java:368)
	at java.lang.Thread.run(Thread.java:745)


FAILED:  org.apache.solr.cloud.ReplaceNodeTest.test

Error Message:
org/apache/solr/client/solrj/request/CollectionAdminRequest$ReplaceNode

Stack Trace:
java.lang.NoClassDefFoundError: org/apache/solr/client/solrj/request/CollectionAdminRequest$ReplaceNode
	at __randomizedtesting.SeedInfo.seed([B6ACBFE4FDEFB4EB:3EF8803E5313D913]:0)
	at org.apache.solr.cloud.ReplaceNodeTest.test(ReplaceNodeTest.java:67)
	at sun.reflect.NativeMethodAccessorImpl.invoke0(Native Method)
	at sun.reflect.NativeMethodAccessorImpl.invoke(NativeMethodAccessorImpl.java:62)
	at sun.reflect.DelegatingMethodAccessorImpl.invoke(DelegatingMethodAccessorImpl.java:43)
	at java.lang.reflect.Method.invoke(Method.java:498)
	at com.carrotsearch.randomizedtesting.RandomizedRunner.invoke(RandomizedRunner.java:1713)
	at com.carrotsearch.randomizedtesting.RandomizedRunner$8.evaluate(RandomizedRunner.java:907)
	at com.carrotsearch.randomizedtesting.RandomizedRunner$9.evaluate(RandomizedRunner.java:943)
	at com.carrotsearch.randomizedtesting.RandomizedRunner$10.evaluate(RandomizedRunner.java:957)
	at com.carrotsearch.randomizedtesting.rules.SystemPropertiesRestoreRule$1.evaluate(SystemPropertiesRestoreRule.java:57)
	at org.apache.lucene.util.TestRuleSetupTeardownChained$1.evaluate(TestRuleSetupTeardownChained.java:49)
	at org.apache.lucene.util.AbstractBeforeAfterRule$1.evaluate(AbstractBeforeAfterRule.java:45)
	at org.apache.lucene.util.TestRuleThreadAndTestName$1.evaluate(TestRuleThreadAndTestName.java:48)
	at org.apache.lucene.util.TestRuleIgnoreAfterMaxFailures$1.evaluate(TestRuleIgnoreAfterMaxFailures.java:64)
	at org.apache.lucene.util.TestRuleMarkFailure$1.evaluate(TestRuleMarkFailure.java:47)
	at com.carrotsearch.randomizedtesting.rules.StatementAdapter.evaluate(StatementAdapter.java:36)
	at com.carrotsearch.randomizedtesting.ThreadLeakControl$StatementRunner.run(ThreadLeakControl.java:368)
	at com.carrotsearch.randomizedtesting.ThreadLeakControl.forkTimeoutingTask(ThreadLeakControl.java:817)
	at com.carrotsearch.randomizedtesting.ThreadLeakControl$3.evaluate(ThreadLeakControl.java:468)
	at com.carrotsearch.randomizedtesting.RandomizedRunner.runSingleTest(RandomizedRunner.java:916)
	at com.carrotsearch.randomizedtesting.RandomizedRunner$5.evaluate(RandomizedRunner.java:802)
	at com.carrotsearch.randomizedtesting.RandomizedRunner$6.evaluate(RandomizedRunner.java:852)
	at com.carrotsearch.randomizedtesting.RandomizedRunner$7.evaluate(RandomizedRunner.java:863)
	at com.carrotsearch.randomizedtesting.rules.StatementAdapter.evaluate(StatementAdapter.java:36)
	at com.carrotsearch.randomizedtesting.rules.SystemPropertiesRestoreRule$1.evaluate(SystemPropertiesRestoreRule.java:57)
	at org.apache.lucene.util.AbstractBeforeAfterRule$1.evaluate(AbstractBeforeAfterRule.java:45)
	at com.carrotsearch.randomizedtesting.rules.StatementAdapter.evaluate(StatementAdapter.java:36)
	at org.apache.lucene.util.TestRuleStoreClassName$1.evaluate(TestRuleStoreClassName.java:41)
	at com.carrotsearch.randomizedtesting.rules.NoShadowingOrOverridesOnMethodsRule$1.evaluate(NoShadowingOrOverridesOnMethodsRule.java:40)
	at com.carrotsearch.randomizedtesting.rules.NoShadowingOrOverridesOnMethodsRule$1.evaluate(NoShadowingOrOverridesOnMethodsRule.java:40)
	at com.carrotsearch.randomizedtesting.rules.StatementAdapter.evaluate(StatementAdapter.java:36)
	at com.carrotsearch.randomizedtesting.rules.StatementAdapter.evaluate(StatementAdapter.java:36)
	at com.carrotsearch.randomizedtesting.rules.StatementAdapter.evaluate(StatementAdapter.java:36)
	at org.apache.lucene.util.TestRuleAssertionsRequired$1.evaluate(TestRuleAssertionsRequired.java:53)
	at org.apache.lucene.util.TestRuleMarkFailure$1.evaluate(TestRuleMarkFailure.java:47)
	at org.apache.lucene.util.TestRuleIgnoreAfterMaxFailures$1.evaluate(TestRuleIgnoreAfterMaxFailures.java:64)
	at org.apache.lucene.util.TestRuleIgnoreTestSuites$1.evaluate(TestRuleIgnoreTestSuites.java:54)
	at com.carrotsearch.randomizedtesting.rules.StatementAdapter.evaluate(StatementAdapter.java:36)
	at com.carrotsearch.randomizedtesting.ThreadLeakControl$StatementRunner.run(ThreadLeakControl.java:368)
	at java.lang.Thread.run(Thread.java:745)
Caused by: java.lang.ClassNotFoundException: org.apache.solr.client.solrj.request.CollectionAdminRequest$ReplaceNode
	at java.net.URLClassLoader$1.run(URLClassLoader.java:370)
	at java.net.URLClassLoader$1.run(URLClassLoader.java:362)
	at java.security.AccessController.doPrivileged(Native Method)
	at java.net.URLClassLoader.findClass(URLClassLoader.java:361)
	at java.lang.ClassLoader.loadClass(ClassLoader.java:424)
	at sun.misc.Launcher$AppClassLoader.loadClass(Launcher.java:331)
	at java.lang.ClassLoader.loadClass(ClassLoader.java:357)
	... 40 more
Caused by: java.io.FileNotFoundException: /Users/jenkins/workspace/Lucene-Solr-6.x-MacOSX/solr/build/solr-solrj/classes/java/org/apache/solr/client/solrj/request/CollectionAdminRequest$ReplaceNode.class (Too many open files)
	at java.io.FileInputStream.open0(Native Method)
	at java.io.FileInputStream.open(FileInputStream.java:195)
	at java.io.FileInputStream.<init>(FileInputStream.java:138)
	at sun.misc.URLClassPath$FileLoader$1.getInputStream(URLClassPath.java:1288)
	at sun.misc.Resource.cachedInputStream(Resource.java:77)
	at sun.misc.Resource.getByteBuffer(Resource.java:160)
	at java.net.URLClassLoader.defineClass(URLClassLoader.java:454)
	at java.net.URLClassLoader.access$100(URLClassLoader.java:73)
	at java.net.URLClassLoader$1.run(URLClassLoader.java:368)
	... 46 more


FAILED:  org.apache.solr.cloud.TestDeleteCollectionOnDownNodes.deleteCollectionWithDownNodes

Error Message:
Timed out waiting for leader elections null Last available state: null

Stack Trace:
java.lang.AssertionError: Timed out waiting for leader elections
null
Last available state: null
	at __randomizedtesting.SeedInfo.seed([B6ACBFE4FDEFB4EB:2899DB1CDBCCF863]:0)
	at org.junit.Assert.fail(Assert.java:93)
	at org.apache.solr.cloud.SolrCloudTestCase.waitForState(SolrCloudTestCase.java:265)
	at org.apache.solr.cloud.TestDeleteCollectionOnDownNodes.deleteCollectionWithDownNodes(TestDeleteCollectionOnDownNodes.java:47)
	at sun.reflect.NativeMethodAccessorImpl.invoke0(Native Method)
	at sun.reflect.NativeMethodAccessorImpl.invoke(NativeMethodAccessorImpl.java:62)
	at sun.reflect.DelegatingMethodAccessorImpl.invoke(DelegatingMethodAccessorImpl.java:43)
	at java.lang.reflect.Method.invoke(Method.java:498)
	at com.carrotsearch.randomizedtesting.RandomizedRunner.invoke(RandomizedRunner.java:1713)
	at com.carrotsearch.randomizedtesting.RandomizedRunner$8.evaluate(RandomizedRunner.java:907)
	at com.carrotsearch.randomizedtesting.RandomizedRunner$9.evaluate(RandomizedRunner.java:943)
	at com.carrotsearch.randomizedtesting.RandomizedRunner$10.evaluate(RandomizedRunner.java:957)
	at com.carrotsearch.randomizedtesting.rules.SystemPropertiesRestoreRule$1.evaluate(SystemPropertiesRestoreRule.java:57)
	at org.apache.lucene.util.TestRuleSetupTeardownChained$1.evaluate(TestRuleSetupTeardownChained.java:49)
	at org.apache.lucene.util.AbstractBeforeAfterRule$1.evaluate(AbstractBeforeAfterRule.java:45)
	at org.apache.lucene.util.TestRuleThreadAndTestName$1.evaluate(TestRuleThreadAndTestName.java:48)
	at org.apache.lucene.util.TestRuleIgnoreAfterMaxFailures$1.evaluate(TestRuleIgnoreAfterMaxFailures.java:64)
	at org.apache.lucene.util.TestRuleMarkFailure$1.evaluate(TestRuleMarkFailure.java:47)
	at com.carrotsearch.randomizedtesting.rules.StatementAdapter.evaluate(StatementAdapter.java:36)
	at com.carrotsearch.randomizedtesting.ThreadLeakControl$StatementRunner.run(ThreadLeakControl.java:368)
	at com.carrotsearch.randomizedtesting.ThreadLeakControl.forkTimeoutingTask(ThreadLeakControl.java:817)
	at com.carrotsearch.randomizedtesting.ThreadLeakControl$3.evaluate(ThreadLeakControl.java:468)
	at com.carrotsearch.randomizedtesting.RandomizedRunner.runSingleTest(RandomizedRunner.java:916)
	at com.carrotsearch.randomizedtesting.RandomizedRunner$5.evaluate(RandomizedRunner.java:802)
	at com.carrotsearch.randomizedtesting.RandomizedRunner$6.evaluate(RandomizedRunner.java:852)
	at com.carrotsearch.randomizedtesting.RandomizedRunner$7.evaluate(RandomizedRunner.java:863)
	at com.carrotsearch.randomizedtesting.rules.StatementAdapter.evaluate(StatementAdapter.java:36)
	at com.carrotsearch.randomizedtesting.rules.SystemPropertiesRestoreRule$1.evaluate(SystemPropertiesRestoreRule.java:57)
	at org.apache.lucene.util.AbstractBeforeAfterRule$1.evaluate(AbstractBeforeAfterRule.java:45)
	at com.carrotsearch.randomizedtesting.rules.StatementAdapter.evaluate(StatementAdapter.java:36)
	at org.apache.lucene.util.TestRuleStoreClassName$1.evaluate(TestRuleStoreClassName.java:41)
	at com.carrotsearch.randomizedtesting.rules.NoShadowingOrOverridesOnMethodsRule$1.evaluate(NoShadowingOrOverridesOnMethodsRule.java:40)
	at com.carrotsearch.randomizedtesting.rules.NoShadowingOrOverridesOnMethodsRule$1.evaluate(NoShadowingOrOverridesOnMethodsRule.java:40)
	at com.carrotsearch.randomizedtesting.rules.StatementAdapter.evaluate(StatementAdapter.java:36)
	at com.carrotsearch.randomizedtesting.rules.StatementAdapter.evaluate(StatementAdapter.java:36)
	at com.carrotsearch.randomizedtesting.rules.StatementAdapter.evaluate(StatementAdapter.java:36)
	at org.apache.lucene.util.TestRuleAssertionsRequired$1.evaluate(TestRuleAssertionsRequired.java:53)
	at org.apache.lucene.util.TestRuleMarkFailure$1.evaluate(TestRuleMarkFailure.java:47)
	at org.apache.lucene.util.TestRuleIgnoreAfterMaxFailures$1.evaluate(TestRuleIgnoreAfterMaxFailures.java:64)
	at org.apache.lucene.util.TestRuleIgnoreTestSuites$1.evaluate(TestRuleIgnoreTestSuites.java:54)
	at com.carrotsearch.randomizedtesting.rules.StatementAdapter.evaluate(StatementAdapter.java:36)
	at com.carrotsearch.randomizedtesting.ThreadLeakControl$StatementRunner.run(ThreadLeakControl.java:368)
	at java.lang.Thread.run(Thread.java:745)


FAILED:  org.apache.solr.cloud.TestDistribDocBasedVersion.test

Error Message:
java.io.IOException: Couldn't instantiate org.apache.zookeeper.ClientCnxnSocketNIO

Stack Trace:
org.apache.solr.common.SolrException: java.io.IOException: Couldn't instantiate org.apache.zookeeper.ClientCnxnSocketNIO
	at __randomizedtesting.SeedInfo.seed([B6ACBFE4FDEFB4EB:3EF8803E5313D913]:0)
	at org.apache.solr.common.cloud.SolrZkClient.<init>(SolrZkClient.java:170)
	at org.apache.solr.common.cloud.SolrZkClient.<init>(SolrZkClient.java:116)
	at org.apache.solr.common.cloud.SolrZkClient.<init>(SolrZkClient.java:106)
	at org.apache.solr.common.cloud.ZkStateReader.<init>(ZkStateReader.java:226)
	at org.apache.solr.client.solrj.impl.ZkClientClusterStateProvider.connect(ZkClientClusterStateProvider.java:121)
	at org.apache.solr.client.solrj.impl.CloudSolrClient.connect(CloudSolrClient.java:615)
	at org.apache.solr.cloud.AbstractFullDistribZkTestBase.initCloud(AbstractFullDistribZkTestBase.java:268)
	at org.apache.solr.cloud.AbstractFullDistribZkTestBase.createServers(AbstractFullDistribZkTestBase.java:330)
	at org.apache.solr.BaseDistributedSearchTestCase$ShardsRepeatRule$ShardsFixedStatement.callStatement(BaseDistributedSearchTestCase.java:990)
	at org.apache.solr.BaseDistributedSearchTestCase$ShardsRepeatRule$ShardsStatement.evaluate(BaseDistributedSearchTestCase.java:967)
	at com.carrotsearch.randomizedtesting.rules.SystemPropertiesRestoreRule$1.evaluate(SystemPropertiesRestoreRule.java:57)
	at org.apache.lucene.util.TestRuleSetupTeardownChained$1.evaluate(TestRuleSetupTeardownChained.java:49)
	at org.apache.lucene.util.AbstractBeforeAfterRule$1.evaluate(AbstractBeforeAfterRule.java:45)
	at org.apache.lucene.util.TestRuleThreadAndTestName$1.evaluate(TestRuleThreadAndTestName.java:48)
	at org.apache.lucene.util.TestRuleIgnoreAfterMaxFailures$1.evaluate(TestRuleIgnoreAfterMaxFailures.java:64)
	at org.apache.lucene.util.TestRuleMarkFailure$1.evaluate(TestRuleMarkFailure.java:47)
	at com.carrotsearch.randomizedtesting.rules.StatementAdapter.evaluate(StatementAdapter.java:36)
	at com.carrotsearch.randomizedtesting.ThreadLeakControl$StatementRunner.run(ThreadLeakControl.java:368)
	at com.carrotsearch.randomizedtesting.ThreadLeakControl.forkTimeoutingTask(ThreadLeakControl.java:817)
	at com.carrotsearch.randomizedtesting.ThreadLeakControl$3.evaluate(ThreadLeakControl.java:468)
	at com.carrotsearch.randomizedtesting.RandomizedRunner.runSingleTest(RandomizedRunner.java:916)
	at com.carrotsearch.randomizedtesting.RandomizedRunner$5.evaluate(RandomizedRunner.java:802)
	at com.carrotsearch.randomizedtesting.RandomizedRunner$6.evaluate(RandomizedRunner.java:852)
	at com.carrotsearch.randomizedtesting.RandomizedRunner$7.evaluate(RandomizedRunner.java:863)
	at com.carrotsearch.randomizedtesting.rules.StatementAdapter.evaluate(StatementAdapter.java:36)
	at com.carrotsearch.randomizedtesting.rules.SystemPropertiesRestoreRule$1.evaluate(SystemPropertiesRestoreRule.java:57)
	at org.apache.lucene.util.AbstractBeforeAfterRule$1.evaluate(AbstractBeforeAfterRule.java:45)
	at com.carrotsearch.randomizedtesting.rules.StatementAdapter.evaluate(StatementAdapter.java:36)
	at org.apache.lucene.util.TestRuleStoreClassName$1.evaluate(TestRuleStoreClassName.java:41)
	at com.carrotsearch.randomizedtesting.rules.NoShadowingOrOverridesOnMethodsRule$1.evaluate(NoShadowingOrOverridesOnMethodsRule.java:40)
	at com.carrotsearch.randomizedtesting.rules.NoShadowingOrOverridesOnMethodsRule$1.evaluate(NoShadowingOrOverridesOnMethodsRule.java:40)
	at com.carrotsearch.randomizedtesting.rules.StatementAdapter.evaluate(StatementAdapter.java:36)
	at com.carrotsearch.randomizedtesting.rules.StatementAdapter.evaluate(StatementAdapter.java:36)
	at com.carrotsearch.randomizedtesting.rules.StatementAdapter.evaluate(StatementAdapter.java:36)
	at org.apache.lucene.util.TestRuleAssertionsRequired$1.evaluate(TestRuleAssertionsRequired.java:53)
	at org.apache.lucene.util.TestRuleMarkFailure$1.evaluate(TestRuleMarkFailure.java:47)
	at org.apache.lucene.util.TestRuleIgnoreAfterMaxFailures$1.evaluate(TestRuleIgnoreAfterMaxFailures.java:64)
	at org.apache.lucene.util.TestRuleIgnoreTestSuites$1.evaluate(TestRuleIgnoreTestSuites.java:54)
	at com.carrotsearch.randomizedtesting.rules.StatementAdapter.evaluate(StatementAdapter.java:36)
	at com.carrotsearch.randomizedtesting.ThreadLeakControl$StatementRunner.run(ThreadLeakControl.java:368)
	at java.lang.Thread.run(Thread.java:745)
Caused by: java.io.IOException: Couldn't instantiate org.apache.zookeeper.ClientCnxnSocketNIO
	at org.apache.zookeeper.ZooKeeper.getClientCnxnSocket(ZooKeeper.java:1782)
	at org.apache.zookeeper.ZooKeeper.<init>(ZooKeeper.java:447)
	at org.apache.zookeeper.ZooKeeper.<init>(ZooKeeper.java:380)
	at org.apache.solr.common.cloud.SolrZooKeeper.<init>(SolrZooKeeper.java:43)
	at org.apache.solr.common.cloud.ZkClientConnectionStrategy.createSolrZooKeeper(ZkClientConnectionStrategy.java:105)
	at org.apache.solr.common.cloud.DefaultConnectionStrategy.connect(DefaultConnectionStrategy.java:37)
	at org.apache.solr.common.cloud.SolrZkClient.<init>(SolrZkClient.java:145)
	... 40 more
Caused by: java.io.IOException: Too many open files
	at sun.nio.ch.IOUtil.makePipe(Native Method)
	at sun.nio.ch.KQueueSelectorImpl.<init>(KQueueSelectorImpl.java:84)
	at sun.nio.ch.KQueueSelectorProvider.openSelector(KQueueSelectorProvider.java:42)
	at java.nio.channels.Selector.open(Selector.java:227)
	at org.apache.zookeeper.ClientCnxnSocketNIO.<init>(ClientCnxnSocketNIO.java:43)
	at sun.reflect.GeneratedConstructorAccessor24.newInstance(Unknown Source)
	at sun.reflect.DelegatingConstructorAccessorImpl.newInstance(DelegatingConstructorAccessorImpl.java:45)
	at java.lang.reflect.Constructor.newInstance(Constructor.java:423)
	at java.lang.Class.newInstance(Class.java:442)
	at org.apache.zookeeper.ZooKeeper.getClientCnxnSocket(ZooKeeper.java:1779)
	... 46 more


FAILED:  junit.framework.TestSuite.org.apache.solr.cloud.TestExclusionRuleCollectionAccess

Error Message:
java.io.IOException: Couldn't instantiate org.apache.zookeeper.ClientCnxnSocketNIO

Stack Trace:
org.apache.solr.common.SolrException: java.io.IOException: Couldn't instantiate org.apache.zookeeper.ClientCnxnSocketNIO
	at __randomizedtesting.SeedInfo.seed([B6ACBFE4FDEFB4EB]:0)
	at org.apache.solr.common.cloud.SolrZkClient.<init>(SolrZkClient.java:170)
	at org.apache.solr.common.cloud.SolrZkClient.<init>(SolrZkClient.java:116)
	at org.apache.solr.common.cloud.SolrZkClient.<init>(SolrZkClient.java:111)
	at org.apache.solr.common.cloud.SolrZkClient.<init>(SolrZkClient.java:98)
	at org.apache.solr.cloud.MiniSolrCloudCluster.waitForAllNodes(MiniSolrCloudCluster.java:269)
	at org.apache.solr.cloud.MiniSolrCloudCluster.<init>(MiniSolrCloudCluster.java:263)
	at org.apache.solr.cloud.SolrCloudTestCase$Builder.configure(SolrCloudTestCase.java:188)
	at org.apache.solr.cloud.TestExclusionRuleCollectionAccess.setupCluster(TestExclusionRuleCollectionAccess.java:30)
	at sun.reflect.NativeMethodAccessorImpl.invoke0(Native Method)
	at sun.reflect.NativeMethodAccessorImpl.invoke(NativeMethodAccessorImpl.java:62)
	at sun.reflect.DelegatingMethodAccessorImpl.invoke(DelegatingMethodAccessorImpl.java:43)
	at java.lang.reflect.Method.invoke(Method.java:498)
	at com.carrotsearch.randomizedtesting.RandomizedRunner.invoke(RandomizedRunner.java:1713)
	at com.carrotsearch.randomizedtesting.RandomizedRunner$6.evaluate(RandomizedRunner.java:847)
	at com.carrotsearch.randomizedtesting.RandomizedRunner$7.evaluate(RandomizedRunner.java:863)
	at com.carrotsearch.randomizedtesting.rules.StatementAdapter.evaluate(StatementAdapter.java:36)
	at com.carrotsearch.randomizedtesting.rules.SystemPropertiesRestoreRule$1.evaluate(SystemPropertiesRestoreRule.java:57)
	at org.apache.lucene.util.AbstractBeforeAfterRule$1.evaluate(AbstractBeforeAfterRule.java:45)
	at com.carrotsearch.randomizedtesting.rules.StatementAdapter.evaluate(StatementAdapter.java:36)
	at org.apache.lucene.util.TestRuleStoreClassName$1.evaluate(TestRuleStoreClassName.java:41)
	at com.carrotsearch.randomizedtesting.rules.NoShadowingOrOverridesOnMethodsRule$1.evaluate(NoShadowingOrOverridesOnMethodsRule.java:40)
	at com.carrotsearch.randomizedtesting.rules.NoShadowingOrOverridesOnMethodsRule$1.evaluate(NoShadowingOrOverridesOnMethodsRule.java:40)
	at com.carrotsearch.randomizedtesting.rules.StatementAdapter.evaluate(StatementAdapter.java:36)
	at com.carrotsearch.randomizedtesting.rules.StatementAdapter.evaluate(StatementAdapter.java:36)
	at com.carrotsearch.randomizedtesting.rules.StatementAdapter.evaluate(StatementAdapter.java:36)
	at org.apache.lucene.util.TestRuleAssertionsRequired$1.evaluate(TestRuleAssertionsRequired.java:53)
	at org.apache.lucene.util.TestRuleMarkFailure$1.evaluate(TestRuleMarkFailure.java:47)
	at org.apache.lucene.util.TestRuleIgnoreAfterMaxFailures$1.evaluate(TestRuleIgnoreAfterMaxFailures.java:64)
	at org.apache.lucene.util.TestRuleIgnoreTestSuites$1.evaluate(TestRuleIgnoreTestSuites.java:54)
	at com.carrotsearch.randomizedtesting.rules.StatementAdapter.evaluate(StatementAdapter.java:36)
	at com.carrotsearch.randomizedtesting.ThreadLeakControl$StatementRunner.run(ThreadLeakControl.java:368)
	at java.lang.Thread.run(Thread.java:745)
Caused by: java.io.IOException: Couldn't instantiate org.apache.zookeeper.ClientCnxnSocketNIO
	at org.apache.zookeeper.ZooKeeper.getClientCnxnSocket(ZooKeeper.java:1782)
	at org.apache.zookeeper.ZooKeeper.<init>(ZooKeeper.java:447)
	at org.apache.zookeeper.ZooKeeper.<init>(ZooKeeper.java:380)
	at org.apache.solr.common.cloud.SolrZooKeeper.<init>(SolrZooKeeper.java:43)
	at org.apache.solr.common.cloud.ZkClientConnectionStrategy.createSolrZooKeeper(ZkClientConnectionStrategy.java:105)
	at org.apache.solr.common.cloud.DefaultConnectionStrategy.connect(DefaultConnectionStrategy.java:37)
	at org.apache.solr.common.cloud.SolrZkClient.<init>(SolrZkClient.java:145)
	... 31 more
Caused by: java.io.IOException: Too many open files
	at sun.nio.ch.IOUtil.makePipe(Native Method)
	at sun.nio.ch.KQueueSelectorImpl.<init>(KQueueSelectorImpl.java:84)
	at sun.nio.ch.KQueueSelectorProvider.openSelector(KQueueSelectorProvider.java:42)
	at java.nio.channels.Selector.open(Selector.java:227)
	at org.apache.zookeeper.ClientCnxnSocketNIO.<init>(ClientCnxnSocketNIO.java:43)
	at sun.reflect.GeneratedConstructorAccessor24.newInstance(Unknown Source)
	at sun.reflect.DelegatingConstructorAccessorImpl.newInstance(DelegatingConstructorAccessorImpl.java:45)
	at java.lang.reflect.Constructor.newInstance(Constructor.java:423)
	at java.lang.Class.newInstance(Class.java:442)
	at org.apache.zookeeper.ZooKeeper.getClientCnxnSocket(ZooKeeper.java:1779)
	... 37 more


FAILED:  junit.framework.TestSuite.org.apache.solr.cloud.TestExclusionRuleCollectionAccess

Error Message:
15 threads leaked from SUITE scope at org.apache.solr.cloud.TestExclusionRuleCollectionAccess:     1) Thread[id=17328, name=NIOServerCxn.Factory:0.0.0.0/0.0.0.0:0, state=RUNNABLE, group=TGRP-TestExclusionRuleCollectionAccess]         at sun.nio.ch.KQueueArrayWrapper.kevent0(Native Method)         at sun.nio.ch.KQueueArrayWrapper.poll(KQueueArrayWrapper.java:198)         at sun.nio.ch.KQueueSelectorImpl.doSelect(KQueueSelectorImpl.java:117)         at sun.nio.ch.SelectorImpl.lockAndDoSelect(SelectorImpl.java:86)         at sun.nio.ch.SelectorImpl.select(SelectorImpl.java:97)         at org.apache.zookeeper.server.NIOServerCnxnFactory.run(NIOServerCnxnFactory.java:178)         at java.lang.Thread.run(Thread.java:745)    2) Thread[id=17342, name=qtp434428245-17342, state=TIMED_WAITING, group=TGRP-TestExclusionRuleCollectionAccess]         at sun.misc.Unsafe.park(Native Method)         at java.util.concurrent.locks.LockSupport.parkNanos(LockSupport.java:215)         at java.util.concurrent.locks.AbstractQueuedSynchronizer$ConditionObject.awaitNanos(AbstractQueuedSynchronizer.java:2078)         at org.eclipse.jetty.util.BlockingArrayQueue.poll(BlockingArrayQueue.java:392)         at org.eclipse.jetty.util.thread.QueuedThreadPool.idleJobPoll(QueuedThreadPool.java:563)         at org.eclipse.jetty.util.thread.QueuedThreadPool.access$800(QueuedThreadPool.java:48)         at org.eclipse.jetty.util.thread.QueuedThreadPool$2.run(QueuedThreadPool.java:626)         at java.lang.Thread.run(Thread.java:745)    3) Thread[id=17345, name=org.eclipse.jetty.server.session.HashSessionManager@14c50734Timer, state=TIMED_WAITING, group=TGRP-TestExclusionRuleCollectionAccess]         at sun.misc.Unsafe.park(Native Method)         at java.util.concurrent.locks.LockSupport.parkNanos(LockSupport.java:215)         at java.util.concurrent.locks.AbstractQueuedSynchronizer$ConditionObject.awaitNanos(AbstractQueuedSynchronizer.java:2078)         at java.util.concurrent.ScheduledThreadPoolExecutor$DelayedWorkQueue.take(ScheduledThreadPoolExecutor.java:1093)         at java.util.concurrent.ScheduledThreadPoolExecutor$DelayedWorkQueue.take(ScheduledThreadPoolExecutor.java:809)         at java.util.concurrent.ThreadPoolExecutor.getTask(ThreadPoolExecutor.java:1067)         at java.util.concurrent.ThreadPoolExecutor.runWorker(ThreadPoolExecutor.java:1127)         at java.util.concurrent.ThreadPoolExecutor$Worker.run(ThreadPoolExecutor.java:617)         at java.lang.Thread.run(Thread.java:745)    4) Thread[id=17329, name=SessionTracker, state=TIMED_WAITING, group=TGRP-TestExclusionRuleCollectionAccess]         at java.lang.Object.wait(Native Method)         at org.apache.zookeeper.server.SessionTrackerImpl.run(SessionTrackerImpl.java:146)    5) Thread[id=17343, name=qtp434428245-17343, state=TIMED_WAITING, group=TGRP-TestExclusionRuleCollectionAccess]         at sun.misc.Unsafe.park(Native Method)         at java.util.concurrent.locks.LockSupport.parkNanos(LockSupport.java:215)         at java.util.concurrent.locks.AbstractQueuedSynchronizer$ConditionObject.awaitNanos(AbstractQueuedSynchronizer.java:2078)         at org.eclipse.jetty.util.BlockingArrayQueue.poll(BlockingArrayQueue.java:392)         at org.eclipse.jetty.util.thread.QueuedThreadPool.idleJobPoll(QueuedThreadPool.java:563)         at org.eclipse.jetty.util.thread.QueuedThreadPool.access$800(QueuedThreadPool.java:48)         at org.eclipse.jetty.util.thread.QueuedThreadPool$2.run(QueuedThreadPool.java:626)         at java.lang.Thread.run(Thread.java:745)    6) Thread[id=17337, name=qtp434428245-17337-acceptor-0@2f7f433d-ServerConnector@409765f{HTTP/1.1,[http/1.1]}{127.0.0.1:53888}, state=RUNNABLE, group=TGRP-TestExclusionRuleCollectionAccess]         at sun.nio.ch.ServerSocketChannelImpl.accept0(Native Method)         at sun.nio.ch.ServerSocketChannelImpl.accept(ServerSocketChannelImpl.java:422)         at sun.nio.ch.ServerSocketChannelImpl.accept(ServerSocketChannelImpl.java:250)         at org.eclipse.jetty.server.ServerConnector.accept(ServerConnector.java:373)         at org.eclipse.jetty.server.AbstractConnector$Acceptor.run(AbstractConnector.java:601)         at org.eclipse.jetty.util.thread.QueuedThreadPool.runJob(QueuedThreadPool.java:671)         at org.eclipse.jetty.util.thread.QueuedThreadPool$2.run(QueuedThreadPool.java:589)         at java.lang.Thread.run(Thread.java:745)    7) Thread[id=17336, name=qtp434428245-17336, state=RUNNABLE, group=TGRP-TestExclusionRuleCollectionAccess]         at sun.nio.ch.KQueueArrayWrapper.kevent0(Native Method)         at sun.nio.ch.KQueueArrayWrapper.poll(KQueueArrayWrapper.java:198)         at sun.nio.ch.KQueueSelectorImpl.doSelect(KQueueSelectorImpl.java:117)         at sun.nio.ch.SelectorImpl.lockAndDoSelect(SelectorImpl.java:86)         at sun.nio.ch.SelectorImpl.select(SelectorImpl.java:97)         at sun.nio.ch.SelectorImpl.select(SelectorImpl.java:101)         at org.eclipse.jetty.io.ManagedSelector$SelectorProducer.select(ManagedSelector.java:243)         at org.eclipse.jetty.io.ManagedSelector$SelectorProducer.produce(ManagedSelector.java:191)         at org.eclipse.jetty.util.thread.strategy.ExecuteProduceConsume.executeProduceConsume(ExecuteProduceConsume.java:249)         at org.eclipse.jetty.util.thread.strategy.ExecuteProduceConsume.produceConsume(ExecuteProduceConsume.java:148)         at org.eclipse.jetty.util.thread.strategy.ExecuteProduceConsume.execute(ExecuteProduceConsume.java:100)         at org.eclipse.jetty.io.ManagedSelector.run(ManagedSelector.java:147)         at org.eclipse.jetty.util.thread.QueuedThreadPool.runJob(QueuedThreadPool.java:671)         at org.eclipse.jetty.util.thread.QueuedThreadPool$2.run(QueuedThreadPool.java:589)         at java.lang.Thread.run(Thread.java:745)    8) Thread[id=17340, name=qtp434428245-17340, state=TIMED_WAITING, group=TGRP-TestExclusionRuleCollectionAccess]         at sun.misc.Unsafe.park(Native Method)         at java.util.concurrent.locks.LockSupport.parkNanos(LockSupport.java:215)         at java.util.concurrent.locks.AbstractQueuedSynchronizer$ConditionObject.awaitNanos(AbstractQueuedSynchronizer.java:2078)         at org.eclipse.jetty.util.BlockingArrayQueue.poll(BlockingArrayQueue.java:392)         at org.eclipse.jetty.util.thread.QueuedThreadPool.idleJobPoll(QueuedThreadPool.java:563)         at org.eclipse.jetty.util.thread.QueuedThreadPool.access$800(QueuedThreadPool.java:48)         at org.eclipse.jetty.util.thread.QueuedThreadPool$2.run(QueuedThreadPool.java:626)         at java.lang.Thread.run(Thread.java:745)    9) Thread[id=17327, name=Thread-3562, state=WAITING, group=TGRP-TestExclusionRuleCollectionAccess]         at java.lang.Object.wait(Native Method)         at java.lang.Thread.join(Thread.java:1249)         at java.lang.Thread.join(Thread.java:1323)         at org.apache.zookeeper.server.NIOServerCnxnFactory.join(NIOServerCnxnFactory.java:302)         at org.apache.solr.cloud.ZkTestServer$ZKServerMain.runFromConfig(ZkTestServer.java:309)         at org.apache.solr.cloud.ZkTestServer$2.run(ZkTestServer.java:490)   10) Thread[id=17331, name=ProcessThread(sid:0 cport:-1):, state=WAITING, group=TGRP-TestExclusionRuleCollectionAccess]         at sun.misc.Unsafe.park(Native Method)         at java.util.concurrent.locks.LockSupport.park(LockSupport.java:175)         at java.util.concurrent.locks.AbstractQueuedSynchronizer$ConditionObject.await(AbstractQueuedSynchronizer.java:2039)         at java.util.concurrent.LinkedBlockingQueue.take(LinkedBlockingQueue.java:442)         at org.apache.zookeeper.server.PrepRequestProcessor.run(PrepRequestProcessor.java:120)   11) Thread[id=17341, name=qtp434428245-17341, state=TIMED_WAITING, group=TGRP-TestExclusionRuleCollectionAccess]         at sun.misc.Unsafe.park(Native Method)         at java.util.concurrent.locks.LockSupport.parkNanos(LockSupport.java:215)         at java.util.concurrent.locks.AbstractQueuedSynchronizer$ConditionObject.awaitNanos(AbstractQueuedSynchronizer.java:2078)         at org.eclipse.jetty.util.BlockingArrayQueue.poll(BlockingArrayQueue.java:392)         at org.eclipse.jetty.util.thread.QueuedThreadPool.idleJobPoll(QueuedThreadPool.java:563)         at org.eclipse.jetty.util.thread.QueuedThreadPool.access$800(QueuedThreadPool.java:48)         at org.eclipse.jetty.util.thread.QueuedThreadPool$2.run(QueuedThreadPool.java:626)         at java.lang.Thread.run(Thread.java:745)   12) Thread[id=17338, name=qtp434428245-17338, state=TIMED_WAITING, group=TGRP-TestExclusionRuleCollectionAccess]         at sun.misc.Unsafe.park(Native Method)         at java.util.concurrent.locks.LockSupport.parkNanos(LockSupport.java:215)         at java.util.concurrent.locks.AbstractQueuedSynchronizer$ConditionObject.awaitNanos(AbstractQueuedSynchronizer.java:2078)         at org.eclipse.jetty.util.BlockingArrayQueue.poll(BlockingArrayQueue.java:392)         at org.eclipse.jetty.util.thread.QueuedThreadPool.idleJobPoll(QueuedThreadPool.java:563)         at org.eclipse.jetty.util.thread.QueuedThreadPool.access$800(QueuedThreadPool.java:48)         at org.eclipse.jetty.util.thread.QueuedThreadPool$2.run(QueuedThreadPool.java:626)         at java.lang.Thread.run(Thread.java:745)   13) Thread[id=17335, name=jetty-launcher-3050-thread-1, state=TIMED_WAITING, group=TGRP-TestExclusionRuleCollectionAccess]         at sun.misc.Unsafe.park(Native Method)         at java.util.concurrent.locks.LockSupport.parkNanos(LockSupport.java:215)         at java.util.concurrent.SynchronousQueue$TransferStack.awaitFulfill(SynchronousQueue.java:460)         at java.util.concurrent.SynchronousQueue$TransferStack.transfer(SynchronousQueue.java:362)         at java.util.concurrent.SynchronousQueue.poll(SynchronousQueue.java:941)         at java.util.concurrent.ThreadPoolExecutor.getTask(ThreadPoolExecutor.java:1066)         at java.util.concurrent.ThreadPoolExecutor.runWorker(ThreadPoolExecutor.java:1127)         at java.util.concurrent.ThreadPoolExecutor$Worker.run(ThreadPoolExecutor.java:617)         at java.lang.Thread.run(Thread.java:745)   14) Thread[id=17344, name=Scheduler-193165185, state=TIMED_WAITING, group=TGRP-TestExclusionRuleCollectionAccess]         at sun.misc.Unsafe.park(Native Method)         at java.util.concurrent.locks.LockSupport.parkNanos(LockSupport.java:215)         at java.util.concurrent.locks.AbstractQueuedSynchronizer$ConditionObject.awaitNanos(AbstractQueuedSynchronizer.java:2078)         at java.util.concurrent.ScheduledThreadPoolExecutor$DelayedWorkQueue.take(ScheduledThreadPoolExecutor.java:1093)         at java.util.concurrent.ScheduledThreadPoolExecutor$DelayedWorkQueue.take(ScheduledThreadPoolExecutor.java:809)         at java.util.concurrent.ThreadPoolExecutor.getTask(ThreadPoolExecutor.java:1067)         at java.util.concurrent.ThreadPoolExecutor.runWorker(ThreadPoolExecutor.java:1127)         at java.util.concurrent.ThreadPoolExecutor$Worker.run(ThreadPoolExecutor.java:617)         at java.lang.Thread.run(Thread.java:745)   15) Thread[id=17339, name=qtp434428245-17339, state=TIMED_WAITING, group=TGRP-TestExclusionRuleCollectionAccess]         at sun.misc.Unsafe.park(Native Method)         at java.util.concurrent.locks.LockSupport.parkNanos(LockSupport.java:215)         at java.util.concurrent.locks.AbstractQueuedSynchronizer$ConditionObject.awaitNanos(AbstractQueuedSynchronizer.java:2078)         at org.eclipse.jetty.util.BlockingArrayQueue.poll(BlockingArrayQueue.java:392)         at org.eclipse.jetty.util.thread.QueuedThreadPool.idleJobPoll(QueuedThreadPool.java:563)         at org.eclipse.jetty.util.thread.QueuedThreadPool.access$800(QueuedThreadPool.java:48)         at org.eclipse.jetty.util.thread.QueuedThreadPool$2.run(QueuedThreadPool.java:626)         at java.lang.Thread.run(Thread.java:745)

Stack Trace:
com.carrotsearch.randomizedtesting.ThreadLeakError: 15 threads leaked from SUITE scope at org.apache.solr.cloud.TestExclusionRuleCollectionAccess: 
   1) Thread[id=17328, name=NIOServerCxn.Factory:0.0.0.0/0.0.0.0:0, state=RUNNABLE, group=TGRP-TestExclusionRuleCollectionAccess]
        at sun.nio.ch.KQueueArrayWrapper.kevent0(Native Method)
        at sun.nio.ch.KQueueArrayWrapper.poll(KQueueArrayWrapper.java:198)
        at sun.nio.ch.KQueueSelectorImpl.doSelect(KQueueSelectorImpl.java:117)
        at sun.nio.ch.SelectorImpl.lockAndDoSelect(SelectorImpl.java:86)
        at sun.nio.ch.SelectorImpl.select(SelectorImpl.java:97)
        at org.apache.zookeeper.server.NIOServerCnxnFactory.run(NIOServerCnxnFactory.java:178)
        at java.lang.Thread.run(Thread.java:745)
   2) Thread[id=17342, name=qtp434428245-17342, state=TIMED_WAITING, group=TGRP-TestExclusionRuleCollectionAccess]
        at sun.misc.Unsafe.park(Native Method)
        at java.util.concurrent.locks.LockSupport.parkNanos(LockSupport.java:215)
        at java.util.concurrent.locks.AbstractQueuedSynchronizer$ConditionObject.awaitNanos(AbstractQueuedSynchronizer.java:2078)
        at org.eclipse.jetty.util.BlockingArrayQueue.poll(BlockingArrayQueue.java:392)
        at org.eclipse.jetty.util.thread.QueuedThreadPool.idleJobPoll(QueuedThreadPool.java:563)
        at org.eclipse.jetty.util.thread.QueuedThreadPool.access$800(QueuedThreadPool.java:48)
        at org.eclipse.jetty.util.thread.QueuedThreadPool$2.run(QueuedThreadPool.java:626)
        at java.lang.Thread.run(Thread.java:745)
   3) Thread[id=17345, name=org.eclipse.jetty.server.session.HashSessionManager@14c50734Timer, state=TIMED_WAITING, group=TGRP-TestExclusionRuleCollectionAccess]
        at sun.misc.Unsafe.park(Native Method)
        at java.util.concurrent.locks.LockSupport.parkNanos(LockSupport.java:215)
        at java.util.concurrent.locks.AbstractQueuedSynchronizer$ConditionObject.awaitNanos(AbstractQueuedSynchronizer.java:2078)
        at java.util.concurrent.ScheduledThreadPoolExecutor$DelayedWorkQueue.take(ScheduledThreadPoolExecutor.java:1093)
        at java.util.concurrent.ScheduledThreadPoolExecutor$DelayedWorkQueue.take(ScheduledThreadPoolExecutor.java:809)
        at java.util.concurrent.ThreadPoolExecutor.getTask(ThreadPoolExecutor.java:1067)
        at java.util.concurrent.ThreadPoolExecutor.runWorker(ThreadPoolExecutor.java:1127)
        at java.util.concurrent.ThreadPoolExecutor$Worker.run(ThreadPoolExecutor.java:617)
        at java.lang.Thread.run(Thread.java:745)
   4) Thread[id=17329, name=SessionTracker, state=TIMED_WAITING, group=TGRP-TestExclusionRuleCollectionAccess]
        at java.lang.Object.wait(Native Method)
        at org.apache.zookeeper.server.SessionTrackerImpl.run(SessionTrackerImpl.java:146)
   5) Thread[id=17343, name=qtp434428245-17343, state=TIMED_WAITING, group=TGRP-TestExclusionRuleCollectionAccess]
        at sun.misc.Unsafe.park(Native Method)
        at java.util.concurrent.locks.LockSupport.parkNanos(LockSupport.java:215)
        at java.util.concurrent.locks.AbstractQueuedSynchronizer$ConditionObject.awaitNanos(AbstractQueuedSynchronizer.java:2078)
        at org.eclipse.jetty.util.BlockingArrayQueue.poll(BlockingArrayQueue.java:392)
        at org.eclipse.jetty.util.thread.QueuedThreadPool.idleJobPoll(QueuedThreadPool.java:563)
        at org.eclipse.jetty.util.thread.QueuedThreadPool.access$800(QueuedThreadPool.java:48)
        at org.eclipse.jetty.util.thread.QueuedThreadPool$2.run(QueuedThreadPool.java:626)
        at java.lang.Thread.run(Thread.java:745)
   6) Thread[id=17337, name=qtp434428245-17337-acceptor-0@2f7f433d-ServerConnector@409765f{HTTP/1.1,[http/1.1]}{127.0.0.1:53888}, state=RUNNABLE, group=TGRP-TestExclusionRuleCollectionAccess]
        at sun.nio.ch.ServerSocketChannelImpl.accept0(Native Method)
        at sun.nio.ch.ServerSocketChannelImpl.accept(ServerSocketChannelImpl.java:422)
        at sun.nio.ch.ServerSocketChannelImpl.accept(ServerSocketChannelImpl.java:250)
        at org.eclipse.jetty.server.ServerConnector.accept(ServerConnector.java:373)
        at org.eclipse.jetty.server.AbstractConnector$Acceptor.run(AbstractConnector.java:601)
        at org.eclipse.jetty.util.thread.QueuedThreadPool.runJob(QueuedThreadPool.java:671)
        at org.eclipse.jetty.util.thread.QueuedThreadPool$2.run(QueuedThreadPool.java:589)
        at java.lang.Thread.run(Thread.java:745)
   7) Thread[id=17336, name=qtp434428245-17336, state=RUNNABLE, group=TGRP-TestExclusionRuleCollectionAccess]
        at sun.nio.ch.KQueueArrayWrapper.kevent0(Native Method)
        at sun.nio.ch.KQueueArrayWrapper.poll(KQueueArrayWrapper.java:198)
        at sun.nio.ch.KQueueSelectorImpl.doSelect(KQueueSelectorImpl.java:117)
        at sun.nio.ch.SelectorImpl.lockAndDoSelect(SelectorImpl.java:86)
        at sun.nio.ch.SelectorImpl.select(SelectorImpl.java:97)
        at sun.nio.ch.SelectorImpl.select(SelectorImpl.java:101)
        at org.eclipse.jetty.io.ManagedSelector$SelectorProducer.select(ManagedSelector.java:243)
        at org.eclipse.jetty.io.ManagedSelector$SelectorProducer.produce(ManagedSelector.java:191)
        at org.eclipse.jetty.util.thread.strategy.ExecuteProduceConsume.executeProduceConsume(ExecuteProduceConsume.java:249)
        at org.eclipse.jetty.util.thread.strategy.ExecuteProduceConsume.produceConsume(ExecuteProduceConsume.java:148)
        at org.eclipse.jetty.util.thread.strategy.ExecuteProduceConsume.execute(ExecuteProduceConsume.java:100)
        at org.eclipse.jetty.io.ManagedSelector.run(ManagedSelector.java:147)
        at org.eclipse.jetty.util.thread.QueuedThreadPool.runJob(QueuedThreadPool.java:671)
        at org.eclipse.jetty.util.thread.QueuedThreadPool$2.run(QueuedThreadPool.java:589)
        at java.lang.Thread.run(Thread.java:745)
   8) Thread[id=17340, name=qtp434428245-17340, state=TIMED_WAITING, group=TGRP-TestExclusionRuleCollectionAccess]
        at sun.misc.Unsafe.park(Native Method)
        at java.util.concurrent.locks.LockSupport.parkNanos(LockSupport.java:215)
        at java.util.concurrent.locks.AbstractQueuedSynchronizer$ConditionObject.awaitNanos(AbstractQueuedSynchronizer.java:2078)
        at org.eclipse.jetty.util.BlockingArrayQueue.poll(BlockingArrayQueue.java:392)
        at org.eclipse.jetty.util.thread.QueuedThreadPool.idleJobPoll(QueuedThreadPool.java:563)
        at org.eclipse.jetty.util.thread.QueuedThreadPool.access$800(QueuedThreadPool.java:48)
        at org.eclipse.jetty.util.thread.QueuedThreadPool$2.run(QueuedThreadPool.java:626)
        at java.lang.Thread.run(Thread.java:745)
   9) Thread[id=17327, name=Thread-3562, state=WAITING, group=TGRP-TestExclusionRuleCollectionAccess]
        at java.lang.Object.wait(Native Method)
        at java.lang.Thread.join(Thread.java:1249)
        at java.lang.Thread.join(Thread.java:1323)
        at org.apache.zookeeper.server.NIOServerCnxnFactory.join(NIOServerCnxnFactory.java:302)
        at org.apache.solr.cloud.ZkTestServer$ZKServerMain.runFromConfig(ZkTestServer.java:309)
        at org.apache.solr.cloud.ZkTestServer$2.run(ZkTestServer.java:490)
  10) Thread[id=17331, name=ProcessThread(sid:0 cport:-1):, state=WAITING, group=TGRP-TestExclusionRuleCollectionAccess]
        at sun.misc.Unsafe.park(Native Method)
        at java.util.concurrent.locks.LockSupport.park(LockSupport.java:175)
        at java.util.concurrent.locks.AbstractQueuedSynchronizer$ConditionObject.await(AbstractQueuedSynchronizer.java:2039)
        at java.util.concurrent.LinkedBlockingQueue.take(LinkedBlockingQueue.java:442)
        at org.apache.zookeeper.server.PrepRequestProcessor.run(PrepRequestProcessor.java:120)
  11) Thread[id=17341, name=qtp434428245-17341, state=TIMED_WAITING, group=TGRP-TestExclusionRuleCollectionAccess]
        at sun.misc.Unsafe.park(Native Method)
        at java.util.concurrent.locks.LockSupport.parkNanos(LockSupport.java:215)
        at java.util.concurrent.locks.AbstractQueuedSynchronizer$ConditionObject.awaitNanos(AbstractQueuedSynchronizer.java:2078)
        at org.eclipse.jetty.util.BlockingArrayQueue.poll(BlockingArrayQueue.java:392)
        at org.eclipse.jetty.util.thread.QueuedThreadPool.idleJobPoll(QueuedThreadPool.java:563)
        at org.eclipse.jetty.util.thread.QueuedThreadPool.access$800(QueuedThreadPool.java:48)
        at org.eclipse.jetty.util.thread.QueuedThreadPool$2.run(QueuedThreadPool.java:626)
        at java.lang.Thread.run(Thread.java:745)
  12) Thread[id=17338, name=qtp434428245-17338, state=TIMED_WAITING, group=TGRP-TestExclusionRuleCollectionAccess]
        at sun.misc.Unsafe.park(Native Method)
        at java.util.concurrent.locks.LockSupport.parkNanos(LockSupport.java:215)
        at java.util.concurrent.locks.AbstractQueuedSynchronizer$ConditionObject.awaitNanos(AbstractQueuedSynchronizer.java:2078)
        at org.eclipse.jetty.util.BlockingArrayQueue.poll(BlockingArrayQueue.java:392)
        at org.eclipse.jetty.util.thread.QueuedThreadPool.idleJobPoll(QueuedThreadPool.java:563)
        at org.eclipse.jetty.util.thread.QueuedThreadPool.access$800(QueuedThreadPool.java:48)
        at org.eclipse.jetty.util.thread.QueuedThreadPool$2.run(QueuedThreadPool.java:626)
        at java.lang.Thread.run(Thread.java:745)
  13) Thread[id=17335, name=jetty-launcher-3050-thread-1, state=TIMED_WAITING, group=TGRP-TestExclusionRuleCollectionAccess]
        at sun.misc.Unsafe.park(Native Method)
        at java.util.concurrent.locks.LockSupport.parkNanos(LockSupport.java:215)
        at java.util.concurrent.SynchronousQueue$TransferStack.awaitFulfill(SynchronousQueue.java:460)
        at java.util.concurrent.SynchronousQueue$TransferStack.transfer(SynchronousQueue.java:362)
        at java.util.concurrent.SynchronousQueue.poll(SynchronousQueue.java:941)
        at java.util.concurrent.ThreadPoolExecutor.getTask(ThreadPoolExecutor.java:1066)
        at java.util.concurrent.ThreadPoolExecutor.runWorker(ThreadPoolExecutor.java:1127)
        at java.util.concurrent.ThreadPoolExecutor$Worker.run(ThreadPoolExecutor.java:617)
        at java.lang.Thread.run(Thread.java:745)
  14) Thread[id=17344, name=Scheduler-193165185, state=TIMED_WAITING, group=TGRP-TestExclusionRuleCollectionAccess]
        at sun.misc.Unsafe.park(Native Method)
        at java.util.concurrent.locks.LockSupport.parkNanos(LockSupport.java:215)
        at java.util.concurrent.locks.AbstractQueuedSynchronizer$ConditionObject.awaitNanos(AbstractQueuedSynchronizer.java:2078)
        at java.util.concurrent.ScheduledThreadPoolExecutor$DelayedWorkQueue.take(ScheduledThreadPoolExecutor.java:1093)
        at java.util.concurrent.ScheduledThreadPoolExecutor$DelayedWorkQueue.take(ScheduledThreadPoolExecutor.java:809)
        at java.util.concurrent.ThreadPoolExecutor.getTask(ThreadPoolExecutor.java:1067)
        at java.util.concurrent.ThreadPoolExecutor.runWorker(ThreadPoolExecutor.java:1127)
        at java.util.concurrent.ThreadPoolExecutor$Worker.run(ThreadPoolExecutor.java:617)
        at java.lang.Thread.run(Thread.java:745)
  15) Thread[id=17339, name=qtp434428245-17339, state=TIMED_WAITING, group=TGRP-TestExclusionRuleCollectionAccess]
        at sun.misc.Unsafe.park(Native Method)
        at java.util.concurrent.locks.LockSupport.parkNanos(LockSupport.java:215)
        at java.util.concurrent.locks.AbstractQueuedSynchronizer$ConditionObject.awaitNanos(AbstractQueuedSynchronizer.java:2078)
        at org.eclipse.jetty.util.BlockingArrayQueue.poll(BlockingArrayQueue.java:392)
        at org.eclipse.jetty.util.thread.QueuedThreadPool.idleJobPoll(QueuedThreadPool.java:563)
        at org.eclipse.jetty.util.thread.QueuedThreadPool.access$800(QueuedThreadPool.java:48)
        at org.eclipse.jetty.util.thread.QueuedThreadPool$2.run(QueuedThreadPool.java:626)
        at java.lang.Thread.run(Thread.java:745)
	at __randomizedtesting.SeedInfo.seed([B6ACBFE4FDEFB4EB]:0)


FAILED:  junit.framework.TestSuite.org.apache.solr.cloud.TestExclusionRuleCollectionAccess

Error Message:
There are still zombie threads that couldn't be terminated:    1) Thread[id=17328, name=NIOServerCxn.Factory:0.0.0.0/0.0.0.0:0, state=RUNNABLE, group=TGRP-TestExclusionRuleCollectionAccess]         at sun.nio.ch.KQueueArrayWrapper.interrupt(Native Method)         at sun.nio.ch.KQueueArrayWrapper.interrupt(KQueueArrayWrapper.java:203)         at sun.nio.ch.KQueueSelectorImpl.wakeup(KQueueSelectorImpl.java:257)         at java.nio.channels.spi.AbstractSelector$1.interrupt(AbstractSelector.java:213)         at java.nio.channels.spi.AbstractSelector.begin(AbstractSelector.java:219)         at sun.nio.ch.KQueueSelectorImpl.doSelect(KQueueSelectorImpl.java:116)         at sun.nio.ch.SelectorImpl.lockAndDoSelect(SelectorImpl.java:86)         at sun.nio.ch.SelectorImpl.select(SelectorImpl.java:97)         at org.apache.zookeeper.server.NIOServerCnxnFactory.run(NIOServerCnxnFactory.java:178)         at java.lang.Thread.run(Thread.java:745)    2) Thread[id=17345, name=org.eclipse.jetty.server.session.HashSessionManager@14c50734Timer, state=TIMED_WAITING, group=TGRP-TestExclusionRuleCollectionAccess]         at sun.misc.Unsafe.park(Native Method)         at java.util.concurrent.locks.LockSupport.parkNanos(LockSupport.java:215)         at java.util.concurrent.locks.AbstractQueuedSynchronizer$ConditionObject.awaitNanos(AbstractQueuedSynchronizer.java:2078)         at java.util.concurrent.ScheduledThreadPoolExecutor$DelayedWorkQueue.take(ScheduledThreadPoolExecutor.java:1093)         at java.util.concurrent.ScheduledThreadPoolExecutor$DelayedWorkQueue.take(ScheduledThreadPoolExecutor.java:809)         at java.util.concurrent.ThreadPoolExecutor.getTask(ThreadPoolExecutor.java:1067)         at java.util.concurrent.ThreadPoolExecutor.runWorker(ThreadPoolExecutor.java:1127)         at java.util.concurrent.ThreadPoolExecutor$Worker.run(ThreadPoolExecutor.java:617)         at java.lang.Thread.run(Thread.java:745)    3) Thread[id=17336, name=qtp434428245-17336, state=RUNNABLE, group=TGRP-TestExclusionRuleCollectionAccess]         at sun.nio.ch.IOUtil.drain(Native Method)         at sun.nio.ch.KQueueSelectorImpl.updateSelectedKeys(KQueueSelectorImpl.java:181)         at sun.nio.ch.KQueueSelectorImpl.doSelect(KQueueSelectorImpl.java:122)         at sun.nio.ch.SelectorImpl.lockAndDoSelect(SelectorImpl.java:86)         at sun.nio.ch.SelectorImpl.select(SelectorImpl.java:97)         at sun.nio.ch.SelectorImpl.select(SelectorImpl.java:101)         at org.eclipse.jetty.io.ManagedSelector$SelectorProducer.select(ManagedSelector.java:243)         at org.eclipse.jetty.io.ManagedSelector$SelectorProducer.produce(ManagedSelector.java:191)         at org.eclipse.jetty.util.thread.strategy.ExecuteProduceConsume.executeProduceConsume(ExecuteProduceConsume.java:249)         at org.eclipse.jetty.util.thread.strategy.ExecuteProduceConsume.produceConsume(ExecuteProduceConsume.java:148)         at org.eclipse.jetty.util.thread.strategy.ExecuteProduceConsume.execute(ExecuteProduceConsume.java:100)         at org.eclipse.jetty.io.ManagedSelector.run(ManagedSelector.java:147)         at org.eclipse.jetty.util.thread.QueuedThreadPool.runJob(QueuedThreadPool.java:671)         at org.eclipse.jetty.util.thread.QueuedThreadPool$2.run(QueuedThreadPool.java:589)         at java.lang.Thread.run(Thread.java:745)    4) Thread[id=17335, name=jetty-launcher-3050-thread-1, state=TIMED_WAITING, group=TGRP-TestExclusionRuleCollectionAccess]         at sun.misc.Unsafe.park(Native Method)         at java.util.concurrent.locks.LockSupport.parkNanos(LockSupport.java:215)         at java.util.concurrent.SynchronousQueue$TransferStack.awaitFulfill(SynchronousQueue.java:460)         at java.util.concurrent.SynchronousQueue$TransferStack.transfer(SynchronousQueue.java:362)         at java.util.concurrent.SynchronousQueue.poll(SynchronousQueue.java:941)         at java.util.concurrent.ThreadPoolExecutor.getTask(ThreadPoolExecutor.java:1066)         at java.util.concurrent.ThreadPoolExecutor.runWorker(ThreadPoolExecutor.java:1127)         at java.util.concurrent.ThreadPoolExecutor$Worker.run(ThreadPoolExecutor.java:617)         at java.lang.Thread.run(Thread.java:745)    5) Thread[id=17344, name=Scheduler-193165185, state=TIMED_WAITING, group=TGRP-TestExclusionRuleCollectionAccess]         at sun.misc.Unsafe.park(Native Method)         at java.util.concurrent.locks.LockSupport.parkNanos(LockSupport.java:215)         at java.util.concurrent.locks.AbstractQueuedSynchronizer$ConditionObject.awaitNanos(AbstractQueuedSynchronizer.java:2078)         at java.util.concurrent.ScheduledThreadPoolExecutor$DelayedWorkQueue.take(ScheduledThreadPoolExecutor.java:1093)         at java.util.concurrent.ScheduledThreadPoolExecutor$DelayedWorkQueue.take(ScheduledThreadPoolExecutor.java:809)         at java.util.concurrent.ThreadPoolExecutor.getTask(ThreadPoolExecutor.java:1067)         at java.util.concurrent.ThreadPoolExecutor.runWorker(ThreadPoolExecutor.java:1127)         at java.util.concurrent.ThreadPoolExecutor$Worker.run(ThreadPoolExecutor.java:617)         at java.lang.Thread.run(Thread.java:745)

Stack Trace:
com.carrotsearch.randomizedtesting.ThreadLeakError: There are still zombie threads that couldn't be terminated:
   1) Thread[id=17328, name=NIOServerCxn.Factory:0.0.0.0/0.0.0.0:0, state=RUNNABLE, group=TGRP-TestExclusionRuleCollectionAccess]
        at sun.nio.ch.KQueueArrayWrapper.interrupt(Native Method)
        at sun.nio.ch.KQueueArrayWrapper.interrupt(KQueueArrayWrapper.java:203)
        at sun.nio.ch.KQueueSelectorImpl.wakeup(KQueueSelectorImpl.java:257)
        at java.nio.channels.spi.AbstractSelector$1.interrupt(AbstractSelector.java:213)
        at java.nio.channels.spi.AbstractSelector.begin(AbstractSelector.java:219)
        at sun.nio.ch.KQueueSelectorImpl.doSelect(KQueueSelectorImpl.java:116)
        at sun.nio.ch.SelectorImpl.lockAndDoSelect(SelectorImpl.java:86)
        at sun.nio.ch.SelectorImpl.select(SelectorImpl.java:97)
        at org.apache.zookeeper.server.NIOServerCnxnFactory.run(NIOServerCnxnFactory.java:178)
        at java.lang.Thread.run(Thread.java:745)
   2) Thread[id=17345, name=org.eclipse.jetty.server.session.HashSessionManager@14c50734Timer, state=TIMED_WAITING, group=TGRP-TestExclusionRuleCollectionAccess]
        at sun.misc.Unsafe.park(Native Method)
        at java.util.concurrent.locks.LockSupport.parkNanos(LockSupport.java:215)
        at java.util.concurrent.locks.AbstractQueuedSynchronizer$ConditionObject.awaitNanos(AbstractQueuedSynchronizer.java:2078)
        at java.util.concurrent.ScheduledThreadPoolExecutor$DelayedWorkQueue.take(ScheduledThreadPoolExecutor.java:1093)
        at java.util.concurrent.ScheduledThreadPoolExecutor$DelayedWorkQueue.take(ScheduledThreadPoolExecutor.java:809)
        at java.util.concurrent.ThreadPoolExecutor.getTask(ThreadPoolExecutor.java:1067)
        at java.util.concurrent.ThreadPoolExecutor.runWorker(ThreadPoolExecutor.java:1127)
        at java.util.concurrent.ThreadPoolExecutor$Worker.run(ThreadPoolExecutor.java:617)
        at java.lang.Thread.run(Thread.java:745)
   3) Thread[id=17336, name=qtp434428245-17336, state=RUNNABLE, group=TGRP-TestExclusionRuleCollectionAccess]
        at sun.nio.ch.IOUtil.drain(Native Method)
        at sun.nio.ch.KQueueSelectorImpl.updateSelectedKeys(KQueueSelectorImpl.java:181)
        at sun.nio.ch.KQueueSelectorImpl.doSelect(KQueueSelectorImpl.java:122)
        at sun.nio.ch.SelectorImpl.lockAndDoSelect(SelectorImpl.java:86)
        at sun.nio.ch.SelectorImpl.select(SelectorImpl.java:97)
        at sun.nio.ch.SelectorImpl.select(SelectorImpl.java:101)
        at org.eclipse.jetty.io.ManagedSelector$SelectorProducer.select(ManagedSelector.java:243)
        at org.eclipse.jetty.io.ManagedSelector$SelectorProducer.produce(ManagedSelector.java:191)
        at org.eclipse.jetty.util.thread.strategy.ExecuteProduceConsume.executeProduceConsume(ExecuteProduceConsume.java:249)
        at org.eclipse.jetty.util.thread.strategy.ExecuteProduceConsume.produceConsume(ExecuteProduceConsume.java:148)
        at org.eclipse.jetty.util.thread.strategy.ExecuteProduceConsume.execute(ExecuteProduceConsume.java:100)
        at org.eclipse.jetty.io.ManagedSelector.run(ManagedSelector.java:147)
        at org.eclipse.jetty.util.thread.QueuedThreadPool.runJob(QueuedThreadPool.java:671)
        at org.eclipse.jetty.util.thread.QueuedThreadPool$2.run(QueuedThreadPool.java:589)
        at java.lang.Thread.run(Thread.java:745)
   4) Thread[id=17335, name=jetty-launcher-3050-thread-1, state=TIMED_WAITING, group=TGRP-TestExclusionRuleCollectionAccess]
        at sun.misc.Unsafe.park(Native Method)
        at java.util.concurrent.locks.LockSupport.parkNanos(LockSupport.java:215)
        at java.util.concurrent.SynchronousQueue$TransferStack.awaitFulfill(SynchronousQueue.java:460)
        at java.util.concurrent.SynchronousQueue$TransferStack.transfer(SynchronousQueue.java:362)
        at java.util.concurrent.SynchronousQueue.poll(SynchronousQueue.java:941)
        at java.util.concurrent.ThreadPoolExecutor.getTask(ThreadPoolExecutor.java:1066)
        at java.util.concurrent.ThreadPoolExecutor.runWorker(ThreadPoolExecutor.java:1127)
        at java.util.concurrent.ThreadPoolExecutor$Worker.run(ThreadPoolExecutor.java:617)
        at java.lang.Thread.run(Thread.java:745)
   5) Thread[id=17344, name=Scheduler-193165185, state=TIMED_WAITING, group=TGRP-TestExclusionRuleCollectionAccess]
        at sun.misc.Unsafe.park(Native Method)
        at java.util.concurrent.locks.LockSupport.parkNanos(LockSupport.java:215)
        at java.util.concurrent.locks.AbstractQueuedSynchronizer$ConditionObject.awaitNanos(AbstractQueuedSynchronizer.java:2078)
        at java.util.concurrent.ScheduledThreadPoolExecutor$DelayedWorkQueue.take(ScheduledThreadPoolExecutor.java:1093)
        at java.util.concurrent.ScheduledThreadPoolExecutor$DelayedWorkQueue.take(ScheduledThreadPoolExecutor.java:809)
        at java.util.concurrent.ThreadPoolExecutor.getTask(ThreadPoolExecutor.java:1067)
        at java.util.concurrent.ThreadPoolExecutor.runWorker(ThreadPoolExecutor.java:1127)
        at java.util.concurrent.ThreadPoolExecutor$Worker.run(ThreadPoolExecutor.java:617)
        at java.lang.Thread.run(Thread.java:745)
	at __randomizedtesting.SeedInfo.seed([B6ACBFE4FDEFB4EB]:0)


FAILED:  org.apache.solr.handler.admin.MBeansHandlerTest.testDiff

Error Message:
expected:<Was: [1, Now: 2], Delta: 1> but was:<Was: [4, Now: 5], Delta: 1>

Stack Trace:
org.junit.ComparisonFailure: expected:<Was: [1, Now: 2], Delta: 1> but was:<Was: [4, Now: 5], Delta: 1>
	at __randomizedtesting.SeedInfo.seed([B6ACBFE4FDEFB4EB:73BA7B7FED598C8B]:0)
	at org.junit.Assert.assertEquals(Assert.java:125)
	at org.junit.Assert.assertEquals(Assert.java:147)
	at org.apache.solr.handler.admin.MBeansHandlerTest.testDiff(MBeansHandlerTest.java:63)
	at sun.reflect.NativeMethodAccessorImpl.invoke0(Native Method)
	at sun.reflect.NativeMethodAccessorImpl.invoke(NativeMethodAccessorImpl.java:62)
	at sun.reflect.DelegatingMethodAccessorImpl.invoke(DelegatingMethodAccessorImpl.java:43)
	at java.lang.reflect.Method.invoke(Method.java:498)
	at com.carrotsearch.randomizedtesting.RandomizedRunner.invoke(RandomizedRunner.java:1713)
	at com.carrotsearch.randomizedtesting.RandomizedRunner$8.evaluate(RandomizedRunner.java:907)
	at com.carrotsearch.randomizedtesting.RandomizedRunner$9.evaluate(RandomizedRunner.java:943)
	at com.carrotsearch.randomizedtesting.RandomizedRunner$10.evaluate(RandomizedRunner.java:957)
	at com.carrotsearch.randomizedtesting.rules.SystemPropertiesRestoreRule$1.evaluate(SystemPropertiesRestoreRule.java:57)
	at org.apache.lucene.util.TestRuleSetupTeardownChained$1.evaluate(TestRuleSetupTeardownChained.java:49)
	at org.apache.lucene.util.AbstractBeforeAfterRule$1.evaluate(AbstractBeforeAfterRule.java:45)
	at org.apache.lucene.util.TestRuleThreadAndTestName$1.evaluate(TestRuleThreadAndTestName.java:48)
	at org.apache.lucene.util.TestRuleIgnoreAfterMaxFailures$1.evaluate(TestRuleIgnoreAfterMaxFailures.java:64)
	at org.apache.lucene.util.TestRuleMarkFailure$1.evaluate(TestRuleMarkFailure.java:47)
	at com.carrotsearch.randomizedtesting.rules.StatementAdapter.evaluate(StatementAdapter.java:36)
	at com.carrotsearch.randomizedtesting.ThreadLeakControl$StatementRunner.run(ThreadLeakControl.java:368)
	at com.carrotsearch.randomizedtesting.ThreadLeakControl.forkTimeoutingTask(ThreadLeakControl.java:817)
	at com.carrotsearch.randomizedtesting.ThreadLeakControl$3.evaluate(ThreadLeakControl.java:468)
	at com.carrotsearch.randomizedtesting.RandomizedRunner.runSingleTest(RandomizedRunner.java:916)
	at com.carrotsearch.randomizedtesting.RandomizedRunner$5.evaluate(RandomizedRunner.java:802)
	at com.carrotsearch.randomizedtesting.RandomizedRunner$6.evaluate(RandomizedRunner.java:852)
	at com.carrotsearch.randomizedtesting.RandomizedRunner$7.evaluate(RandomizedRunner.java:863)
	at com.carrotsearch.randomizedtesting.rules.StatementAdapter.evaluate(StatementAdapter.java:36)
	at com.carrotsearch.randomizedtesting.rules.SystemPropertiesRestoreRule$1.evaluate(SystemPropertiesRestoreRule.java:57)
	at org.apache.lucene.util.AbstractBeforeAfterRule$1.evaluate(AbstractBeforeAfterRule.java:45)
	at com.carrotsearch.randomizedtesting.rules.StatementAdapter.evaluate(StatementAdapter.java:36)
	at org.apache.lucene.util.TestRuleStoreClassName$1.evaluate(TestRuleStoreClassName.java:41)
	at com.carrotsearch.randomizedtesting.rules.NoShadowingOrOverridesOnMethodsRule$1.evaluate(NoShadowingOrOverridesOnMethodsRule.java:40)
	at com.carrotsearch.randomizedtesting.rules.NoShadowingOrOverridesOnMethodsRule$1.evaluate(NoShadowingOrOverridesOnMethodsRule.java:40)
	at com.carrotsearch.randomizedtesting.rules.StatementAdapter.evaluate(StatementAdapter.java:36)
	at com.carrotsearch.randomizedtesting.rules.StatementAdapter.evaluate(StatementAdapter.java:36)
	at com.carrotsearch.randomizedtesting.rules.StatementAdapter.evaluate(StatementAdapter.java:36)
	at org.apache.lucene.util.TestRuleAssertionsRequired$1.evaluate(TestRuleAssertionsRequired.java:53)
	at org.apache.lucene.util.TestRuleMarkFailure$1.evaluate(TestRuleMarkFailure.java:47)
	at org.apache.lucene.util.TestRuleIgnoreAfterMaxFailures$1.evaluate(TestRuleIgnoreAfterMaxFailures.java:64)
	at org.apache.lucene.util.TestRuleIgnoreTestSuites$1.evaluate(TestRuleIgnoreTestSuites.java:54)
	at com.carrotsearch.randomizedtesting.rules.StatementAdapter.evaluate(StatementAdapter.java:36)
	at com.carrotsearch.randomizedtesting.ThreadLeakControl$StatementRunner.run(ThreadLeakControl.java:368)
	at java.lang.Thread.run(Thread.java:745)




Build Log:
[...truncated 11503 lines...]
   [junit4] Suite: org.apache.solr.handler.admin.MBeansHandlerTest
   [junit4]   2> Creating dataDir: /Users/jenkins/workspace/Lucene-Solr-6.x-MacOSX/solr/build/solr-core/test/J1/temp/solr.handler.admin.MBeansHandlerTest_B6ACBFE4FDEFB4EB-001/init-core-data-001
   [junit4]   2> 765357 INFO  (SUITE-MBeansHandlerTest-seed#[B6ACBFE4FDEFB4EB]-worker) [    ] o.a.s.SolrTestCaseJ4 Randomized ssl (true) and clientAuth (false) via: @org.apache.solr.util.RandomizeSSL(reason=, value=NaN, ssl=NaN, clientAuth=NaN) w/ MAC_OS_X supressed clientAuth
   [junit4]   2> 765358 INFO  (SUITE-MBeansHandlerTest-seed#[B6ACBFE4FDEFB4EB]-worker) [    ] o.a.s.SolrTestCaseJ4 ####initCore
   [junit4]   2> 765358 INFO  (SUITE-MBeansHandlerTest-seed#[B6ACBFE4FDEFB4EB]-worker) [    ] o.a.s.c.SolrResourceLoader [null] Added 2 libs to classloader, from paths: [/Users/jenkins/workspace/Lucene-Solr-6.x-MacOSX/solr/core/src/test-files/solr/collection1/lib, /Users/jenkins/workspace/Lucene-Solr-6.x-MacOSX/solr/core/src/test-files/solr/collection1/lib/classes]
   [junit4]   2> 765414 WARN  (SUITE-MBeansHandlerTest-seed#[B6ACBFE4FDEFB4EB]-worker) [    ] o.a.s.c.Config Beginning with Solr 5.5, <mergePolicy> is deprecated, use <mergePolicyFactory> instead.
   [junit4]   2> 765416 INFO  (SUITE-MBeansHandlerTest-seed#[B6ACBFE4FDEFB4EB]-worker) [    ] o.a.s.c.SolrConfig Using Lucene MatchVersion: 6.5.0
   [junit4]   2> 765445 INFO  (SUITE-MBeansHandlerTest-seed#[B6ACBFE4FDEFB4EB]-worker) [    ] o.a.s.s.IndexSchema [null] Schema name=test
   [junit4]   2> 765592 WARN  (SUITE-MBeansHandlerTest-seed#[B6ACBFE4FDEFB4EB]-worker) [    ] o.a.s.s.IndexSchema [null] default search field in schema is text. WARNING: Deprecated, please use 'df' on request instead.
   [junit4]   2> 765594 INFO  (SUITE-MBeansHandlerTest-seed#[B6ACBFE4FDEFB4EB]-worker) [    ] o.a.s.s.IndexSchema Loaded schema test/1.0 with uniqueid field id
   [junit4]   2> 765613 INFO  (SUITE-MBeansHandlerTest-seed#[B6ACBFE4FDEFB4EB]-worker) [    ] o.a.s.u.UpdateShardHandler Creating UpdateShardHandler HTTP client with params: socketTimeout=30000&connTimeout=30000&retry=true
   [junit4]   2> 766203 WARN  (SUITE-MBeansHandlerTest-seed#[B6ACBFE4FDEFB4EB]-worker) [    ] o.a.s.m.r.SolrJmxReporter No serviceUrl or agentId was configured, using first MBeanServer.
   [junit4]   2> 766205 INFO  (SUITE-MBeansHandlerTest-seed#[B6ACBFE4FDEFB4EB]-worker) [    ] o.a.s.m.r.SolrJmxReporter JMX monitoring enabled at server: com.sun.jmx.mbeanserver.JmxMBeanServer@7a0b2ebd
   [junit4]   2> 766205 WARN  (SUITE-MBeansHandlerTest-seed#[B6ACBFE4FDEFB4EB]-worker) [    ] o.a.s.m.r.SolrJmxReporter No serviceUrl or agentId was configured, using first MBeanServer.
   [junit4]   2> 766208 INFO  (SUITE-MBeansHandlerTest-seed#[B6ACBFE4FDEFB4EB]-worker) [    ] o.a.s.m.r.SolrJmxReporter JMX monitoring enabled at server: com.sun.jmx.mbeanserver.JmxMBeanServer@7a0b2ebd
   [junit4]   2> 766208 WARN  (SUITE-MBeansHandlerTest-seed#[B6ACBFE4FDEFB4EB]-worker) [    ] o.a.s.m.r.SolrJmxReporter No serviceUrl or agentId was configured, using first MBeanServer.
   [junit4]   2> 766208 INFO  (SUITE-MBeansHandlerTest-seed#[B6ACBFE4FDEFB4EB]-worker) [    ] o.a.s.m.r.SolrJmxReporter JMX monitoring enabled at server: com.sun.jmx.mbeanserver.JmxMBeanServer@7a0b2ebd
   [junit4]   2> 766209 INFO  (coreLoadExecutor-3029-thread-1) [    x:collection1] o.a.s.c.SolrResourceLoader [null] Added 2 libs to classloader, from paths: [/Users/jenkins/workspace/Lucene-Solr-6.x-MacOSX/solr/core/src/test-files/solr/collection1/lib, /Users/jenkins/workspace/Lucene-Solr-6.x-MacOSX/solr/core/src/test-files/solr/collection1/lib/classes]
   [junit4]   2> 766254 WARN  (coreLoadExecutor-3029-thread-1) [    x:collection1] o.a.s.c.Config Beginning with Solr 5.5, <mergePolicy> is deprecated, use <mergePolicyFactory> instead.
   [junit4]   2> 766255 INFO  (coreLoadExecutor-3029-thread-1) [    x:collection1] o.a.s.c.SolrConfig Using Lucene MatchVersion: 6.5.0
   [junit4]   2> 766283 INFO  (coreLoadExecutor-3029-thread-1) [    x:collection1] o.a.s.s.IndexSchema [collection1] Schema name=test
   [junit4]   2> 766428 WARN  (coreLoadExecutor-3029-thread-1) [    x:collection1] o.a.s.s.IndexSchema [collection1] default search field in schema is text. WARNING: Deprecated, please use 'df' on request instead.
   [junit4]   2> 766441 INFO  (coreLoadExecutor-3029-thread-1) [    x:collection1] o.a.s.s.IndexSchema Loaded schema test/1.0 with uniqueid field id
   [junit4]   2> 766451 INFO  (coreLoadExecutor-3029-thread-1) [    x:collection1] o.a.s.c.CoreContainer Creating SolrCore 'collection1' using configuration from instancedir /Users/jenkins/workspace/Lucene-Solr-6.x-MacOSX/solr/core/src/test-files/solr/collection1
   [junit4]   2> 766451 WARN  (coreLoadExecutor-3029-thread-1) [    x:collection1] o.a.s.m.r.SolrJmxReporter No serviceUrl or agentId was configured, using first MBeanServer.
   [junit4]   2> 766451 INFO  (coreLoadExecutor-3029-thread-1) [    x:collection1] o.a.s.m.r.SolrJmxReporter JMX monitoring enabled at server: com.sun.jmx.mbeanserver.JmxMBeanServer@7a0b2ebd
   [junit4]   2> 766451 INFO  (coreLoadExecutor-3029-thread-1) [    x:collection1] o.a.s.c.SolrCore [[collection1] ] Opening new SolrCore at [/Users/jenkins/workspace/Lucene-Solr-6.x-MacOSX/solr/core/src/test-files/solr/collection1], dataDir=[/Users/jenkins/workspace/Lucene-Solr-6.x-MacOSX/solr/build/solr-core/test/J1/temp/solr.handler.admin.MBeansHandlerTest_B6ACBFE4FDEFB4EB-001/init-core-data-001/]
   [junit4]   2> 766452 INFO  (coreLoadExecutor-3029-thread-1) [    x:collection1] o.a.s.c.JmxMonitoredMap JMX monitoring is enabled. Adding Solr mbeans to JMX Server: com.sun.jmx.mbeanserver.JmxMBeanServer@7a0b2ebd
   [junit4]   2> 766455 INFO  (coreLoadExecutor-3029-thread-1) [    x:collection1] o.a.s.u.RandomMergePolicy RandomMergePolicy wrapping class org.apache.lucene.index.TieredMergePolicy: [TieredMergePolicy: maxMergeAtOnce=30, maxMergeAtOnceExplicit=41, maxMergedSegmentMB=31.63671875, floorSegmentMB=0.49609375, forceMergeDeletesPctAllowed=25.125180998007693, segmentsPerTier=14.0, maxCFSSegmentSizeMB=8.796093022207999E12, noCFSRatio=0.3458239245610482
   [junit4]   2> 766597 INFO  (coreLoadExecutor-3029-thread-1) [    x:collection1] o.a.s.u.UpdateHandler Using UpdateLog implementation: org.apache.solr.update.UpdateLog
   [junit4]   2> 766597 INFO  (coreLoadExecutor-3029-thread-1) [    x:collection1] o.a.s.u.UpdateLog Initializing UpdateLog: dataDir= defaultSyncLevel=FLUSH numRecordsToKeep=100 maxNumLogsToKeep=10 numVersionBuckets=65536
   [junit4]   2> 766598 INFO  (coreLoadExecutor-3029-thread-1) [    x:collection1] o.a.s.u.CommitTracker Hard AutoCommit: disabled
   [junit4]   2> 766598 INFO  (coreLoadExecutor-3029-thread-1) [    x:collection1] o.a.s.u.CommitTracker Soft AutoCommit: disabled
   [junit4]   2> 766602 INFO  (coreLoadExecutor-3029-thread-1) [    x:collection1] o.a.s.u.RandomMergePolicy RandomMergePolicy wrapping class org.apache.lucene.index.TieredMergePolicy: [TieredMergePolicy: maxMergeAtOnce=41, maxMergeAtOnceExplicit=14, maxMergedSegmentMB=1.2158203125, floorSegmentMB=2.0849609375, forceMergeDeletesPctAllowed=1.4710171504630443, segmentsPerTier=23.0, maxCFSSegmentSizeMB=8.796093022207999E12, noCFSRatio=1.0
   [junit4]   2> 766603 INFO  (coreLoadExecutor-3029-thread-1) [    x:collection1] o.a.s.s.SolrIndexSearcher Opening [Searcher@4266fb69[collection1] main]
   [junit4]   2> 766611 INFO  (coreLoadExecutor-3029-thread-1) [    x:collection1] o.a.s.h.c.SpellCheckComponent Initializing spell checkers
   [junit4]   2> 766629 INFO  (coreLoadExecutor-3029-thread-1) [    x:collection1] o.a.s.s.DirectSolrSpellChecker init: {name=direct,classname=DirectSolrSpellChecker,field=lowerfilt,minQueryLength=3}
   [junit4]   2> 766701 INFO  (coreLoadExecutor-3029-thread-1) [    x:collection1] o.a.s.h.ReplicationHandler Commits will be reserved for  10000
   [junit4]   2> 766701 INFO  (searcherExecutor-3030-thread-1-processing-x:collection1) [    x:collection1] o.a.s.h.c.SpellCheckComponent Loading spell index for spellchecker: default
   [junit4]   2> 766702 INFO  (searcherExecutor-3030-thread-1-processing-x:collection1) [    x:collection1] o.a.s.h.c.SpellCheckComponent Loading spell index for spellchecker: direct
   [junit4]   2> 766702 INFO  (searcherExecutor-3030-thread-1-processing-x:collection1) [    x:collection1] o.a.s.h.c.SpellCheckComponent Loading spell index for spellchecker: wordbreak
   [junit4]   2> 766702 INFO  (searcherExecutor-3030-thread-1-processing-x:collection1) [    x:collection1] o.a.s.h.c.SpellCheckComponent Loading spell index for spellchecker: multipleFields
   [junit4]   2> 766702 INFO  (searcherExecutor-3030-thread-1-processing-x:collection1) [    x:collection1] o.a.s.h.c.SpellCheckComponent Loading spell index for spellchecker: jarowinkler
   [junit4]   2> 766703 INFO  (searcherExecutor-3030-thread-1-processing-x:collection1) [    x:collection1] o.a.s.h.c.SpellCheckComponent Loading spell index for spellchecker: external
   [junit4]   2> 766703 INFO  (coreLoadExecutor-3029-thread-1) [    x:collection1] o.a.s.u.UpdateLog Could not find max version in index or recent updates, using new clock 1558637351631060992
   [junit4]   2> 766703 INFO  (searcherExecutor-3030-thread-1-processing-x:collection1) [    x:collection1] o.a.s.h.c.SpellCheckComponent Loading spell index for spellchecker: freq
   [junit4]   2> 766714 INFO  (searcherExecutor-3030-thread-1-processing-x:collection1) [    x:collection1] o.a.s.h.c.SpellCheckComponent Loading spell index for spellchecker: fqcn
   [junit4]   2> 766717 INFO  (SUITE-MBeansHandlerTest-seed#[B6ACBFE4FDEFB4EB]-worker) [    ] o.a.s.SolrTestCaseJ4 ####initCore end
   [junit4]   2> 766724 INFO  (searcherExecutor-3030-thread-1-processing-x:collection1) [    x:collection1] o.a.s.h.c.SpellCheckComponent Loading spell index for spellchecker: perDict
   [junit4]   2> 766726 INFO  (TEST-MBeansHandlerTest.testXMLDiffWithExternalEntity-seed#[B6ACBFE4FDEFB4EB]) [    ] o.a.s.SolrTestCaseJ4 ###Starting testXMLDiffWithExternalEntity
   [junit4]   2> 766726 INFO  (searcherExecutor-3030-thread-1-processing-x:collection1) [    x:collection1] o.a.s.c.SolrCore [collection1] Registered new searcher Searcher@4266fb69[collection1] main{ExitableDirectoryReader(UninvertingDirectoryReader())}
   [junit4]   2> 766934 INFO  (TEST-MBeansHandlerTest.testXMLDiffWithExternalEntity-seed#[B6ACBFE4FDEFB4EB]) [    ] o.a.s.SolrTestCaseJ4 ###Ending testXMLDiffWithExternalEntity
   [junit4]   2> 766936 INFO  (TEST-MBeansHandlerTest.testBackCompatNames-seed#[B6ACBFE4FDEFB4EB]) [    ] o.a.s.SolrTestCaseJ4 ###Starting testBackCompatNames
   [junit4]   2> 766937 INFO  (TEST-MBeansHandlerTest.testBackCompatNames-seed#[B6ACBFE4FDEFB4EB]) [    ] o.a.s.c.S.Request [collection1]  webapp=null path=null params={qt=/admin/mbeans&wt=xml} status=0 QTime=1
   [junit4]   2> 766950 INFO  (TEST-MBeansHandlerTest.testBackCompatNames-seed#[B6ACBFE4FDEFB4EB]) [    ] o.a.s.c.S.Request [collection1]  webapp=null path=null params={qt=/admin/mbeans&cat=QUERYHANDLER&wt=xml} status=0 QTime=2
   [junit4]   2> 766951 INFO  (TEST-MBeansHandlerTest.testBackCompatNames-seed#[B6ACBFE4FDEFB4EB]) [    ] o.a.s.c.S.Request [collection1]  webapp=null path=null params={qt=/admin/mbeans&cat=UPDATE&wt=xml} status=0 QTime=0
   [junit4]   2> 766952 INFO  (TEST-MBeansHandlerTest.testBackCompatNames-seed#[B6ACBFE4FDEFB4EB]) [    ] o.a.s.SolrTestCaseJ4 ###Ending testBackCompatNames
   [junit4]   2> 766954 INFO  (TEST-MBeansHandlerTest.testDiff-seed#[B6ACBFE4FDEFB4EB]) [    ] o.a.s.SolrTestCaseJ4 ###Starting testDiff
   [junit4]   2> 766969 INFO  (TEST-MBeansHandlerTest.testDiff-seed#[B6ACBFE4FDEFB4EB]) [    ] o.a.s.c.S.Request [collection1]  webapp=null path=null params={qt=/admin/mbeans&stats=true&wt=xml} status=0 QTime=14
   [junit4]   2> 767033 INFO  (TEST-MBeansHandlerTest.testDiff-seed#[B6ACBFE4FDEFB4EB]) [    ] o.a.s.c.S.Request [collection1]  webapp=null path=null params={qt=/admin/mbeans&stats=true&diff=true&wt=xml} status=0 QTime=61
   [junit4]   2> 767035 INFO  (TEST-MBeansHandlerTest.testDiff-seed#[B6ACBFE4FDEFB4EB]) [    ] o.a.s.SolrTestCaseJ4 ###Ending testDiff
   [junit4]   2> NOTE: reproduce with: ant test  -Dtestcase=MBeansHandlerTest -Dtests.method=testDiff -Dtests.seed=B6ACBFE4FDEFB4EB -Dtests.slow=true -Dtests.locale=sr-BA -Dtests.timezone=America/Detroit -Dtests.asserts=true -Dtests.file.encoding=UTF-8
   [junit4] FAILURE 0.10s J1 | MBeansHandlerTest.testDiff <<<
   [junit4]    > Throwable #1: org.junit.ComparisonFailure: expected:<Was: [1, Now: 2], Delta: 1> but was:<Was: [4, Now: 5], Delta: 1>
   [junit4]    > 	at __randomizedtesting.SeedInfo.seed([B6ACBFE4FDEFB4EB:73BA7B7FED598C8B]:0)
   [junit4]    > 	at org.apache.solr.handler.admin.MBeansHandlerTest.testDiff(MBeansHandlerTest.java:63)
   [junit4]    > 	at java.lang.Thread.run(Thread.java:745)
   [junit4]   2> 767050 INFO  (SUITE-MBeansHandlerTest-seed#[B6ACBFE4FDEFB4EB]-worker) [    ] o.a.s.SolrTestCaseJ4 ###deleteCore
   [junit4]   2> 767050 INFO  (SUITE-MBeansHandlerTest-seed#[B6ACBFE4FDEFB4EB]-worker) [    ] o.a.s.c.CoreContainer Shutting down CoreContainer instance=993427093
   [junit4]   2> 767050 INFO  (coreCloseExecutor-3035-thread-1) [    x:collection1] o.a.s.c.SolrCore [collection1]  CLOSING SolrCore org.apache.solr.core.SolrCore@51a27111
   [junit4]   2> 767115 INFO  (coreCloseExecutor-3035-thread-1) [    x:collection1] o.a.s.m.SolrMetricManager Closing metric reporters for: solr.core.collection1
   [junit4]   2> 767121 INFO  (SUITE-MBeansHandlerTest-seed#[B6ACBFE4FDEFB4EB]-worker) [    ] o.a.s.m.SolrMetricManager Closing metric reporters for: solr.node
   [junit4]   2> NOTE: leaving temporary files on disk at: /Users/jenkins/workspace/Lucene-Solr-6.x-MacOSX/solr/build/solr-core/test/J1/temp/solr.handler.admin.MBeansHandlerTest_B6ACBFE4FDEFB4EB-001
   [junit4]   2> NOTE: test params are: codec=Asserting(Lucene62): {}, docValues:{}, maxPointsInLeafNode=1933, maxMBSortInHeap=7.024146515678725, sim=RandomSimilarity(queryNorm=false,coord=yes): {}, locale=sr-BA, timezone=America/Detroit
   [junit4]   2> NOTE: Mac OS X 10.11.6 x86_64/Oracle Corporation 1.8.0_121 (64-bit)/cpus=3,threads=1,free=164199944,total=348651520
   [junit4]   2> NOTE: All tests run in this JVM: [RollingRestartTest, HttpPartitionTest, TestRequestForwarding, TestSolrDeletionPolicy2, TestFieldCacheSort, DistributedFacetPivotSmallAdvancedTest, HdfsCollectionsAPIDistributedZkTest, CdcrUpdateLogTest, TestMiniSolrCloudClusterSSL, TestSolrConfigHandlerConcurrent, CdcrRequestHandlerTest, DistributedFacetPivotWhiteBoxTest, HighlighterMaxOffsetTest, SolrGraphiteReporterTest, DateMathParserTest, URLClassifyProcessorTest, BasicAuthIntegrationTest, RequestHandlersTest, TestJsonRequest, TestCollationFieldDocValues, ReplicationFactorTest, TestFieldResource, DocExpirationUpdateProcessorFactoryTest, SolrMetricManagerTest, TestQuerySenderListener, TestRandomFaceting, TestDistributedMissingSort, SimpleMLTQParserTest, TestSolrFieldCacheMBean, BlockJoinFacetSimpleTest, TestDocSet, TestSystemIdResolver, TestUseDocValuesAsStored, TestChildDocTransformer, TestDocTermOrds, TestRuleBasedAuthorizationPlugin, ResourceLoaderTest, TestConfigSetsAPI, TestReRankQParserPlugin, TestReloadDeadlock, TestReplicationHandlerBackup, TestJsonFacetRefinement, TestStressUserVersions, HdfsUnloadDistributedZkTest, TestUniqueKeyFieldResource, TestInitQParser, SecurityConfHandlerTest, TestFieldCacheReopen, BadIndexSchemaTest, JSONWriterTest, SuggestComponentTest, TestRestManager, TestJmxMonitoredMap, TestSlowCompositeReaderWrapper, UpdateRequestProcessorFactoryTest, CoreAdminRequestStatusTest, TestFileDictionaryLookup, TestFoldingMultitermQuery, TestSimpleQParserPlugin, OverseerModifyCollectionTest, TestConfigReload, TestDynamicFieldResource, ActionThrottleTest, SliceStateTest, CoreAdminHandlerTest, InfoHandlerTest, SolrCloudExampleTest, TestReversedWildcardFilterFactory, LeaderInitiatedRecoveryOnCommitTest, ConvertedLegacyTest, AddBlockUpdateTest, TestCodecSupport, CopyFieldTest, TestSolrDynamicMBean, TestConfigSetProperties, TestDistribIDF, TestDownShardTolerantSearch, TestComplexPhraseQParserPlugin, TestAtomicUpdateErrorCases, JvmMetricsTest, TestLMJelinekMercerSimilarityFactory, DefaultValueUpdateProcessorTest, AssignTest, ClassificationUpdateProcessorFactoryTest, TestBinaryResponseWriter, LukeRequestHandlerTest, TestSchemaResource, WordBreakSolrSpellCheckerTest, ResponseHeaderTest, TestSchemaVersionResource, TestCoreDiscovery, DeleteStatusTest, TestFuzzyAnalyzedSuggestions, DistributedIntervalFacetingTest, PreAnalyzedFieldTest, SolrSlf4jReporterTest, FieldMutatingUpdateProcessorTest, ConcurrentDeleteAndCreateCollectionTest, TestAddFieldRealTimeGet, TestQueryTypes, IndexSchemaTest, TriLevelCompositeIdRoutingTest, UpdateParamsTest, ShowFileRequestHandlerTest, StatsComponentTest, HighlighterConfigTest, SimpleCollectionCreateDeleteTest, TestSQLHandlerNonCloud, TestConfigSetsAPIZkFailure, BaseCdcrDistributedZkTest, V2ApiIntegrationTest, TestMinMaxOnMultiValuedField, TestClusterProperties, HdfsThreadLeakTest, MBeansHandlerTest]
   [junit4] Completed [208/690 (1!)] on J1 in 1.78s, 3 tests, 1 failure <<< FAILURES!

[...truncated 274 lines...]
   [junit4] Suite: org.apache.solr.cloud.CustomCollectionTest
   [junit4]   2> Creating dataDir: /Users/jenkins/workspace/Lucene-Solr-6.x-MacOSX/solr/build/solr-core/test/J1/temp/solr.cloud.CustomCollectionTest_B6ACBFE4FDEFB4EB-001/init-core-data-001
   [junit4]   2> 1092778 INFO  (SUITE-CustomCollectionTest-seed#[B6ACBFE4FDEFB4EB]-worker) [    ] o.a.s.SolrTestCaseJ4 Randomized ssl (true) and clientAuth (false) via: @org.apache.solr.util.RandomizeSSL(reason=, value=NaN, ssl=NaN, clientAuth=NaN) w/ MAC_OS_X supressed clientAuth
   [junit4]   2> 1092779 INFO  (SUITE-CustomCollectionTest-seed#[B6ACBFE4FDEFB4EB]-worker) [    ] o.a.s.c.MiniSolrCloudCluster Starting cluster of 4 servers in /Users/jenkins/workspace/Lucene-Solr-6.x-MacOSX/solr/build/solr-core/test/J1/temp/solr.cloud.CustomCollectionTest_B6ACBFE4FDEFB4EB-001/tempDir-001
   [junit4]   2> 1092779 INFO  (SUITE-CustomCollectionTest-seed#[B6ACBFE4FDEFB4EB]-worker) [    ] o.a.s.c.ZkTestServer STARTING ZK TEST SERVER
   [junit4]   2> 1092780 INFO  (Thread-1956) [    ] o.a.s.c.ZkTestServer client port:0.0.0.0/0.0.0.0:0
   [junit4]   2> 1092780 INFO  (Thread-1956) [    ] o.a.s.c.ZkTestServer Starting server
   [junit4]   2> 1092882 INFO  (SUITE-CustomCollectionTest-seed#[B6ACBFE4FDEFB4EB]-worker) [    ] o.a.s.c.ZkTestServer start zk server on port:50292
   [junit4]   2> 1092939 INFO  (jetty-launcher-1564-thread-2) [    ] o.e.j.s.Server jetty-9.3.14.v20161028
   [junit4]   2> 1092940 INFO  (jetty-launcher-1564-thread-3) [    ] o.e.j.s.Server jetty-9.3.14.v20161028
   [junit4]   2> 1092940 INFO  (jetty-launcher-1564-thread-1) [    ] o.e.j.s.Server jetty-9.3.14.v20161028
   [junit4]   2> 1092939 INFO  (jetty-launcher-1564-thread-4) [    ] o.e.j.s.Server jetty-9.3.14.v20161028
   [junit4]   2> 1092947 INFO  (jetty-launcher-1564-thread-1) [    ] o.e.j.s.h.ContextHandler Started o.e.j.s.ServletContextHandler@7d262e11{/solr,null,AVAILABLE}
   [junit4]   2> 1092947 INFO  (jetty-launcher-1564-thread-3) [    ] o.e.j.s.h.ContextHandler Started o.e.j.s.ServletContextHandler@3419ffc5{/solr,null,AVAILABLE}
   [junit4]   2> 1092948 INFO  (jetty-launcher-1564-thread-2) [    ] o.e.j.s.h.ContextHandler Started o.e.j.s.ServletContextHandler@1a02c9ea{/solr,null,AVAILABLE}
   [junit4]   2> 1092948 INFO  (jetty-launcher-1564-thread-2) [    ] o.e.j.s.AbstractConnector Started ServerConnector@56876eb3{SSL,[ssl, http/1.1]}{127.0.0.1:50296}
   [junit4]   2> 1092948 INFO  (jetty-launcher-1564-thread-2) [    ] o.e.j.s.Server Started @1098031ms
   [junit4]   2> 1092949 INFO  (jetty-launcher-1564-thread-2) [    ] o.a.s.c.s.e.JettySolrRunner Jetty properties: {hostContext=/solr, hostPort=50296}
   [junit4]   2> 1092949 ERROR (jetty-launcher-1564-thread-2) [    ] o.a.s.s.StartupLoggingUtils Missing Java Option solr.log.dir. Logging may be missing or incomplete.
   [junit4]   2> 1092949 INFO  (jetty-launcher-1564-thread-3) [    ] o.e.j.s.AbstractConnector Started ServerConnector@5efe27d1{SSL,[ssl, http/1.1]}{127.0.0.1:50295}
   [junit4]   2> 1092949 INFO  (jetty-launcher-1564-thread-1) [    ] o.e.j.s.AbstractConnector Started ServerConnector@290089df{SSL,[ssl, http/1.1]}{127.0.0.1:50294}
   [junit4]   2> 1092949 INFO  (jetty-launcher-1564-thread-3) [    ] o.e.j.s.Server Started @1098032ms
   [junit4]   2> 1092950 INFO  (jetty-launcher-1564-thread-1) [    ] o.e.j.s.Server Started @1098032ms
   [junit4]   2> 1092950 INFO  (jetty-launcher-1564-thread-3) [    ] o.a.s.c.s.e.JettySolrRunner Jetty properties: {hostContext=/solr, hostPort=50295}
   [junit4]   2> 1092950 INFO  (jetty-launcher-1564-thread-1) [    ] o.a.s.c.s.e.JettySolrRunner Jetty properties: {hostContext=/solr, hostPort=50294}
   [junit4]   2> 1092950 ERROR (jetty-launcher-1564-thread-3) [    ] o.a.s.s.StartupLoggingUtils Missing Java Option solr.log.dir. Logging may be missing or incomplete.
   [junit4]   2> 1092950 ERROR (jetty-launcher-1564-thread-1) [    ] o.a.s.s.StartupLoggingUtils Missing Java Option solr.log.dir. Logging may be missing or incomplete.
   [junit4]   2> 1092950 INFO  (jetty-launcher-1564-thread-2) [    ] o.a.s.s.SolrDispatchFilter  ___      _       Welcome to Apache Solr™ version 6.5.0
   [junit4]   2> 1092950 INFO  (jetty-launcher-1564-thread-2) [    ] o.a.s.s.SolrDispatchFilter / __| ___| |_ _   Starting in cloud mode on port null
   [junit4]   2> 1092950 INFO  (jetty-launcher-1564-thread-2) [    ] o.a.s.s.SolrDispatchFilter \__ \/ _ \ | '_|  Install dir: null
   [junit4]   2> 1092950 INFO  (jetty-launcher-1564-thread-2) [    ] o.a.s.s.SolrDispatchFilter |___/\___/_|_|    Start time: 2017-02-07T01:58:57.089Z
   [junit4]   2> 1092949 INFO  (jetty-launcher-1564-thread-4) [    ] o.e.j.s.h.ContextHandler Started o.e.j.s.ServletContextHandler@2b135274{/solr,null,AVAILABLE}
   [junit4]   2> 1092951 INFO  (jetty-launcher-1564-thread-3) [    ] o.a.s.s.SolrDispatchFilter  ___      _       Welcome to Apache Solr™ version 6.5.0
   [junit4]   2> 1092951 INFO  (jetty-launcher-1564-thread-3) [    ] o.a.s.s.SolrDispatchFilter / __| ___| |_ _   Starting in cloud mode on port null
   [junit4]   2> 1092951 INFO  (jetty-launcher-1564-thread-3) [    ] o.a.s.s.SolrDispatchFilter \__ \/ _ \ | '_|  Install dir: null
   [junit4]   2> 1092951 INFO  (jetty-launcher-1564-thread-3) [    ] o.a.s.s.SolrDispatchFilter |___/\___/_|_|    Start time: 2017-02-07T01:58:57.090Z
   [junit4]   2> 1092952 INFO  (jetty-launcher-1564-thread-1) [    ] o.a.s.s.SolrDispatchFilter  ___      _       Welcome to Apache Solr™ version 6.5.0
   [junit4]   2> 1092952 INFO  (jetty-launcher-1564-thread-1) [    ] o.a.s.s.SolrDispatchFilter / __| ___| |_ _   Starting in cloud mode on port null
   [junit4]   2> 1092952 INFO  (jetty-launcher-1564-thread-1) [    ] o.a.s.s.SolrDispatchFilter \__ \/ _ \ | '_|  Install dir: null
   [junit4]   2> 1092952 INFO  (jetty-launcher-1564-thread-1) [    ] o.a.s.s.SolrDispatchFilter |___/\___/_|_|    Start time: 2017-02-07T01:58:57.091Z
   [junit4]   2> 1092956 INFO  (jetty-launcher-1564-thread-4) [    ] o.e.j.s.AbstractConnector Started ServerConnector@3f38d865{SSL,[ssl, http/1.1]}{127.0.0.1:50297}
   [junit4]   2> 1092956 INFO  (jetty-launcher-1564-thread-4) [    ] o.e.j.s.Server Started @1098039ms
   [junit4]   2> 1092956 INFO  (jetty-launcher-1564-thread-4) [    ] o.a.s.c.s.e.JettySolrRunner Jetty properties: {hostContext=/solr, hostPort=50297}
   [junit4]   2> 1092957 ERROR (jetty-launcher-1564-thread-4) [    ] o.a.s.s.StartupLoggingUtils Missing Java Option solr.log.dir. Logging may be missing or incomplete.
   [junit4]   2> 1092957 INFO  (jetty-launcher-1564-thread-4) [    ] o.a.s.s.SolrDispatchFilter  ___      _       Welcome to Apache Solr™ version 6.5.0
   [junit4]   2> 1092957 INFO  (jetty-launcher-1564-thread-4) [    ] o.a.s.s.SolrDispatchFilter / __| ___| |_ _   Starting in cloud mode on port null
   [junit4]   2> 1092957 INFO  (jetty-launcher-1564-thread-4) [    ] o.a.s.s.SolrDispatchFilter \__ \/ _ \ | '_|  Install dir: null
   [junit4]   2> 1092957 INFO  (jetty-launcher-1564-thread-4) [    ] o.a.s.s.SolrDispatchFilter |___/\___/_|_|    Start time: 2017-02-07T01:58:57.096Z
   [junit4]   2> 1092961 INFO  (jetty-launcher-1564-thread-2) [    ] o.a.s.s.SolrDispatchFilter solr.xml found in ZooKeeper. Loading...
   [junit4]   2> 1092962 INFO  (jetty-launcher-1564-thread-3) [    ] o.a.s.s.SolrDispatchFilter solr.xml found in ZooKeeper. Loading...
   [junit4]   2> 1092963 INFO  (jetty-launcher-1564-thread-1) [    ] o.a.s.s.SolrDispatchFilter solr.xml found in ZooKeeper. Loading...
   [junit4]   2> 1092963 INFO  (jetty-launcher-1564-thread-4) [    ] o.a.s.s.SolrDispatchFilter solr.xml found in ZooKeeper. Loading...
   [junit4]   2> 1093019 INFO  (jetty-launcher-1564-thread-4) [    ] o.a.s.u.UpdateShardHandler Creating UpdateShardHandler HTTP client with params: socketTimeout=340000&connTimeout=45000&retry=true
   [junit4]   2> 1093019 INFO  (jetty-launcher-1564-thread-3) [    ] o.a.s.u.UpdateShardHandler Creating UpdateShardHandler HTTP client with params: socketTimeout=340000&connTimeout=45000&retry=true
   [junit4]   2> 1093019 INFO  (jetty-launcher-1564-thread-4) [    ] o.a.s.c.ZkContainer Zookeeper client=127.0.0.1:50292/solr
   [junit4]   2> 1093020 INFO  (jetty-launcher-1564-thread-1) [    ] o.a.s.u.UpdateShardHandler Creating UpdateShardHandler HTTP client with params: socketTimeout=340000&connTimeout=45000&retry=true
   [junit4]   2> 1093020 INFO  (jetty-launcher-1564-thread-2) [    ] o.a.s.u.UpdateShardHandler Creating UpdateShardHandler HTTP client with params: socketTimeout=340000&connTimeout=45000&retry=true
   [junit4]   2> 1093022 INFO  (jetty-launcher-1564-thread-3) [    ] o.a.s.c.Z

[...truncated too long message...]

 [junit4]    >         at org.eclipse.jetty.util.BlockingArrayQueue.poll(BlockingArrayQueue.java:392)
   [junit4]    >         at org.eclipse.jetty.util.thread.QueuedThreadPool.idleJobPoll(QueuedThreadPool.java:563)
   [junit4]    >         at org.eclipse.jetty.util.thread.QueuedThreadPool.access$800(QueuedThreadPool.java:48)
   [junit4]    >         at org.eclipse.jetty.util.thread.QueuedThreadPool$2.run(QueuedThreadPool.java:626)
   [junit4]    >         at java.lang.Thread.run(Thread.java:745)
   [junit4]    >   13) Thread[id=17335, name=jetty-launcher-3050-thread-1, state=TIMED_WAITING, group=TGRP-TestExclusionRuleCollectionAccess]
   [junit4]    >         at sun.misc.Unsafe.park(Native Method)
   [junit4]    >         at java.util.concurrent.locks.LockSupport.parkNanos(LockSupport.java:215)
   [junit4]    >         at java.util.concurrent.SynchronousQueue$TransferStack.awaitFulfill(SynchronousQueue.java:460)
   [junit4]    >         at java.util.concurrent.SynchronousQueue$TransferStack.transfer(SynchronousQueue.java:362)
   [junit4]    >         at java.util.concurrent.SynchronousQueue.poll(SynchronousQueue.java:941)
   [junit4]    >         at java.util.concurrent.ThreadPoolExecutor.getTask(ThreadPoolExecutor.java:1066)
   [junit4]    >         at java.util.concurrent.ThreadPoolExecutor.runWorker(ThreadPoolExecutor.java:1127)
   [junit4]    >         at java.util.concurrent.ThreadPoolExecutor$Worker.run(ThreadPoolExecutor.java:617)
   [junit4]    >         at java.lang.Thread.run(Thread.java:745)
   [junit4]    >   14) Thread[id=17344, name=Scheduler-193165185, state=TIMED_WAITING, group=TGRP-TestExclusionRuleCollectionAccess]
   [junit4]    >         at sun.misc.Unsafe.park(Native Method)
   [junit4]    >         at java.util.concurrent.locks.LockSupport.parkNanos(LockSupport.java:215)
   [junit4]    >         at java.util.concurrent.locks.AbstractQueuedSynchronizer$ConditionObject.awaitNanos(AbstractQueuedSynchronizer.java:2078)
   [junit4]    >         at java.util.concurrent.ScheduledThreadPoolExecutor$DelayedWorkQueue.take(ScheduledThreadPoolExecutor.java:1093)
   [junit4]    >         at java.util.concurrent.ScheduledThreadPoolExecutor$DelayedWorkQueue.take(ScheduledThreadPoolExecutor.java:809)
   [junit4]    >         at java.util.concurrent.ThreadPoolExecutor.getTask(ThreadPoolExecutor.java:1067)
   [junit4]    >         at java.util.concurrent.ThreadPoolExecutor.runWorker(ThreadPoolExecutor.java:1127)
   [junit4]    >         at java.util.concurrent.ThreadPoolExecutor$Worker.run(ThreadPoolExecutor.java:617)
   [junit4]    >         at java.lang.Thread.run(Thread.java:745)
   [junit4]    >   15) Thread[id=17339, name=qtp434428245-17339, state=TIMED_WAITING, group=TGRP-TestExclusionRuleCollectionAccess]
   [junit4]    >         at sun.misc.Unsafe.park(Native Method)
   [junit4]    >         at java.util.concurrent.locks.LockSupport.parkNanos(LockSupport.java:215)
   [junit4]    >         at java.util.concurrent.locks.AbstractQueuedSynchronizer$ConditionObject.awaitNanos(AbstractQueuedSynchronizer.java:2078)
   [junit4]    >         at org.eclipse.jetty.util.BlockingArrayQueue.poll(BlockingArrayQueue.java:392)
   [junit4]    >         at org.eclipse.jetty.util.thread.QueuedThreadPool.idleJobPoll(QueuedThreadPool.java:563)
   [junit4]    >         at org.eclipse.jetty.util.thread.QueuedThreadPool.access$800(QueuedThreadPool.java:48)
   [junit4]    >         at org.eclipse.jetty.util.thread.QueuedThreadPool$2.run(QueuedThreadPool.java:626)
   [junit4]    >         at java.lang.Thread.run(Thread.java:745)
   [junit4]    > 	at __randomizedtesting.SeedInfo.seed([B6ACBFE4FDEFB4EB]:0)Throwable #3: com.carrotsearch.randomizedtesting.ThreadLeakError: There are still zombie threads that couldn't be terminated:
   [junit4]    >    1) Thread[id=17328, name=NIOServerCxn.Factory:0.0.0.0/0.0.0.0:0, state=RUNNABLE, group=TGRP-TestExclusionRuleCollectionAccess]
   [junit4]    >         at sun.nio.ch.KQueueArrayWrapper.interrupt(Native Method)
   [junit4]    >         at sun.nio.ch.KQueueArrayWrapper.interrupt(KQueueArrayWrapper.java:203)
   [junit4]    >         at sun.nio.ch.KQueueSelectorImpl.wakeup(KQueueSelectorImpl.java:257)
   [junit4]    >         at java.nio.channels.spi.AbstractSelector$1.interrupt(AbstractSelector.java:213)
   [junit4]    >         at java.nio.channels.spi.AbstractSelector.begin(AbstractSelector.java:219)
   [junit4]    >         at sun.nio.ch.KQueueSelectorImpl.doSelect(KQueueSelectorImpl.java:116)
   [junit4]    >         at sun.nio.ch.SelectorImpl.lockAndDoSelect(SelectorImpl.java:86)
   [junit4]    >         at sun.nio.ch.SelectorImpl.select(SelectorImpl.java:97)
   [junit4]    >         at org.apache.zookeeper.server.NIOServerCnxnFactory.run(NIOServerCnxnFactory.java:178)
   [junit4]    >         at java.lang.Thread.run(Thread.java:745)
   [junit4]    >    2) Thread[id=17345, name=org.eclipse.jetty.server.session.HashSessionManager@14c50734Timer, state=TIMED_WAITING, group=TGRP-TestExclusionRuleCollectionAccess]
   [junit4]    >         at sun.misc.Unsafe.park(Native Method)
   [junit4]    >         at java.util.concurrent.locks.LockSupport.parkNanos(LockSupport.java:215)
   [junit4]    >         at java.util.concurrent.locks.AbstractQueuedSynchronizer$ConditionObject.awaitNanos(AbstractQueuedSynchronizer.java:2078)
   [junit4]    >         at java.util.concurrent.ScheduledThreadPoolExecutor$DelayedWorkQueue.take(ScheduledThreadPoolExecutor.java:1093)
   [junit4]    >         at java.util.concurrent.ScheduledThreadPoolExecutor$DelayedWorkQueue.take(ScheduledThreadPoolExecutor.java:809)
   [junit4]    >         at java.util.concurrent.ThreadPoolExecutor.getTask(ThreadPoolExecutor.java:1067)
   [junit4]    >         at java.util.concurrent.ThreadPoolExecutor.runWorker(ThreadPoolExecutor.java:1127)
   [junit4]    >         at java.util.concurrent.ThreadPoolExecutor$Worker.run(ThreadPoolExecutor.java:617)
   [junit4]    >         at java.lang.Thread.run(Thread.java:745)
   [junit4]    >    3) Thread[id=17336, name=qtp434428245-17336, state=RUNNABLE, group=TGRP-TestExclusionRuleCollectionAccess]
   [junit4]    >         at sun.nio.ch.IOUtil.drain(Native Method)
   [junit4]    >         at sun.nio.ch.KQueueSelectorImpl.updateSelectedKeys(KQueueSelectorImpl.java:181)
   [junit4]    >         at sun.nio.ch.KQueueSelectorImpl.doSelect(KQueueSelectorImpl.java:122)
   [junit4]    >         at sun.nio.ch.SelectorImpl.lockAndDoSelect(SelectorImpl.java:86)
   [junit4]    >         at sun.nio.ch.SelectorImpl.select(SelectorImpl.java:97)
   [junit4]    >         at sun.nio.ch.SelectorImpl.select(SelectorImpl.java:101)
   [junit4]    >         at org.eclipse.jetty.io.ManagedSelector$SelectorProducer.select(ManagedSelector.java:243)
   [junit4]    >         at org.eclipse.jetty.io.ManagedSelector$SelectorProducer.produce(ManagedSelector.java:191)
   [junit4]    >         at org.eclipse.jetty.util.thread.strategy.ExecuteProduceConsume.executeProduceConsume(ExecuteProduceConsume.java:249)
   [junit4]    >         at org.eclipse.jetty.util.thread.strategy.ExecuteProduceConsume.produceConsume(ExecuteProduceConsume.java:148)
   [junit4]    >         at org.eclipse.jetty.util.thread.strategy.ExecuteProduceConsume.execute(ExecuteProduceConsume.java:100)
   [junit4]    >         at org.eclipse.jetty.io.ManagedSelector.run(ManagedSelector.java:147)
   [junit4]    >         at org.eclipse.jetty.util.thread.QueuedThreadPool.runJob(QueuedThreadPool.java:671)
   [junit4]    >         at org.eclipse.jetty.util.thread.QueuedThreadPool$2.run(QueuedThreadPool.java:589)
   [junit4]    >         at java.lang.Thread.run(Thread.java:745)
   [junit4]    >    4) Thread[id=17335, name=jetty-launcher-3050-thread-1, state=TIMED_WAITING, group=TGRP-TestExclusionRuleCollectionAccess]
   [junit4]    >         at sun.misc.Unsafe.park(Native Method)
   [junit4]    >         at java.util.concurrent.locks.LockSupport.parkNanos(LockSupport.java:215)
   [junit4]    >         at java.util.concurrent.SynchronousQueue$TransferStack.awaitFulfill(SynchronousQueue.java:460)
   [junit4]    >         at java.util.concurrent.SynchronousQueue$TransferStack.transfer(SynchronousQueue.java:362)
   [junit4]    >         at java.util.concurrent.SynchronousQueue.poll(SynchronousQueue.java:941)
   [junit4]    >         at java.util.concurrent.ThreadPoolExecutor.getTask(ThreadPoolExecutor.java:1066)
   [junit4]    >         at java.util.concurrent.ThreadPoolExecutor.runWorker(ThreadPoolExecutor.java:1127)
   [junit4]    >         at java.util.concurrent.ThreadPoolExecutor$Worker.run(ThreadPoolExecutor.java:617)
   [junit4]    >         at java.lang.Thread.run(Thread.java:745)
   [junit4]    >    5) Thread[id=17344, name=Scheduler-193165185, state=TIMED_WAITING, group=TGRP-TestExclusionRuleCollectionAccess]
   [junit4]    >         at sun.misc.Unsafe.park(Native Method)
   [junit4]    >         at java.util.concurrent.locks.LockSupport.parkNanos(LockSupport.java:215)
   [junit4]    >         at java.util.concurrent.locks.AbstractQueuedSynchronizer$ConditionObject.awaitNanos(AbstractQueuedSynchronizer.java:2078)
   [junit4]    >         at java.util.concurrent.ScheduledThreadPoolExecutor$DelayedWorkQueue.take(ScheduledThreadPoolExecutor.java:1093)
   [junit4]    >         at java.util.concurrent.ScheduledThreadPoolExecutor$DelayedWorkQueue.take(ScheduledThreadPoolExecutor.java:809)
   [junit4]    >         at java.util.concurrent.ThreadPoolExecutor.getTask(ThreadPoolExecutor.java:1067)
   [junit4]    >         at java.util.concurrent.ThreadPoolExecutor.runWorker(ThreadPoolExecutor.java:1127)
   [junit4]    >         at java.util.concurrent.ThreadPoolExecutor$Worker.run(ThreadPoolExecutor.java:617)
   [junit4]    >         at java.lang.Thread.run(Thread.java:745)
   [junit4]    > 	at __randomizedtesting.SeedInfo.seed([B6ACBFE4FDEFB4EB]:0)
   [junit4] Completed [525/690 (6!)] on J1 in 23.50s, 0 tests, 3 errors <<< FAILURES!

[...truncated 63037 lines...]


Mime
View raw message