lucene-dev mailing list archives

Site index · List index
Message view « Date » · « Thread »
Top « Date » · « Thread »
From Policeman Jenkins Server <jenk...@thetaphi.de>
Subject [JENKINS-EA] Lucene-Solr-master-Linux (64bit/jdk-9-ea+153) - Build # 18893 - Still Unstable!
Date Thu, 02 Feb 2017 23:47:09 GMT
Build: https://jenkins.thetaphi.de/job/Lucene-Solr-master-Linux/18893/
Java: 64bit/jdk-9-ea+153 -XX:+UseCompressedOops -XX:+UseParallelGC

3 tests failed.
FAILED:  org.apache.solr.cloud.PeerSyncReplicationTest.test

Error Message:
expected:<152> but was:<141>

Stack Trace:
java.lang.AssertionError: expected:<152> but was:<141>
	at __randomizedtesting.SeedInfo.seed([8E9D7E33840CEF05:6C941E92AF082FD]:0)
	at org.junit.Assert.fail(Assert.java:93)
	at org.junit.Assert.failNotEquals(Assert.java:647)
	at org.junit.Assert.assertEquals(Assert.java:128)
	at org.junit.Assert.assertEquals(Assert.java:472)
	at org.junit.Assert.assertEquals(Assert.java:456)
	at org.apache.solr.cloud.PeerSyncReplicationTest.bringUpDeadNodeAndEnsureNoReplication(PeerSyncReplicationTest.java:286)
	at org.apache.solr.cloud.PeerSyncReplicationTest.forceNodeFailureAndDoPeerSync(PeerSyncReplicationTest.java:259)
	at org.apache.solr.cloud.PeerSyncReplicationTest.test(PeerSyncReplicationTest.java:138)
	at java.base/jdk.internal.reflect.NativeMethodAccessorImpl.invoke0(Native Method)
	at java.base/jdk.internal.reflect.NativeMethodAccessorImpl.invoke(NativeMethodAccessorImpl.java:62)
	at java.base/jdk.internal.reflect.DelegatingMethodAccessorImpl.invoke(DelegatingMethodAccessorImpl.java:43)
	at java.base/java.lang.reflect.Method.invoke(Method.java:543)
	at com.carrotsearch.randomizedtesting.RandomizedRunner.invoke(RandomizedRunner.java:1713)
	at com.carrotsearch.randomizedtesting.RandomizedRunner$8.evaluate(RandomizedRunner.java:907)
	at com.carrotsearch.randomizedtesting.RandomizedRunner$9.evaluate(RandomizedRunner.java:943)
	at com.carrotsearch.randomizedtesting.RandomizedRunner$10.evaluate(RandomizedRunner.java:957)
	at org.apache.solr.BaseDistributedSearchTestCase$ShardsRepeatRule$ShardsFixedStatement.callStatement(BaseDistributedSearchTestCase.java:985)
	at org.apache.solr.BaseDistributedSearchTestCase$ShardsRepeatRule$ShardsStatement.evaluate(BaseDistributedSearchTestCase.java:960)
	at com.carrotsearch.randomizedtesting.rules.SystemPropertiesRestoreRule$1.evaluate(SystemPropertiesRestoreRule.java:57)
	at org.apache.lucene.util.TestRuleSetupTeardownChained$1.evaluate(TestRuleSetupTeardownChained.java:49)
	at org.apache.lucene.util.AbstractBeforeAfterRule$1.evaluate(AbstractBeforeAfterRule.java:45)
	at org.apache.lucene.util.TestRuleThreadAndTestName$1.evaluate(TestRuleThreadAndTestName.java:48)
	at org.apache.lucene.util.TestRuleIgnoreAfterMaxFailures$1.evaluate(TestRuleIgnoreAfterMaxFailures.java:64)
	at org.apache.lucene.util.TestRuleMarkFailure$1.evaluate(TestRuleMarkFailure.java:47)
	at com.carrotsearch.randomizedtesting.rules.StatementAdapter.evaluate(StatementAdapter.java:36)
	at com.carrotsearch.randomizedtesting.ThreadLeakControl$StatementRunner.run(ThreadLeakControl.java:368)
	at com.carrotsearch.randomizedtesting.ThreadLeakControl.forkTimeoutingTask(ThreadLeakControl.java:817)
	at com.carrotsearch.randomizedtesting.ThreadLeakControl$3.evaluate(ThreadLeakControl.java:468)
	at com.carrotsearch.randomizedtesting.RandomizedRunner.runSingleTest(RandomizedRunner.java:916)
	at com.carrotsearch.randomizedtesting.RandomizedRunner$5.evaluate(RandomizedRunner.java:802)
	at com.carrotsearch.randomizedtesting.RandomizedRunner$6.evaluate(RandomizedRunner.java:852)
	at com.carrotsearch.randomizedtesting.RandomizedRunner$7.evaluate(RandomizedRunner.java:863)
	at com.carrotsearch.randomizedtesting.rules.StatementAdapter.evaluate(StatementAdapter.java:36)
	at com.carrotsearch.randomizedtesting.rules.SystemPropertiesRestoreRule$1.evaluate(SystemPropertiesRestoreRule.java:57)
	at org.apache.lucene.util.AbstractBeforeAfterRule$1.evaluate(AbstractBeforeAfterRule.java:45)
	at com.carrotsearch.randomizedtesting.rules.StatementAdapter.evaluate(StatementAdapter.java:36)
	at org.apache.lucene.util.TestRuleStoreClassName$1.evaluate(TestRuleStoreClassName.java:41)
	at com.carrotsearch.randomizedtesting.rules.NoShadowingOrOverridesOnMethodsRule$1.evaluate(NoShadowingOrOverridesOnMethodsRule.java:40)
	at com.carrotsearch.randomizedtesting.rules.NoShadowingOrOverridesOnMethodsRule$1.evaluate(NoShadowingOrOverridesOnMethodsRule.java:40)
	at com.carrotsearch.randomizedtesting.rules.StatementAdapter.evaluate(StatementAdapter.java:36)
	at com.carrotsearch.randomizedtesting.rules.StatementAdapter.evaluate(StatementAdapter.java:36)
	at org.apache.lucene.util.TestRuleAssertionsRequired$1.evaluate(TestRuleAssertionsRequired.java:53)
	at org.apache.lucene.util.TestRuleMarkFailure$1.evaluate(TestRuleMarkFailure.java:47)
	at org.apache.lucene.util.TestRuleIgnoreAfterMaxFailures$1.evaluate(TestRuleIgnoreAfterMaxFailures.java:64)
	at org.apache.lucene.util.TestRuleIgnoreTestSuites$1.evaluate(TestRuleIgnoreTestSuites.java:54)
	at com.carrotsearch.randomizedtesting.rules.StatementAdapter.evaluate(StatementAdapter.java:36)
	at com.carrotsearch.randomizedtesting.ThreadLeakControl$StatementRunner.run(ThreadLeakControl.java:368)
	at java.base/java.lang.Thread.run(Thread.java:844)


FAILED:  org.apache.solr.handler.admin.TestApiFramework.testFramework

Error Message:


Stack Trace:
java.lang.ExceptionInInitializerError
	at __randomizedtesting.SeedInfo.seed([8E9D7E33840CEF05:99EBB41482D80338]:0)
	at net.sf.cglib.core.KeyFactory$Generator.generateClass(KeyFactory.java:166)
	at net.sf.cglib.core.DefaultGeneratorStrategy.generate(DefaultGeneratorStrategy.java:25)
	at net.sf.cglib.core.AbstractClassGenerator.create(AbstractClassGenerator.java:216)
	at net.sf.cglib.core.KeyFactory$Generator.create(KeyFactory.java:144)
	at net.sf.cglib.core.KeyFactory.create(KeyFactory.java:116)
	at net.sf.cglib.core.KeyFactory.create(KeyFactory.java:108)
	at net.sf.cglib.core.KeyFactory.create(KeyFactory.java:104)
	at net.sf.cglib.proxy.Enhancer.<clinit>(Enhancer.java:69)
	at org.easymock.internal.ClassProxyFactory.createEnhancer(ClassProxyFactory.java:259)
	at org.easymock.internal.ClassProxyFactory.createProxy(ClassProxyFactory.java:174)
	at org.easymock.internal.MocksControl.createMock(MocksControl.java:60)
	at org.easymock.EasyMock.createMock(EasyMock.java:104)
	at org.apache.solr.handler.admin.TestCoreAdminApis.getCoreContainerMock(TestCoreAdminApis.java:76)
	at org.apache.solr.handler.admin.TestApiFramework.testFramework(TestApiFramework.java:59)
	at java.base/jdk.internal.reflect.NativeMethodAccessorImpl.invoke0(Native Method)
	at java.base/jdk.internal.reflect.NativeMethodAccessorImpl.invoke(NativeMethodAccessorImpl.java:62)
	at java.base/jdk.internal.reflect.DelegatingMethodAccessorImpl.invoke(DelegatingMethodAccessorImpl.java:43)
	at java.base/java.lang.reflect.Method.invoke(Method.java:543)
	at com.carrotsearch.randomizedtesting.RandomizedRunner.invoke(RandomizedRunner.java:1713)
	at com.carrotsearch.randomizedtesting.RandomizedRunner$8.evaluate(RandomizedRunner.java:907)
	at com.carrotsearch.randomizedtesting.RandomizedRunner$9.evaluate(RandomizedRunner.java:943)
	at com.carrotsearch.randomizedtesting.RandomizedRunner$10.evaluate(RandomizedRunner.java:957)
	at com.carrotsearch.randomizedtesting.rules.SystemPropertiesRestoreRule$1.evaluate(SystemPropertiesRestoreRule.java:57)
	at org.apache.lucene.util.TestRuleSetupTeardownChained$1.evaluate(TestRuleSetupTeardownChained.java:49)
	at org.apache.lucene.util.AbstractBeforeAfterRule$1.evaluate(AbstractBeforeAfterRule.java:45)
	at org.apache.lucene.util.TestRuleThreadAndTestName$1.evaluate(TestRuleThreadAndTestName.java:48)
	at org.apache.lucene.util.TestRuleIgnoreAfterMaxFailures$1.evaluate(TestRuleIgnoreAfterMaxFailures.java:64)
	at org.apache.lucene.util.TestRuleMarkFailure$1.evaluate(TestRuleMarkFailure.java:47)
	at com.carrotsearch.randomizedtesting.rules.StatementAdapter.evaluate(StatementAdapter.java:36)
	at com.carrotsearch.randomizedtesting.ThreadLeakControl$StatementRunner.run(ThreadLeakControl.java:368)
	at com.carrotsearch.randomizedtesting.ThreadLeakControl.forkTimeoutingTask(ThreadLeakControl.java:817)
	at com.carrotsearch.randomizedtesting.ThreadLeakControl$3.evaluate(ThreadLeakControl.java:468)
	at com.carrotsearch.randomizedtesting.RandomizedRunner.runSingleTest(RandomizedRunner.java:916)
	at com.carrotsearch.randomizedtesting.RandomizedRunner$5.evaluate(RandomizedRunner.java:802)
	at com.carrotsearch.randomizedtesting.RandomizedRunner$6.evaluate(RandomizedRunner.java:852)
	at com.carrotsearch.randomizedtesting.RandomizedRunner$7.evaluate(RandomizedRunner.java:863)
	at com.carrotsearch.randomizedtesting.rules.StatementAdapter.evaluate(StatementAdapter.java:36)
	at com.carrotsearch.randomizedtesting.rules.SystemPropertiesRestoreRule$1.evaluate(SystemPropertiesRestoreRule.java:57)
	at org.apache.lucene.util.AbstractBeforeAfterRule$1.evaluate(AbstractBeforeAfterRule.java:45)
	at com.carrotsearch.randomizedtesting.rules.StatementAdapter.evaluate(StatementAdapter.java:36)
	at org.apache.lucene.util.TestRuleStoreClassName$1.evaluate(TestRuleStoreClassName.java:41)
	at com.carrotsearch.randomizedtesting.rules.NoShadowingOrOverridesOnMethodsRule$1.evaluate(NoShadowingOrOverridesOnMethodsRule.java:40)
	at com.carrotsearch.randomizedtesting.rules.NoShadowingOrOverridesOnMethodsRule$1.evaluate(NoShadowingOrOverridesOnMethodsRule.java:40)
	at com.carrotsearch.randomizedtesting.rules.StatementAdapter.evaluate(StatementAdapter.java:36)
	at com.carrotsearch.randomizedtesting.rules.StatementAdapter.evaluate(StatementAdapter.java:36)
	at org.apache.lucene.util.TestRuleAssertionsRequired$1.evaluate(TestRuleAssertionsRequired.java:53)
	at org.apache.lucene.util.TestRuleMarkFailure$1.evaluate(TestRuleMarkFailure.java:47)
	at org.apache.lucene.util.TestRuleIgnoreAfterMaxFailures$1.evaluate(TestRuleIgnoreAfterMaxFailures.java:64)
	at org.apache.lucene.util.TestRuleIgnoreTestSuites$1.evaluate(TestRuleIgnoreTestSuites.java:54)
	at com.carrotsearch.randomizedtesting.rules.StatementAdapter.evaluate(StatementAdapter.java:36)
	at com.carrotsearch.randomizedtesting.ThreadLeakControl$StatementRunner.run(ThreadLeakControl.java:368)
	at java.base/java.lang.Thread.run(Thread.java:844)
Caused by: java.lang.reflect.InaccessibleObjectException: Unable to make protected final java.lang.Class java.lang.ClassLoader.defineClass(java.lang.String,byte[],int,int,java.security.ProtectionDomain) throws java.lang.ClassFormatError accessible: module java.base does not "opens java.lang" to unnamed module @24f80cbc
	at java.base/java.lang.reflect.AccessibleObject.checkCanSetAccessible(AccessibleObject.java:207)
	at java.base/java.lang.reflect.Method.checkCanSetAccessible(Method.java:192)
	at java.base/java.lang.reflect.Method.setAccessible(Method.java:186)
	at net.sf.cglib.core.ReflectUtils$2.run(ReflectUtils.java:56)
	at java.base/java.security.AccessController.doPrivileged(Native Method)
	at net.sf.cglib.core.ReflectUtils.<clinit>(ReflectUtils.java:46)
	... 52 more


FAILED:  org.apache.solr.handler.admin.TestCoreAdminApis.testCalls

Error Message:


Stack Trace:
java.lang.ExceptionInInitializerError
	at __randomizedtesting.SeedInfo.seed([8E9D7E33840CEF05:BC5C615801805CA2]:0)
	at net.sf.cglib.core.KeyFactory$Generator.generateClass(KeyFactory.java:166)
	at net.sf.cglib.core.DefaultGeneratorStrategy.generate(DefaultGeneratorStrategy.java:25)
	at net.sf.cglib.core.AbstractClassGenerator.create(AbstractClassGenerator.java:216)
	at net.sf.cglib.core.KeyFactory$Generator.create(KeyFactory.java:144)
	at net.sf.cglib.core.KeyFactory.create(KeyFactory.java:116)
	at net.sf.cglib.core.KeyFactory.create(KeyFactory.java:108)
	at net.sf.cglib.core.KeyFactory.create(KeyFactory.java:104)
	at net.sf.cglib.proxy.Enhancer.<clinit>(Enhancer.java:69)
	at org.easymock.internal.ClassProxyFactory.createEnhancer(ClassProxyFactory.java:259)
	at org.easymock.internal.ClassProxyFactory.createProxy(ClassProxyFactory.java:174)
	at org.easymock.internal.MocksControl.createMock(MocksControl.java:60)
	at org.easymock.EasyMock.createMock(EasyMock.java:104)
	at org.apache.solr.handler.admin.TestCoreAdminApis.getCoreContainerMock(TestCoreAdminApis.java:76)
	at org.apache.solr.handler.admin.TestCoreAdminApis.testCalls(TestCoreAdminApis.java:43)
	at java.base/jdk.internal.reflect.NativeMethodAccessorImpl.invoke0(Native Method)
	at java.base/jdk.internal.reflect.NativeMethodAccessorImpl.invoke(NativeMethodAccessorImpl.java:62)
	at java.base/jdk.internal.reflect.DelegatingMethodAccessorImpl.invoke(DelegatingMethodAccessorImpl.java:43)
	at java.base/java.lang.reflect.Method.invoke(Method.java:543)
	at com.carrotsearch.randomizedtesting.RandomizedRunner.invoke(RandomizedRunner.java:1713)
	at com.carrotsearch.randomizedtesting.RandomizedRunner$8.evaluate(RandomizedRunner.java:907)
	at com.carrotsearch.randomizedtesting.RandomizedRunner$9.evaluate(RandomizedRunner.java:943)
	at com.carrotsearch.randomizedtesting.RandomizedRunner$10.evaluate(RandomizedRunner.java:957)
	at com.carrotsearch.randomizedtesting.rules.SystemPropertiesRestoreRule$1.evaluate(SystemPropertiesRestoreRule.java:57)
	at org.apache.lucene.util.TestRuleSetupTeardownChained$1.evaluate(TestRuleSetupTeardownChained.java:49)
	at org.apache.lucene.util.AbstractBeforeAfterRule$1.evaluate(AbstractBeforeAfterRule.java:45)
	at org.apache.lucene.util.TestRuleThreadAndTestName$1.evaluate(TestRuleThreadAndTestName.java:48)
	at org.apache.lucene.util.TestRuleIgnoreAfterMaxFailures$1.evaluate(TestRuleIgnoreAfterMaxFailures.java:64)
	at org.apache.lucene.util.TestRuleMarkFailure$1.evaluate(TestRuleMarkFailure.java:47)
	at com.carrotsearch.randomizedtesting.rules.StatementAdapter.evaluate(StatementAdapter.java:36)
	at com.carrotsearch.randomizedtesting.ThreadLeakControl$StatementRunner.run(ThreadLeakControl.java:368)
	at com.carrotsearch.randomizedtesting.ThreadLeakControl.forkTimeoutingTask(ThreadLeakControl.java:817)
	at com.carrotsearch.randomizedtesting.ThreadLeakControl$3.evaluate(ThreadLeakControl.java:468)
	at com.carrotsearch.randomizedtesting.RandomizedRunner.runSingleTest(RandomizedRunner.java:916)
	at com.carrotsearch.randomizedtesting.RandomizedRunner$5.evaluate(RandomizedRunner.java:802)
	at com.carrotsearch.randomizedtesting.RandomizedRunner$6.evaluate(RandomizedRunner.java:852)
	at com.carrotsearch.randomizedtesting.RandomizedRunner$7.evaluate(RandomizedRunner.java:863)
	at com.carrotsearch.randomizedtesting.rules.StatementAdapter.evaluate(StatementAdapter.java:36)
	at com.carrotsearch.randomizedtesting.rules.SystemPropertiesRestoreRule$1.evaluate(SystemPropertiesRestoreRule.java:57)
	at org.apache.lucene.util.AbstractBeforeAfterRule$1.evaluate(AbstractBeforeAfterRule.java:45)
	at com.carrotsearch.randomizedtesting.rules.StatementAdapter.evaluate(StatementAdapter.java:36)
	at org.apache.lucene.util.TestRuleStoreClassName$1.evaluate(TestRuleStoreClassName.java:41)
	at com.carrotsearch.randomizedtesting.rules.NoShadowingOrOverridesOnMethodsRule$1.evaluate(NoShadowingOrOverridesOnMethodsRule.java:40)
	at com.carrotsearch.randomizedtesting.rules.NoShadowingOrOverridesOnMethodsRule$1.evaluate(NoShadowingOrOverridesOnMethodsRule.java:40)
	at com.carrotsearch.randomizedtesting.rules.StatementAdapter.evaluate(StatementAdapter.java:36)
	at com.carrotsearch.randomizedtesting.rules.StatementAdapter.evaluate(StatementAdapter.java:36)
	at org.apache.lucene.util.TestRuleAssertionsRequired$1.evaluate(TestRuleAssertionsRequired.java:53)
	at org.apache.lucene.util.TestRuleMarkFailure$1.evaluate(TestRuleMarkFailure.java:47)
	at org.apache.lucene.util.TestRuleIgnoreAfterMaxFailures$1.evaluate(TestRuleIgnoreAfterMaxFailures.java:64)
	at org.apache.lucene.util.TestRuleIgnoreTestSuites$1.evaluate(TestRuleIgnoreTestSuites.java:54)
	at com.carrotsearch.randomizedtesting.rules.StatementAdapter.evaluate(StatementAdapter.java:36)
	at com.carrotsearch.randomizedtesting.ThreadLeakControl$StatementRunner.run(ThreadLeakControl.java:368)
	at java.base/java.lang.Thread.run(Thread.java:844)
Caused by: java.lang.reflect.InaccessibleObjectException: Unable to make protected final java.lang.Class java.lang.ClassLoader.defineClass(java.lang.String,byte[],int,int,java.security.ProtectionDomain) throws java.lang.ClassFormatError accessible: module java.base does not "opens java.lang" to unnamed module @439013a0
	at java.base/java.lang.reflect.AccessibleObject.checkCanSetAccessible(AccessibleObject.java:207)
	at java.base/java.lang.reflect.Method.checkCanSetAccessible(Method.java:192)
	at java.base/java.lang.reflect.Method.setAccessible(Method.java:186)
	at net.sf.cglib.core.ReflectUtils$2.run(ReflectUtils.java:56)
	at java.base/java.security.AccessController.doPrivileged(Native Method)
	at net.sf.cglib.core.ReflectUtils.<clinit>(ReflectUtils.java:46)
	... 52 more




Build Log:
[...truncated 10852 lines...]
   [junit4] Suite: org.apache.solr.handler.admin.TestApiFramework
   [junit4]   2> Creating dataDir: /home/jenkins/workspace/Lucene-Solr-master-Linux/solr/build/solr-core/test/J2/temp/solr.handler.admin.TestApiFramework_8E9D7E33840CEF05-001/init-core-data-001
   [junit4]   2> 103041 INFO  (SUITE-TestApiFramework-seed#[8E9D7E33840CEF05]-worker) [    ] o.a.s.SolrTestCaseJ4 Using TrieFields
   [junit4]   2> 103043 INFO  (SUITE-TestApiFramework-seed#[8E9D7E33840CEF05]-worker) [    ] o.a.s.SolrTestCaseJ4 Randomized ssl (false) and clientAuth (true) via: @org.apache.solr.util.RandomizeSSL(reason="", ssl=0.0/0.0, value=0.0/0.0, clientAuth=0.0/0.0)
   [junit4]   2> 103044 INFO  (TEST-TestApiFramework.testFramework-seed#[8E9D7E33840CEF05]) [    ] o.a.s.SolrTestCaseJ4 ###Starting testFramework
   [junit4]   2> 103089 INFO  (TEST-TestApiFramework.testFramework-seed#[8E9D7E33840CEF05]) [    ] o.a.s.SolrTestCaseJ4 ###Ending testFramework
   [junit4]   2> NOTE: reproduce with: ant test  -Dtestcase=TestApiFramework -Dtests.method=testFramework -Dtests.seed=8E9D7E33840CEF05 -Dtests.multiplier=3 -Dtests.slow=true -Dtests.locale=ak-GH -Dtests.timezone=Asia/Baku -Dtests.asserts=true -Dtests.file.encoding=UTF-8
   [junit4] ERROR   0.05s J2 | TestApiFramework.testFramework <<<
   [junit4]    > Throwable #1: java.lang.ExceptionInInitializerError
   [junit4]    > 	at __randomizedtesting.SeedInfo.seed([8E9D7E33840CEF05:99EBB41482D80338]:0)
   [junit4]    > 	at net.sf.cglib.core.KeyFactory$Generator.generateClass(KeyFactory.java:166)
   [junit4]    > 	at net.sf.cglib.core.DefaultGeneratorStrategy.generate(DefaultGeneratorStrategy.java:25)
   [junit4]    > 	at net.sf.cglib.core.AbstractClassGenerator.create(AbstractClassGenerator.java:216)
   [junit4]    > 	at net.sf.cglib.core.KeyFactory$Generator.create(KeyFactory.java:144)
   [junit4]    > 	at net.sf.cglib.core.KeyFactory.create(KeyFactory.java:116)
   [junit4]    > 	at net.sf.cglib.core.KeyFactory.create(KeyFactory.java:108)
   [junit4]    > 	at net.sf.cglib.core.KeyFactory.create(KeyFactory.java:104)
   [junit4]    > 	at net.sf.cglib.proxy.Enhancer.<clinit>(Enhancer.java:69)
   [junit4]    > 	at org.easymock.internal.ClassProxyFactory.createEnhancer(ClassProxyFactory.java:259)
   [junit4]    > 	at org.easymock.internal.ClassProxyFactory.createProxy(ClassProxyFactory.java:174)
   [junit4]    > 	at org.easymock.internal.MocksControl.createMock(MocksControl.java:60)
   [junit4]    > 	at org.easymock.EasyMock.createMock(EasyMock.java:104)
   [junit4]    > 	at org.apache.solr.handler.admin.TestCoreAdminApis.getCoreContainerMock(TestCoreAdminApis.java:76)
   [junit4]    > 	at org.apache.solr.handler.admin.TestApiFramework.testFramework(TestApiFramework.java:59)
   [junit4]    > 	at java.base/jdk.internal.reflect.NativeMethodAccessorImpl.invoke0(Native Method)
   [junit4]    > 	at java.base/jdk.internal.reflect.NativeMethodAccessorImpl.invoke(NativeMethodAccessorImpl.java:62)
   [junit4]    > 	at java.base/jdk.internal.reflect.DelegatingMethodAccessorImpl.invoke(DelegatingMethodAccessorImpl.java:43)
   [junit4]    > 	at java.base/java.lang.reflect.Method.invoke(Method.java:543)
   [junit4]    > 	at java.base/java.lang.Thread.run(Thread.java:844)
   [junit4]    > Caused by: java.lang.reflect.InaccessibleObjectException: Unable to make protected final java.lang.Class java.lang.ClassLoader.defineClass(java.lang.String,byte[],int,int,java.security.ProtectionDomain) throws java.lang.ClassFormatError accessible: module java.base does not "opens java.lang" to unnamed module @24f80cbc
   [junit4]    > 	at java.base/java.lang.reflect.AccessibleObject.checkCanSetAccessible(AccessibleObject.java:207)
   [junit4]    > 	at java.base/java.lang.reflect.Method.checkCanSetAccessible(Method.java:192)
   [junit4]    > 	at java.base/java.lang.reflect.Method.setAccessible(Method.java:186)
   [junit4]    > 	at net.sf.cglib.core.ReflectUtils$2.run(ReflectUtils.java:56)
   [junit4]    > 	at java.base/java.security.AccessController.doPrivileged(Native Method)
   [junit4]    > 	at net.sf.cglib.core.ReflectUtils.<clinit>(ReflectUtils.java:46)
   [junit4]    > 	... 52 more
   [junit4]   2> 103092 INFO  (TEST-TestApiFramework.testTrailingTemplatePaths-seed#[8E9D7E33840CEF05]) [    ] o.a.s.SolrTestCaseJ4 ###Starting testTrailingTemplatePaths
   [junit4]   2> 103092 INFO  (TEST-TestApiFramework.testTrailingTemplatePaths-seed#[8E9D7E33840CEF05]) [    ] o.a.s.SolrTestCaseJ4 ###Ending testTrailingTemplatePaths
   [junit4]   2> 103093 INFO  (SUITE-TestApiFramework-seed#[8E9D7E33840CEF05]-worker) [    ] o.a.s.SolrTestCaseJ4 ###deleteCore
   [junit4]   2> NOTE: leaving temporary files on disk at: /home/jenkins/workspace/Lucene-Solr-master-Linux/solr/build/solr-core/test/J2/temp/solr.handler.admin.TestApiFramework_8E9D7E33840CEF05-001
   [junit4]   2> NOTE: test params are: codec=Asserting(Lucene70): {}, docValues:{}, maxPointsInLeafNode=1327, maxMBSortInHeap=6.030482413584307, sim=RandomSimilarity(queryNorm=false): {}, locale=ak-GH, timezone=Asia/Baku
   [junit4]   2> NOTE: Linux 4.4.0-53-generic amd64/Oracle Corporation 9-ea (64-bit)/cpus=12,threads=1,free=305749288,total=522190848
   [junit4]   2> NOTE: All tests run in this JVM: [SliceStateTest, UpdateLogTest, TestUnifiedSolrHighlighter, TestExactStatsCache, BlobRepositoryCloudTest, SynonymTokenizerTest, TestRestoreCore, TestReload, CoreAdminHandlerTest, TestStressUserVersions, LeaderInitiatedRecoveryOnCommitTest, HdfsSyncSliceTest, TestPhraseSuggestions, HdfsLockFactoryTest, TestApiFramework]
   [junit4] Completed [36/692 (1!)] on J2 in 0.06s, 2 tests, 1 error <<< FAILURES!

[...truncated 1532 lines...]
   [junit4] Suite: org.apache.solr.cloud.PeerSyncReplicationTest
   [junit4]   2> Creating dataDir: /home/jenkins/workspace/Lucene-Solr-master-Linux/solr/build/solr-core/test/J0/temp/solr.cloud.PeerSyncReplicationTest_8E9D7E33840CEF05-001/init-core-data-001
   [junit4]   2> 1470770 INFO  (SUITE-PeerSyncReplicationTest-seed#[8E9D7E33840CEF05]-worker) [    ] o.a.s.SolrTestCaseJ4 Using PointFields
   [junit4]   2> 1470771 INFO  (SUITE-PeerSyncReplicationTest-seed#[8E9D7E33840CEF05]-worker) [    ] o.a.s.SolrTestCaseJ4 Randomized ssl (true) and clientAuth (true) via: @org.apache.solr.util.RandomizeSSL(reason="", ssl=0.0/0.0, value=0.0/0.0, clientAuth=0.0/0.0)
   [junit4]   2> 1470773 INFO  (SUITE-PeerSyncReplicationTest-seed#[8E9D7E33840CEF05]-worker) [    ] o.a.s.BaseDistributedSearchTestCase Setting hostContext system property: /bb/
   [junit4]   2> 1470774 INFO  (TEST-PeerSyncReplicationTest.test-seed#[8E9D7E33840CEF05]) [    ] o.a.s.c.ZkTestServer STARTING ZK TEST SERVER
   [junit4]   2> 1470774 INFO  (Thread-3160) [    ] o.a.s.c.ZkTestServer client port:0.0.0.0/0.0.0.0:0
   [junit4]   2> 1470774 INFO  (Thread-3160) [    ] o.a.s.c.ZkTestServer Starting server
   [junit4]   2> 1470874 INFO  (TEST-PeerSyncReplicationTest.test-seed#[8E9D7E33840CEF05]) [    ] o.a.s.c.ZkTestServer start zk server on port:34419
   [junit4]   2> 1470878 INFO  (TEST-PeerSyncReplicationTest.test-seed#[8E9D7E33840CEF05]) [    ] o.a.s.c.AbstractZkTestCase put /home/jenkins/workspace/Lucene-Solr-master-Linux/solr/core/src/test-files/solr/collection1/conf/solrconfig-tlog.xml to /configs/conf1/solrconfig.xml
   [junit4]   2> 1470880 INFO  (TEST-PeerSyncReplicationTest.test-seed#[8E9D7E33840CEF05]) [    ] o.a.s.c.AbstractZkTestCase put /home/jenkins/workspace/Lucene-Solr-master-Linux/solr/core/src/test-files/solr/collection1/conf/schema.xml to /configs/conf1/schema.xml
   [junit4]   2> 1470882 INFO  (TEST-PeerSyncReplicationTest.test-seed#[8E9D7E33840CEF05]) [    ] o.a.s.c.AbstractZkTestCase put /home/jenkins/workspace/Lucene-Solr-master-Linux/solr/core/src/test-files/solr/collection1/conf/solrconfig.snippet.randomindexconfig.xml to /configs/conf1/solrconfig.snippet.randomindexconfig.xml
   [junit4]   2> 1470884 INFO  (TEST-PeerSyncReplicationTest.test-seed#[8E9D7E33840CEF05]) [    ] o.a.s.c.AbstractZkTestCase put /home/jenkins/workspace/Lucene-Solr-master-Linux/solr/core/src/test-files/solr/collection1/conf/stopwords.txt to /configs/conf1/stopwords.txt
   [junit4]   2> 1470887 INFO  (TEST-PeerSyncReplicationTest.test-seed#[8E9D7E33840CEF05]) [    ] o.a.s.c.AbstractZkTestCase put /home/jenkins/workspace/Lucene-Solr-master-Linux/solr/core/src/test-files/solr/collection1/conf/protwords.txt to /configs/conf1/protwords.txt
   [junit4]   2> 1470889 INFO  (TEST-PeerSyncReplicationTest.test-seed#[8E9D7E33840CEF05]) [    ] o.a.s.c.AbstractZkTestCase put /home/jenkins/workspace/Lucene-Solr-master-Linux/solr/core/src/test-files/solr/collection1/conf/currency.xml to /configs/conf1/currency.xml
   [junit4]   2> 1470891 INFO  (TEST-PeerSyncReplicationTest.test-seed#[8E9D7E33840CEF05]) [    ] o.a.s.c.AbstractZkTestCase put /home/jenkins/workspace/Lucene-Solr-master-Linux/solr/core/src/test-files/solr/collection1/conf/enumsConfig.xml to /configs/conf1/enumsConfig.xml
   [junit4]   2> 1470892 INFO  (TEST-PeerSyncReplicationTest.test-seed#[8E9D7E33840CEF05]) [    ] o.a.s.c.AbstractZkTestCase put /home/jenkins/workspace/Lucene-Solr-master-Linux/solr/core/src/test-files/solr/collection1/conf/open-exchange-rates.json to /configs/conf1/open-exchange-rates.json
   [junit4]   2> 1470894 INFO  (TEST-PeerSyncReplicationTest.test-seed#[8E9D7E33840CEF05]) [    ] o.a.s.c.AbstractZkTestCase put /home/jenkins/workspace/Lucene-Solr-master-Linux/solr/core/src/test-files/solr/collection1/conf/mapping-ISOLatin1Accent.txt to /configs/conf1/mapping-ISOLatin1Accent.txt
   [junit4]   2> 1470896 INFO  (TEST-PeerSyncReplicationTest.test-seed#[8E9D7E33840CEF05]) [    ] o.a.s.c.AbstractZkTestCase put /home/jenkins/workspace/Lucene-Solr-master-Linux/solr/core/src/test-files/solr/collection1/conf/old_synonyms.txt to /configs/conf1/old_synonyms.txt
   [junit4]   2> 1470897 INFO  (TEST-PeerSyncReplicationTest.test-seed#[8E9D7E33840CEF05]) [    ] o.a.s.c.AbstractZkTestCase put /home/jenkins/workspace/Lucene-Solr-master-Linux/solr/core/src/test-files/solr/collection1/conf/synonyms.txt to /configs/conf1/synonyms.txt
   [junit4]   2> 1471236 INFO  (TEST-PeerSyncReplicationTest.test-seed#[8E9D7E33840CEF05]) [    ] o.a.s.SolrTestCaseJ4 Writing core.properties file to /home/jenkins/workspace/Lucene-Solr-master-Linux/solr/build/solr-core/test/J0/temp/solr.cloud.PeerSyncReplicationTest_8E9D7E33840CEF05-001/control-001/cores/collection1
   [junit4]   2> 1471239 INFO  (TEST-PeerSyncReplicationTest.test-seed#[8E9D7E33840CEF05]) [    ] o.e.j.s.Server jetty-9.3.14.v20161028
   [junit4]   2> 1471239 INFO  (TEST-PeerSyncReplicationTest.test-seed#[8E9D7E33840CEF05]) [    ] o.e.j.s.h.ContextHandler Started o.e.j.s.ServletContextHandler@28cd396c{/bb,null,AVAILABLE}
   [junit4]   2> 1471241 INFO  (TEST-PeerSyncReplicationTest.test-seed#[8E9D7E33840CEF05]) [    ] o.e.j.s.AbstractConnector Started ServerConnector@7ae999f0{SSL,[ssl, http/1.1]}{127.0.0.1:42730}
   [junit4]   2> 1471241 INFO  (TEST-PeerSyncReplicationTest.test-seed#[8E9D7E33840CEF05]) [    ] o.e.j.s.Server Started @1472858ms
   [junit4]   2> 1471241 INFO  (TEST-PeerSyncReplicationTest.test-seed#[8E9D7E33840CEF05]) [    ] o.a.s.c.s.e.JettySolrRunner Jetty properties: {hostContext=/bb, solr.data.dir=/home/jenkins/workspace/Lucene-Solr-master-Linux/solr/build/solr-core/test/J0/temp/solr.cloud.PeerSyncReplicationTest_8E9D7E33840CEF05-001/tempDir-001/control/data, hostPort=42730, coreRootDirectory=/home/jenkins/workspace/Lucene-Solr-master-Linux/solr/build/solr-core/test/J0/../../../../../../../../../home/jenkins/workspace/Lucene-Solr-master-Linux/solr/build/solr-core/test/J0/temp/solr.cloud.PeerSyncReplicationTest_8E9D7E33840CEF05-001/control-001/cores}
   [junit4]   2> 1471241 ERROR (TEST-PeerSyncReplicationTest.test-seed#[8E9D7E33840CEF05]) [    ] o.a.s.s.StartupLoggingUtils Missing Java Option solr.log.dir. Logging may be missing or incomplete.
   [junit4]   2> 1471241 INFO  (TEST-PeerSyncReplicationTest.test-seed#[8E9D7E33840CEF05]) [    ] o.a.s.s.SolrDispatchFilter  ___      _       Welcome to Apache Solr™ version 7.0.0
   [junit4]   2> 1471241 INFO  (TEST-PeerSyncReplicationTest.test-seed#[8E9D7E33840CEF05]) [    ] o.a.s.s.SolrDispatchFilter / __| ___| |_ _   Starting in cloud mode on port null
   [junit4]   2> 1471241 INFO  (TEST-PeerSyncReplicationTest.test-seed#[8E9D7E33840CEF05]) [    ] o.a.s.s.SolrDispatchFilter \__ \/ _ \ | '_|  Install dir: null
   [junit4]   2> 1471242 INFO  (TEST-PeerSyncReplicationTest.test-seed#[8E9D7E33840CEF05]) [    ] o.a.s.s.SolrDispatchFilter |___/\___/_|_|    Start time: 2017-02-02T23:29:38.640031Z
   [junit4]   2> 1471243 INFO  (TEST-PeerSyncReplicationTest.test-seed#[8E9D7E33840CEF05]) [    ] o.a.s.s.SolrDispatchFilter Loading solr.xml from SolrHome (not found in ZooKeeper)
   [junit4]   2> 1471243 INFO  (TEST-PeerSyncReplicationTest.test-seed#[8E9D7E33840CEF05]) [    ] o.a.s.c.SolrXmlConfig Loading container configuration from /home/jenkins/workspace/Lucene-Solr-master-Linux/solr/build/solr-core/test/J0/temp/solr.cloud.PeerSyncReplicationTest_8E9D7E33840CEF05-001/control-001/solr.xml
   [junit4]   2> 1471248 INFO  (TEST-PeerSyncReplicationTest.test-seed#[8E9D7E33840CEF05]) [    ] o.a.s.c.ZkContainer Zookeeper client=127.0.0.1:34419/solr
   [junit4]   2> 1471255 INFO  (TEST-PeerSyncReplicationTest.test-seed#[8E9D7E33840CEF05]) [    ] o.a.s.c.OverseerElectionContext I am going to be the leader 127.0.0.1:42730_bb
   [junit4]   2> 1471256 INFO  (TEST-PeerSyncReplicationTest.test-seed#[8E9D7E33840CEF05]) [    ] o.a.s.c.Overseer Overseer (id=97391619484745733-127.0.0.1:42730_bb-n_0000000000) starting
   [junit4]   2> 1471259 INFO  (TEST-PeerSyncReplicationTest.test-seed#[8E9D7E33840CEF05]) [    ] o.a.s.c.ZkController Register node as live in ZooKeeper:/live_nodes/127.0.0.1:42730_bb
   [junit4]   2> 1471259 INFO  (zkCallback-2329-thread-1) [    ] o.a.s.c.c.ZkStateReader Updated live nodes from ZooKeeper... (0) -> (1)
   [junit4]   2> 1471352 INFO  (TEST-PeerSyncReplicationTest.test-seed#[8E9D7E33840CEF05]) [    ] o.a.s.c.CorePropertiesLocator Found 1 core definitions underneath /home/jenkins/workspace/Lucene-Solr-master-Linux/solr/build/solr-core/test/J0/../../../../../../../../../home/jenkins/workspace/Lucene-Solr-master-Linux/solr/build/solr-core/test/J0/temp/solr.cloud.PeerSyncReplicationTest_8E9D7E33840CEF05-001/control-001/cores
   [junit4]   2> 1471352 INFO  (TEST-PeerSyncReplicationTest.test-seed#[8E9D7E33840CEF05]) [    ] o.a.s.c.CorePropertiesLocator Cores are: [collection1]
   [junit4]   2> 1471354 INFO  (OverseerStateUpdate-97391619484745733-127.0.0.1:42730_bb-n_0000000000) [    ] o.a.s.c.o.ReplicaMutator Assigning new node to shard shard=shard1
   [junit4]   2> 1472366 INFO  (coreLoadExecutor-6086-thread-1) [    ] o.a.s.c.SolrConfig Using Lucene MatchVersion: 7.0.0
   [junit4]   2> 1472376 INFO  (coreLoadExecutor-6086-thread-1) [    ] o.a.s.s.IndexSchema [collection1] Schema name=test
   [junit4]   2> 1472445 WARN  (coreLoadExecutor-6086-thread-1) [    ] o.a.s.s.IndexSchema [collection1] default search field in schema is text. WARNING: Deprecated, please use 'df' on request instead.
   [junit4]   2> 1472447 INFO  (coreLoadExecutor-6086-thread-1) [    ] o.a.s.s.IndexSchema Loaded schema test/1.0 with uniqueid field id
   [junit4]   2> 1472452 INFO  (coreLoadExecutor-6086-thread-1) [    ] o.a.s.c.CoreContainer Creating SolrCore 'collection1' using configuration from collection control_collection
   [junit4]   2> 1472452 INFO  (coreLoadExecutor-6086-thread-1) [    ] o.a.s.c.SolrCore [[collection1] ] Opening new SolrCore at [/home/jenkins/workspace/Lucene-Solr-master-Linux/solr/build/solr-core/test/J0/temp/solr.cloud.PeerSyncReplicationTest_8E9D7E33840CEF05-001/control-001/cores/collection1], dataDir=[/home/jenkins/workspace/Lucene-Solr-master-Linux/solr/build/solr-core/test/J0/../../../../../../../../../home/jenkins/workspace/Lucene-Solr-master-Linux/solr/build/solr-core/test/J0/temp/solr.cloud.PeerSyncReplicationTest_8E9D7E33840CEF05-001/control-001/cores/collection1/data/]
   [junit4]   2> 1472452 INFO  (coreLoadExecutor-6086-thread-1) [    ] o.a.s.c.JmxMonitoredMap JMX monitoring is enabled. Adding Solr mbeans to JMX Server: com.sun.jmx.mbeanserver.JmxMBeanServer@38e96647
   [junit4]   2> 1472454 INFO  (coreLoadExecutor-6086-thread-1) [    ] o.a.s.u.RandomMergePolicy RandomMergePolicy wrapping class org.apache.lucene.index.LogByteSizeMergePolicy: [LogByteSizeMergePolicy: minMergeSize=1677721, mergeFactor=16, maxMergeSize=2147483648, maxMergeSizeForForcedMerge=9223372036854775807, calibrateSizeByDeletes=true, maxMergeDocs=2147483647, maxCFSSegmentSizeMB=8.796093022207999E12, noCFSRatio=0.5027371128844615]
   [junit4]   2> 1472513 WARN  (coreLoadExecutor-6086-thread-1) [    ] o.a.s.c.RequestHandlers INVALID paramSet a in requestHandler {type = requestHandler,name = /dump,class = DumpRequestHandler,attributes = {initParams=a, name=/dump, class=DumpRequestHandler},args = {defaults={a=A,b=B}}}
   [junit4]   2> 1472627 INFO  (coreLoadExecutor-6086-thread-1) [    ] o.a.s.u.UpdateHandler Using UpdateLog implementation: org.apache.solr.update.UpdateLog
   [junit4]   2> 1472627 INFO  (coreLoadExecutor-6086-thread-1) [    ] o.a.s.u.UpdateLog Initializing UpdateLog: dataDir= defaultSyncLevel=FLUSH numRecordsToKeep=1000 maxNumLogsToKeep=10 numVersionBuckets=65536
   [junit4]   2> 1472628 INFO  (coreLoadExecutor-6086-thread-1) [    ] o.a.s.u.CommitTracker Hard AutoCommit: disabled
   [junit4]   2> 1472628 INFO  (coreLoadExecutor-6086-thread-1) [    ] o.a.s.u.CommitTracker Soft AutoCommit: disabled
   [junit4]   2> 1472628 INFO  (coreLoadExecutor-6086-thread-1) [    ] o.a.s.u.RandomMergePolicy RandomMergePolicy wrapping class org.apache.lucene.index.TieredMergePolicy: [TieredMergePolicy: maxMergeAtOnce=12, maxMergeAtOnceExplicit=32, maxMergedSegmentMB=72.6650390625, floorSegmentMB=2.01953125, forceMergeDeletesPctAllowed=15.894269443842973, segmentsPerTier=31.0, maxCFSSegmentSizeMB=0.9365234375, noCFSRatio=0.1069102589467743
   [junit4]   2> 1472629 INFO  (coreLoadExecutor-6086-thread-1) [    ] o.a.s.s.SolrIndexSearcher Opening [Searcher@10640d8e[collection1] main]
   [junit4]   2> 1472629 INFO  (coreLoadExecutor-6086-thread-1) [    ] o.a.s.r.ManagedResourceStorage Configured ZooKeeperStorageIO with znodeBase: /configs/conf1
   [junit4]   2> 1472630 INFO  (coreLoadExecutor-6086-thread-1) [    ] o.a.s.r.ManagedResourceStorage Loaded null at path _rest_managed.json using ZooKeeperStorageIO:path=/configs/conf1
   [junit4]   2> 1472630 INFO  (coreLoadExecutor-6086-thread-1) [    ] o.a.s.h.ReplicationHandler Commits will be reserved for  10000
   [junit4]   2> 1472631 INFO  (searcherExecutor-6087-thread-1) [    ] o.a.s.c.SolrCore [collection1] Registered new searcher Searcher@10640d8e[collection1] main{ExitableDirectoryReader(UninvertingDirectoryReader())}
   [junit4]   2> 1472631 INFO  (coreLoadExecutor-6086-thread-1) [    ] o.a.s.u.UpdateLog Could not find max version in index or recent updates, using new clock 1558265913702088704
   [junit4]   2> 1472635 INFO  (coreZkRegister-6079-thread-1) [    ] o.a.s.c.ShardLeaderElectionContext Enough replicas found to continue.
   [junit4]   2> 1472635 INFO  (coreZkRegister-6079-thread-1) [    ] o.a.s.c.ShardLeaderElectionContext I may be the new leader - try and sync
   [junit4]   2> 1472635 INFO  (coreZkRegister-6079-thread-1) [    ] o.a.s.c.SyncStrategy Sync replicas to https://127.0.0.1:42730/bb/collection1/
   [junit4]   2> 1472635 INFO  (coreZkRegister-6079-thread-1) [    ] o.a.s.c.SyncStrategy Sync Success - now sync replicas to me
   [junit4]   2> 1472635 INFO  (coreZkRegister-6079-thread-1) [    ] o.a.s.c.SyncStrategy https://127.0.0.1:42730/bb/collection1/ has no replicas
   [junit4]   2> 1472636 INFO  (coreZkRegister-6079-thread-1) [    ] o.a.s.c.ShardLeaderElectionContext I am the new leader: https://127.0.0.1:42730/bb/collection1/ shard1
   [junit4]   2> 1472786 INFO  (coreZkRegister-6079-thread-1) [    ] o.a.s.c.ZkController I am the leader, no recovery necessary
   [junit4]   2> 1473013 INFO  (TEST-PeerSyncReplicationTest.test-seed#[8E9D7E33840CEF05]) [    ] o.a.s.c.c.ZkStateReader Updated live nodes from ZooKeeper... (0) -> (1)
   [junit4]   2> 1473014 INFO  (TEST-PeerSyncReplicationTest.test-seed#[8E9D7E33840CEF05]) [    ] o.a.s.c.s.i.ZkClientClusterStateProvider Cluster at 127.0.0.1:34419/solr ready
   [junit4]   2> 1473014 INFO  (TEST-PeerSyncReplicationTest.test-seed#[8E9D7E33840CEF05]) [    ] o.a.s.c.ChaosMonkey monkey: init - expire sessions:false cause connection loss:false
   [junit4]   2> 1473014 INFO  (TEST-PeerSyncReplicationTest.test-seed#[8E9D7E33840CEF05]) [    ] o.a.s.c.AbstractFullDistribZkTestBase Creating collection1 with stateFormat=2
   [junit4]   2> 1473357 INFO  (TEST-PeerSyncReplicationTest.test-seed#[8E9D7E33840CEF05]) [    ] o.a.s.SolrTestCaseJ4 Writing core.properties file to /home/jenkins/workspace/Lucene-Solr-master-Linux/solr/build/solr-core/test/J0/temp/solr.cloud.PeerSyncReplicationTest_8E9D7E33840CEF05-001/shard-1-001/cores/collection1
   [junit4]   2> 1473358 INFO  (TEST-PeerSyncReplicationTest.test-seed#[8E9D7E33840CEF05]) [    ] o.a.s.c.AbstractFullDistribZkTestBase create jetty 1 in directory /home/jenkins/workspace/Lucene-Solr-master-Linux/solr/build/solr-core/test/J0/temp/solr.cloud.PeerSyncReplicationTest_8E9D7E33840CEF05-001/shard-1-001
   [junit4]   2> 1473360 INFO  (TEST-PeerSyncReplicationTest.test-seed#[8E9D7E33840CEF05]) [    ] o.e.j.s.Server jetty-9.3.14.v20161028
   [junit4]   2> 1473360 INFO  (TEST-PeerSyncReplicationTest.test-seed#[8E9D7E33840CEF05]) [    ] o.e.j.s.h.ContextHandler Started o.e.j.s.ServletContextHandler@332d55ce{/bb,null,AVAILABLE}
   [junit4]   2> 1473361 INFO  (TEST-PeerSyncReplicationTest.test-seed#[8E9D7E33840CEF05]) [    ] o.e.j.s.AbstractConnector Started ServerConnector@18a188de{SSL,[ssl, http/1.1]}{127.0.0.1:40254}
   [junit4]   2> 1473361 INFO  (TEST-PeerSyncReplicationTest.test-seed#[8E9D7E33840CEF05]) [    ] o.e.j.s.Server Started @1474978ms
   [junit4]   2> 1473361 INFO  (TEST-PeerSyncReplicationTest.test-seed#[8E9D7E33840CEF05]) [    ] o.a.s.c.s.e.JettySolrRunner Jetty properties: {hostContext=/bb, solrconfig=solrconfig.xml, solr.data.dir=/home/jenkins/workspace/Lucene-Solr-master-Linux/solr/build/solr-core/test/J0/temp/solr.cloud.PeerSyncReplicationTest_8E9D7E33840CEF05-001/tempDir-001/jetty1, hostPort=40254, coreRootDirectory=/home/jenkins/workspace/Lucene-Solr-master-Linux/solr/build/solr-core/test/J0/../../../../../../../../../home/jenkins/workspace/Lucene-Solr-master-Linux/solr/build/solr-core/test/J0/temp/solr.cloud.PeerSyncReplicationTest_8E9D7E33840CEF05-001/shard-1-001/cores}
   [junit4]   2> 1473361 ERROR (TEST-PeerSyncReplicationTest.test-seed#[8E9D7E33840CEF05]) [    ] o.a.s.s.StartupLoggingUtils Missing Java Option solr.log.dir. Logging may be missing or incomplete.
   [junit4]   2> 1473361 INFO  (TEST-PeerSyncReplicationTest.test-seed#[8E9D7E33840CEF05]) [    ] o.a.s.s.SolrDispatchFilter  ___      _       Welcome to Apache Solr™ version 7.0.0
   [junit4]   2> 1473362 INFO  (TEST-PeerSyncReplicationTest.test-seed#[8E9D7E33840CEF05]) [    ] o.a.s.s.SolrDispatchFilter / __| ___| |_ _   Starting in cloud mode on port null
   [junit4]   2> 1473362 INFO  (TEST-PeerSyncReplicationTest.test-seed#[8E9D7E33840CEF05]) [    ] o.a.s.s.SolrDispatchFilter \__ \/ _ \ | '_|  Install dir: null
   [junit4]   2> 1473362 INFO  (TEST-PeerSyncReplicationTest.test-seed#[8E9D7E33840CEF05]) [    ] o.a.s.s.SolrDispatchFilter |___/\___/_|_|    Start time: 2017-02-02T23:29:40.760074Z
   [junit4]   2> 1473363 INFO  (TEST-PeerSyncReplicationTest.test-seed#[8E9D7E33840CEF05]) [    ] o.a.s.s.SolrDispatchFilter Loading solr.xml from SolrHome (not found in ZooKeeper)
   [junit4]   2> 1473363 INFO  (TEST-PeerSyncReplicationTest.test-seed#[8E9D7E33840CEF05]) [    ] o.a.s.c.SolrXmlConfig Loading container configuration from /home/jenkins/workspace/Lucene-Solr-master-Linux/solr/build/solr-core/test/J0/temp/solr.cloud.PeerSyncReplicationTest_8E9D7E33840CEF05-001/shard-1-001/solr.xml
   [junit4]   2> 1473369 INFO  (TEST-PeerSyncReplicationTest.test-seed#[8E9D7E33840CEF05]) [    ] o.a.s.c.ZkContainer Zookeeper client=127.0.0.1:34419/solr
   [junit4]   2> 1473373 INFO  (TEST-PeerSyncReplicationTest.test-seed#[8E9D7E33840CEF05]) [    ] o.a.s.c.c.ZkStateReader Updated live nodes from ZooKeeper... (0) -> (1)
   [junit4]   2> 1473375 INFO  (TEST-PeerSyncReplicationTest.test-seed#[8E9D7E33840CEF05]) [    ] o.a.s.c.ZkController Register node as live in ZooKeeper:/live_nodes/127.0.0.1:40254_bb
   [junit4]   2> 1473375 INFO  (zkCallback-2339-thread-1) [    ] o.a.s.c.c.ZkStateReader Updated live nodes from ZooKeeper... (1) -> (2)
   [junit4]   2> 1473375 INFO  (zkCallback-2333-thread-1) [    ] o.a.s.c.c.ZkStateReader Updated live nodes from ZooKeeper... (1) -> (2)
   [junit4]   2> 1473375 INFO  (zkCallback-2329-thread-2) [    ] o.a.s.c.c.ZkStateReader Updated live nodes from ZooKeeper... (1) -> (2)
   [junit4]   2> 1473474 INFO  (TEST-PeerSyncReplicationTest.test-seed#[8E9D7E33840CEF05]) [    ] o.a.s.c.CorePropertiesLocator Found 1 core definitions underneath /home/jenkins/workspace/Lucene-Solr-master-Linux/solr/build/solr-core/test/J0/../../../../../../../../../home/jenkins/workspace/Lucene-Solr-master-Linux/solr/build/solr-core/test/J0/temp/solr.cloud.PeerSyncReplicationTest_8E9D7E33840CEF05-001/shard-1-001/cores
   [junit4]   2> 1473475 INFO  (TEST-PeerSyncReplicationTest.test-seed#[8E9D7E33840CEF05]) [    ] o.a.s.c.CorePropertiesLocator Cores are: [collection1]
   [junit4]   2> 1473476 INFO  (OverseerStateUpdate-97391619484745733-127.0.0.1:42730_bb-n_0000000000) [    ] o.a.s.c.o.ReplicaMutator Assigning new node to shard shard=shard1
   [junit4]   2> 1473577 INFO  (zkCallback-2339-thread-1) [    ] o.a.s.c.c.ZkStateReader A cluster state change: [WatchedEvent state:SyncConnected type:NodeDataChanged path:/collections/collection1/state.json] for collection [collection1] has occurred - updating... (live nodes size: [2])
   [junit4]   2> 1474482 INFO  (coreLoadExecutor-6097-thread-1) [    ] o.a.s.c.SolrConfig Using Lucene MatchVersion: 7.0.0
   [junit4]   2> 1474492 INFO  (coreLoadExecutor-6097-thread-1) [    ] o.a.s.s.IndexSchema [collection1] Schema name=test
   [junit4]   2> 1474562 WARN  (coreLoadExecutor-6097-thread-1) [    ] o.a.s.s.IndexSchema [collection1] default search field in schema is text. WARNING: Deprecated, please use 'df' on request instead.
   [junit4]   2> 1474564 INFO  (coreLoadExecutor-6097-thread-1) [    ] o.a.s.s.IndexSchema Loaded schema test/1.0 with uniqueid field id
   [junit4]   2> 1474569 INFO  (coreLoadExecutor-6097-thread-1) [    ] o.a.s.c.CoreContainer Creating SolrCore 'collection1' using configuration from collection collection1
   [junit4]   2> 1474569 INFO  (coreLoadExecutor-6097-thread-1) [    ] o.a.s.c.SolrCore [[collection1] ] Opening new SolrCore at [/home/jenkins/workspace/Lucene-Solr-master-Linux/solr/build/solr-core/test/J0/temp/solr.cloud.PeerSyncReplicationTest_8E9D7E33840CEF05-001/shard-1-001/cores/collection1], dataDir=[/home/jenkins/workspace/Lucene-Solr-master-Linux/solr/build/solr-core/test/J0/../../../../../../../../../home/jenkins/workspace/Lucene-Solr-master-Linux/solr/build/solr-core/test/J0/temp/solr.cloud.PeerSyncReplicationTest_8E9D7E33840CEF05-001/shard-1-001/cores/collection1/data/]
   [junit4]   2> 1474569 INFO  (coreLoadExecutor-6097-thread-1) [    ] o.a.s.c.JmxMonitoredMap JMX monitoring is enabled. Adding Solr mbeans to JMX Server: com.sun.jmx.mbeanserver.JmxMBeanServer@38e96647
   [junit4]   2> 1474571 INFO  (coreLoadExecutor-6097-thread-1) [    ] o.a.s.u.RandomMergePolicy RandomMergePolicy wrapping class org.apache.lucene.index.LogByteSizeMergePolicy: [LogByteSizeMergePolicy: minMergeSize=1677721, mergeFactor=16, maxMergeSize=2147483648, maxMergeSizeForForcedMerge=9223372036854775807, calibrateSizeByDeletes=true, maxMergeDocs=2147483647, maxCFSSegmentSizeMB=8.796093022207999E12, noCFSRatio=0.5027371128844615]
   [junit4]   2> 1474632 WARN  (coreLoadExecutor-6097-thread-1) [    ] o.a.s.c.RequestHandlers INVALID paramSet a in requestHandler {type = requestHandler,name = /dump,class = DumpRequestHandler,attributes = {initParams=a, name=/dump, class=DumpRequestHandler},args = {defaults={a=A,b=B}}}
   [junit4]   2> 1474749 INFO  (coreLoadExecutor-6097-thread-1) [    ] o.a.s.u.UpdateHandler Using UpdateLog implementation: org.apache.solr.update.UpdateLog
   [junit4]   2> 1474749 INFO  (coreLoadExecutor-6097-thread-1) [    ] o.a.s.u.UpdateLog Initializing UpdateLog: dataDir= defaultSyncLevel=FLUSH numRecordsToKeep=1000 maxNumLogsToKeep=10 numVersionBuckets=65536
   [junit4]   2> 1474750 INFO  (coreLoadExecutor-6097-thread-1) [    ] o.a.s.u.CommitTracker Hard AutoCommit: disabled
   [junit4]   2> 1474750 INFO  (coreLoadExecutor-6097-thread-1) [    ] o.a.s.u.CommitTracker Soft AutoCommit: disabled
   [junit4]   2> 1474750 INFO  (coreLoadExecutor-6097-thread-1) [    ] o.a.s.u.RandomMergePolicy RandomMergePolicy wrapping class org.apache.lucene.index.TieredMergePolicy: [TieredMergePolicy: maxMergeAtOnce=12, maxMergeAtOnceExplicit=32, maxMergedSegmentMB=72.6650390625, floorSegmentMB=2.01953125, forceMergeDeletesPctAllowed=15.894269443842973, segmentsPerTier=31.0, maxCFSSegmentSizeMB=0.9365234375, noCFSRatio=0.1069102589467743
   [junit4]   2> 1474751 INFO  (coreLoadExecutor-6097-thread-1) [    ] o.a.s.s.SolrIndexSearcher Opening [Searcher@474e646d[collection1] main]
   [junit4]   2> 1474751 INFO  (coreLoadExecutor-6097-thread-1) [    ] o.a.s.r.ManagedResourceStorage Configured ZooKeeperStorageIO with znodeBase: /configs/conf1
   [junit4]   2> 1474752 INFO  (coreLoadExecutor-6097-thread-1) [    ] o.a.s.r.ManagedResourceStorage Loaded null at path _rest_managed.json using ZooKeeperStorageIO:path=/configs/conf1
   [junit4]   2> 1474752 INFO  (coreLoadExecutor-6097-thread-1) [    ] o.a.s.h.ReplicationHandler Commits will be reserved for  10000
   [junit4]   2> 1474753 INFO  (searcherExecutor-6098-thread-1) [    ] o.a.s.c.SolrCore [collection1] Registered new searcher Searcher@474e646d[collection1] main{ExitableDirectoryReader(UninvertingDirectoryReader())}
   [junit4]   2> 1474753 INFO  (coreLoadExecutor-6097-thread-1) [    ] o.a.s.u.UpdateLog Could not find max version in index or recent updates, using new clock 1558265915927166976
   [junit4]   2> 1474757 INFO  (coreZkRegister-6092-thread-1) [    ] o.a.s.c.ShardLeaderElectionContext Enough replicas found to continue.
   [junit4]   2> 1474757 INFO  (coreZkRegister-6092-thread-1) [    ] o.a.s.c.ShardLeaderElectionContext I may be the new leader - try and sync
   [junit4]   2> 1474757 INFO  (coreZkRegister-6092-thread-1) [    ] o.a.s.c.SyncStrategy Sync replicas to https://127.0.0.1:40254/bb/collection1/
   [junit4]   2> 1474757 INFO  (coreZkRegister-6092-thread-1) [    ] o.a.s.c.SyncStrategy Sync Success - now sync replicas to me
   [junit4]   2> 1474757 INFO  (coreZkRegister-6092-thread-1) [    ] o.a.s.c.SyncStrategy https://127.0.0.1:40254/bb/collection1/ has no replicas
   [junit4]   2> 1474758 INFO  (coreZkRegister-6092-thread-1) [    ] o.a.s.c.ShardLeaderElectionContext I am the new leader: https://127.0.0.1:40254/bb/collection1/ shard1
   [junit4]   2> 1474860 INFO  (zkCallback-2339-thread-1) [    ] o.a.s.c.c.ZkStateReader A cluster state change: [WatchedEvent state:SyncConnected type:NodeDataChanged path:/collections/collection1/state.json] for collection [collection1] has occurred - updating... (live nodes size: [2])
   [junit4]   2> 1474909 INFO  (coreZkRegister-6092-thread-1) [    ] o.a.s.c.ZkController I am the leader, no recovery necessary
   [junit4]   2> 1475011 INFO  (zkCallback-2339-thread-1) [    ] o.a.s.c.c.ZkStateReader A cluster state change: [WatchedEvent state:SyncConnected type:NodeDataChanged path:/collections/collection1/state.json] for collection [collection1] has occurred - updating... (live nodes size: [2])
   [junit4]   2> 1475479 INFO  (TEST-PeerSyncReplicationTest.test-seed#[8E9D7E33840CEF05]) [    ] o.a.s.SolrTestCaseJ4 Writing core.properties file to /home/jenkins/workspace/Lucene-Solr-master-Linux/solr/build/solr-core/test/J0/temp/solr.cloud.PeerSyncReplicationTest_8E9D7E33840CEF05-001/shard-2-001/cores/collection1
   [junit4]   2> 1475479 INFO  (TEST-PeerSyncReplicationTest.test-seed#[8E9D7E33840CEF05]) [    ] o.a.s.c.AbstractFullDistribZkTestBase create jetty 2 in directory /home/jenkins/workspace/Lucene-Solr-master-Linux/solr/build/solr-core/test/J0/temp/solr.cloud.PeerSyncReplicationTest_8E9D7E33840CEF05-001/shard-2-001
   [junit4]   2> 1475482 INFO  (TEST-PeerSyncReplicationTest.test-seed#[8E9D7E33840CEF05]) [    ] o.e.j.s.Server jetty-9.3.14.v20161028
   [junit4]   2> 1475482 INFO  (TEST-PeerSyncReplicationTest.test-seed#[8E9D7E33840CEF05]) [    ] o.e.j.s.h.ContextHandler Started o.e.j.s.ServletContextHandler@62725719{/bb,null,AVAILABLE}
   [junit4]   2> 1475483 INFO  (TEST-PeerSyncReplicationTest.test-seed#[8E9D7E33840CEF05]) [    ] o.e.j.s.AbstractConnector Started ServerConnector@35531607{SSL,[ssl, http/1.1]}{127.0.0.1:41056}
   [junit4]   2> 1475483 INFO  (TEST-PeerSyncReplicationTest.test-seed#[8E9D7E33840CEF05]) [    ] o.e.j.s.Server Started @1477100ms
   [junit4]   2> 1475483 INFO  (TEST-PeerSyncReplicationTest.test-seed#[8E9D7E33840CEF05]) [    ] o.a.s.c.s.e.JettySolrRunner Jetty properties: {hostContext=/bb, solrconfig=solrconfig.xml, solr.data.dir=/home/jenkins/workspace/Lucene-Solr-master-Linux/solr/build/solr-core/test/J0/temp/solr.cloud.PeerSyncReplicationTest_8E9D7E33840CEF05-001/tempDir-001/jetty2, hostPort=41056, coreRootDirectory=/home/jenkins/workspace/Lucene-Solr-master-Linux/solr/build/solr-core/test/J0/temp/solr.cloud.PeerSyncReplicationTest_8E9D7E33840CEF05-001/shard-2-001/cores}
   [junit4]   2> 1475483 ERROR (TEST-PeerSyncReplicationTest.test-seed#[8E9D7E33840CEF05]) [    ] o.a.s.s.StartupLoggingUtils Missing Java Option solr.log.dir. Logging may be missing or incomplete.
   [junit4]   2> 1475483 INFO  (TEST-PeerSyncReplicationTest.test-seed#[8E9D7E33840CEF05]) [    ] o.a.s.s.SolrDispatchFilter  ___      _       Welcome to Apache Solr™ version 7.0.0
   [junit4]   2> 1475483 INFO  (TEST-PeerSyncReplicationTest.test-seed#[8E9D7E33840CEF05]) [    ] o.a.s.s.SolrDispatchFilter / __| ___| |_ _   Starting in cloud mode on port null
   [junit4]   2> 1475483 INFO  (TEST-PeerSyncReplicationTest.test-seed#[8E9D7E33840CEF05]) [    ] o.a.s.s.SolrDispatchFilter \__ \/ _ \ | '_|  Install dir: null
   [junit4]   2> 1475483 INFO  (TEST-PeerSyncReplicationTest.test-seed#[8E9D7E33840CEF05]) [    ] o.a.s.s.SolrDispatchFilter |___/\___/_|_|    Start time: 2017-02-02T23:29:42.881758Z
   [junit4]   2> 1475485 INFO  (TEST-PeerSyncReplicationTest.test-seed#[8E9D7E33840CEF05]) [    ] o.a.s.s.SolrDispatchFilter Loading solr.xml from SolrHome (not found in ZooKeeper)
   [junit4]   2> 1475485 INFO  (TEST-PeerSyncReplicationTest.test-seed#[8E9D7E33840CEF05]) [    ] o.a.s.c.SolrXmlConfig Loading container configuration from /home/jenkins/workspace/Lucene-Solr-master-Linux/solr/build/solr-core/test/J0/temp/solr.cloud.PeerSyncReplicationTest_8E9D7E33840CEF05-001/shard-2-001/solr.xml
   [junit4]   2> 1475490 INFO  (TEST-PeerSyncReplicationTest.test-seed#[8E9D7E33840CEF05]) [    ] o.a.s.c.ZkContainer Zookeeper client=127.0.0.1:34419/solr
   [junit4]   2> 1475495 INFO  (TEST-PeerSyncReplicationTest.test-seed#[8E9D7E33840CEF05]) [    ] o.a.s.c.c.ZkStateReader Updated live nodes from ZooKeeper... (0) -> (2)
   [junit4]   2> 1475497 INFO  (TEST-PeerSyncReplicationTest.test-seed#[8E9D7E33840CEF05]) [    ] o.a.s.c.ZkController Register node as live in ZooKeeper:/live_nodes/127.0.0.1:41056_bb
   [junit4]   2> 1475497 INFO  (zkCallback-2345-thread-1) [    ] o.a.s.c.c.ZkStateReader Updated live nodes from ZooKeeper... (2) -> (3)
   [junit4]   2> 1475497 INFO  (zkCallback-2339-thread-1) [    ] o.a.s.c.c.ZkStateReader Updated live nodes from ZooKeeper... (2) -> (3)
   [junit4]   2> 1475497 INFO  (zkCallback-2329-thread-2) [    ] o.a.s.c.c.ZkStateReader Updated live nodes from ZooKeeper... (2) -> (3)
   [junit4]   2> 1475497 INFO  (zkCallback-2333-thread-1) [    ] o.a.s.c.c.ZkStateReader Updated live nodes from ZooKeeper... (2) -> (3)
   [junit4]   2> 1475599 INFO  (zkCallback-2339-thread-1) [    ] o.a.s.c.c.ZkStateReader A cluster state change: [WatchedEvent state:SyncConnected type:NodeDataChanged path:/collections/collection1/state.json] for collection [collection1] has occurred - updating... (live nodes size: [3])
   [junit4]   2> 1475605 INFO  (TEST-PeerSyncReplicationTest.test-seed#[8E9D7E33840CEF05]) [    ] o.a.s.c.CorePropertiesLocator Found 1 core definitions underneath /home/jenkins/workspace/Lucene-Solr-master-Linux/solr/build/solr-core/test/J0/temp/solr.cloud.PeerSyncReplicationTest_8E9D7E33840CEF05-001/shard-2-001/cores
   [junit4]   2> 1475605 INFO  (TEST-PeerSyncReplicationTest.test-seed#[8E9D7E33840CEF05]) [    ] o.a.s.c.CorePropertiesLocator Cores are: [collection1]
   [junit4]   2> 1475606 INFO  (OverseerStateUpdate-97391619484745733-127.0.0.1:42730_bb-n_0000000000) [    ] o.a.s.c.o.ReplicaMutator Assigning new node to shard shard=shard1
   [junit4]   2> 1475708 INFO  (zkCallback-2345-thread-1) [    ] o.a.s.c.c.ZkStateReader A cluster state change: [WatchedEvent state:SyncConnected type:NodeDataChanged path:/collections/collection1/state.json] for collection [collection1] has occurred - updating... (live nodes size: [3])
   [junit4]   2> 1475708 INFO  (zkCallback-2339-thread-1) [    ] o.a.s.c.c.ZkStateReader A cluster state change: [WatchedEvent state:SyncConnected type:NodeDataChanged path:/collections/collection1/state.json] for collection [collection1] has occurred - updating... (live nodes size: [3])
   [junit4]   2> 1476613 INFO  (coreLoadExecutor-6108-thread-1) [    ] o.a.s.c.SolrConfig Using Lucene MatchVersion: 7.0.0
   [junit4]   2> 1476623 INFO  (coreLoadExecutor-6108-thread-1) [    ] o.a.s.s.IndexSchema [collection1] Schema name=test
   [junit4]   2> 1476694 WARN  (coreLoadExecutor-6108-thread-1) [    ] o.a.s.s.IndexSchema [collection1] default search field in schema is text. WARNING: Deprecated, please use 'df' on request instead.
   [junit4]   2> 1476695 INFO  (coreLoadExecutor-6108-thread-1) [    ] o.a.s.s.IndexSchema Loaded schema test/1.0 with uniqueid field id
   [junit4]   2> 1476700 INFO  (coreLoadExecutor-6108-thread-1) [    ] o.a.s.c.CoreContainer Creating SolrCore 'collection1' using configuration from collection collection1
   [junit4]   2> 1476701 INFO  (coreLoadExecutor-6108-thread-1) [    ] o.a.s.c.SolrCore [[collection1] ] Opening new SolrCore at [/home/jenkins/workspace/Lucene-Solr-master-Linux/solr/build/solr-core/test/J0/temp/solr.cloud.PeerSyncReplicationTest_8E9D7E33840CEF05-001/shard-2-001/cores/collection1], dataDir=[/home/jenkins/workspace/Lucene-Solr-master-Linux/solr/build/solr-core/test/J0/temp/solr.cloud.PeerSyncReplicationTest_8E9D7E33840CEF05-001/shard-2-001/cores/collection1/data/]
   [junit4]   2> 1476701 INFO  (coreLoadExecutor-6108-thread-1) [    ] o.a.s.c.JmxMonitoredMap JMX monitoring is enabled. Adding Solr mbeans to JMX Server: com.sun.jmx.mbeanserver.JmxMBeanServer@38e96647
   [junit4]   2> 1476702 INFO  (coreLoadExecutor-6108-thread-1) [    ] o.a.s.u.RandomMergePolicy RandomMergePolicy wrapping class org.apache.lucene.index.LogByteSizeMergePolicy: [LogByteSizeMergePolicy: minMergeSize=1677721, mergeFactor=16, maxMergeSize=2147483648, maxMergeSizeForForcedMerge=9223372036854775807, calibrateSizeByDeletes=true, maxMergeDocs=2147483647, maxCFSSegmentSizeMB=8.796093022207999E12, noCFSRatio=0.5027371128844615]
   [junit4]   2> 1476732 WARN  (coreLoadExecutor-6108-thread-1) [    ] o.a.s.c.RequestHandlers INVALID paramSet a in requestHandler {type = requestHandler,name = /dump,class = DumpRequestHandler,attributes = {initParams=a, name=/dump, class=DumpRequestHandler},args = {defaults={a=A,b=B}}}
   [junit4]   2> 1476852 INFO  (coreLoadExecutor-6108-thread-1) [    ] o.a.s.u.UpdateHandler Using UpdateLog implementation: org.apache.solr.update.UpdateLog
   [junit4]   2> 1476852 INFO  (coreLoadExecutor-6108-thread-1) [    ] o.a.s.u.UpdateLog Initializing UpdateLog: dataDir= defaultSyncLevel=FLUSH numRecordsToKeep=1000 maxNumLogsToKeep=10 numVersionBuckets=65536
   [junit4]   2> 1476853 INFO  (coreLoadExecutor-6108-thread-1) [    ] o.a.s.u.CommitTracker Hard AutoCommit: disabled
   [junit4]   2> 1476853 INFO  (coreLoadExecutor-6108-thread-1) [    ] o.a.s.u.CommitTracker Soft AutoCommit: disabled
   [junit4]   2> 1476854 INFO  (coreLoadExecutor-6108-thread-1) [    ] o.a.s.u.RandomMergePolicy RandomMergePolicy wrapping class org.apache.lucene.index.TieredMergePolicy: [TieredMergePolicy: maxMergeAtOnce=12, maxMergeAtOnceExplicit=32, maxMergedSegmentMB=72.6650390625, floorSegmentMB=2.01953125, forceMergeDeletesPctAllowed=15.894269443842973, segmentsPerTier=31.0, maxCFSSegmentSizeMB=0.9365234375, noCFSRatio=0.1069102589467743
   [junit4]   2> 1476854 INFO  (coreLoadExecutor-6108-thread-1) [    ] o.a.s.s.SolrIndexSearcher Opening [Searcher@5dd4ef28[collection1] main]
   [junit4]   2> 1476855 INFO  (coreLoadExecutor-6108-thread-1) [    ] o.a.s.r.ManagedResourceStorage Configured ZooKeeperStorageIO with znodeBase: /configs/conf1
   [junit4]   2> 1476855 INFO  (coreLoadExecutor-6108-thread-1) [    ] o.a.s.r.ManagedResourceStorage Loaded null at path _rest_managed.json using ZooKeeperStorageIO:path=/configs/conf1
   [junit4]   2> 1476855 INFO  (coreLoadExecutor-6108-thread-1) [    ] o.a.s.h.ReplicationHandler Commits will be reserved for  10000
   [junit4]   2> 1476856 INFO  (searcherExecutor-6109-thread-1) [    ] o.a.s.c.SolrCore [collection1] Registered new searcher Searcher@5dd4ef28[collection1] main{ExitableDirectoryReader(UninvertingDirectoryReader())}
   [junit4]   2> 1476856 INFO  (coreLoadExecutor-6108-thread-1) [    ] o.a.s.u.UpdateLog Could not find max version in index or recent updates, using new clock 1558265918132322304
   [junit4]   2> 1476859 INFO  (coreZkRegister-6103-thread-1) [    ] o.a.s.c.ZkController Core needs to recover:collection1
   [junit4]   2> 1476859 INFO  (updateExecutor-2342-thread-1) [    ] o.a.s.u.DefaultSolrCoreState Running recovery
   [junit4]   2> 1476860 INFO  (recoveryExecutor-2343-thread-1) [    ] o.a.s.c.RecoveryStrategy Starting recovery process. recoveringAfterStartup=true
   [junit4]   2> 1476860 INFO  (recoveryExecutor-2343-thread-1) [    ] o.a.s.c.RecoveryStrategy ###### startupVersions=[[]]
   [junit4]   2> 1476860 INFO  (recoveryExecutor-2343-thread-1) [    ] o.a.s.c.RecoveryStrategy Begin buffering updates. core=[collection1]
   [junit4]   2> 1476860 INFO  (recoveryExecutor-2343-thread-1) [    ] o.a.s.u.UpdateLog Starting to buffer updates. FSUpdateLog{state=ACTIVE, tlog=null}
   [junit4]   2> 1476860 INFO  (recoveryExecutor-2343-thread-1) [    ] o.a.s.c.RecoveryStrategy Publishing state of core [collection1] as recovering, leader is [https://127.0.0.1:40254/bb/collection1/] and I am [https://127.0.0.1:41056/bb/collection1/]
   [junit4]   2> 1476862 INFO  (recoveryExecutor-2343-thread-1) [    ] o.a.s.c.RecoveryStrategy Sending prep recovery command to [https://127.0.0.1:40254/bb]; [WaitForState: action=PREPRECOVERY&core=collection1&nodeName=127.0.0.1:41056_bb&coreNodeName=core_node2&state=recovering&checkLive=true&onlyIfLeader=true&onlyIfLeaderActive=true]
   [junit4]   2> 1476875 INFO  (qtp1134676125-13429) [    ] o.a.s.h.a.PrepRecoveryOp Going to wait for coreNodeName: core_node2, state: recovering, checkLive: true, onlyIfLeader: true, onlyIfLeaderActive: true
   [junit4]   2> 1476876 INFO  (qtp1134676125-13429) [    ] o.a.s.h.a.PrepRecoveryOp Will wait a max of 183 seconds to see collection1 (shard1 of collection1) have state: recovering
   [junit4]   2> 1476876 INFO  (qtp1134676125-13429) [    ] o.a.s.h.a.PrepRecoveryOp In WaitForState(recovering): collection=collection1, shard=shard1, thisCore=collection1, leaderDoesNotNeedRecovery=false, isLeader? true, live=true, checkLive=true, currentState=down, localState=active, nodeName=127.0.0.1:41056_bb, coreNodeName=core_node2, onlyIfActiveCheckResult=false, nodeProps: core_node2:{"core":"collection1","base_url":"https://127.0.0.1:41056/bb","node_name":"127.0.0.1:41056_bb","state":"down"}
   [junit4]   2> 1476962 INFO  (zkCallback-2345-thread-1) [    ] o.a.s.c.c.ZkStateReader A cluster state change: [WatchedEvent state:SyncConnected type:NodeDataChanged path:/collections/collection1/state.json] for collection [collection1] has occurred - updating... (live nodes size: [3])
   [junit4]   2> 1476962 INFO  (zkCallback-2339-thread-1) [    ] o.a.s.c.c.ZkStateReader A cluster state change: [WatchedEvent state:SyncConnected type:NodeDataChanged path:/collections/collection1/state.json] for collection [collection1] has occurred - updating... (live nodes size: [3])
   [junit4]   2> 1477270 INFO  (TEST-PeerSyncReplicationTest.test-seed#[8E9D7E33840CEF05]) [    ] o.a.s.SolrTestCaseJ4 Writing core.properties file to /home/jenkins/workspace/Lucene-Solr-master-Linux/solr/build/solr-core/test/J0/temp/solr.cloud.PeerSyncReplicationTest_8E9D7E33840CEF05-001/shard-3-001/cores/collection1
   [junit4]   2> 1477270 INFO  (TEST-PeerSyncReplicationTest.test-seed#[8E9D7E33840CEF05]) [    ] o.a.s.c.AbstractFullDistribZkTestBase create jetty 3 in directory /home/jenkins/workspace/Lucene-Solr-master-Linux/solr/build/solr-core/test/J0/temp/solr.cloud.PeerSyncReplicationTest_8E9D7E33840CEF05-001/shard-3-001
   [junit4]   2> 1477272 INFO  (TEST-PeerSyncReplicationTest.test-seed#[8E9D7E33840CEF05]) [    ] o.e.j.s.Server jetty-9.3.14.v20161028
   [junit4]   2> 1477273 INFO  (TEST-PeerSyncReplicationTest.test-seed#[8E9D7E33840CEF05]) [    ] o.e.j.s.h.ContextHandler Started o.e.j.s.ServletContextHandler@ec7051f{/bb,null,AVAILABLE}
   [junit4]   2> 1477273 INFO  (TEST-PeerSyncReplicationTest.test-seed#[8E9D7E33840CEF05]) [    ] o.e.j.s.AbstractConnector Started ServerConnector@1ddd0006{SSL,[ssl, http/1.1]}{127.0.0.1:33699}
   [junit4]   2> 1477273 INFO  (TEST-PeerSyncReplicationTest.test-seed#[8E9D7E33840CEF05]) [    ] o.e.j.s.Server Started @1478891ms
   [junit4]   2> 1477273 INFO  (TEST-PeerSyncReplicationTest.test-seed#[8E9D7E33840CEF05]) [    ] o.a.s.c.s.e.JettySolrRunner Jetty properties: {hostContext=/bb, solrconfig=solrconfig.xml, solr.data.dir=/home/jenkins/workspace/Lucene-Solr-master-Linux/solr/build/solr-core/test/J0/temp/solr.cloud.PeerSyncReplicationTest_8E9D7E33840CEF05-001/tempDir-001/jetty3, hostPort=33699, coreRootDirectory=/home/jenkins/workspace/Lucene-Solr-master-Linux/solr/build/solr-core/test/J0/../../../../../../../../../home/jenkins/workspace/Lucene-Solr-master-Linux/solr/build/solr-core/test/J0/temp/solr.cloud.PeerSyncReplicationTest_8E9D7E33840CEF05-001/shard-3-001/cores}
   [junit4]   2> 1477274 ERROR (TEST-PeerSyncReplicationTest.test-seed#[8E9D7E33840CEF05]) [    ] o.a.s.s.StartupLoggingUtils Missing Java Option solr.log.dir. Logging may be missing or incomplete.
   [junit4]   2> 1477274 INFO  (TEST-PeerSyncReplicationTest.test-seed#[8E9D7E33840CEF05]) [    ] o.a.s.s.SolrDispatchFilter  ___      _       Welcome to Apache Solr™ version 7.0.0
   [junit4]   2> 1477274 INFO  (TEST-PeerSyncReplicationTest.test-seed#[8E9D7E33840CEF05]) [    ] o.a.s.s.SolrDispatchFilter / __| ___| |_ _   Starting in cloud mode on port null
   [junit4]   2> 1477274 INFO  (TEST-PeerSyncReplicationTest.test-seed#[8E9D7E33840CEF05]) [    ] o.a.s.s.SolrDispatchFilter \__ \/ _ \ | '_|  Install dir: null
   [junit4]   2> 1477274 INFO  (TEST-PeerSyncReplicationTest.test-seed#[8E9D7E33840CEF05]) [    ] o.a.s.s.SolrDispatchFilter |___/\___/_|_|    Start time: 2017-02-02T23:29:44.672442Z
   [junit4]   2> 1477276 INFO  (TEST-PeerSyncReplicationTest.test-seed#[8E9D7E33840CEF05]) [    ] o.a.s.s.SolrDispatchFilter Loading solr.xml from SolrHome (not found in ZooKeeper)
   [junit4]   2> 1477276 INFO  (TEST-PeerSyncReplicationTest.test-seed#[8E9D7E33840CEF05]) [    ] o.a.s.c.SolrXmlConfig Loading container configuration from /home/jenkins/workspace/Lucene-Solr-master-Linux/solr/build/solr-core/test/J0/temp/solr.cloud.PeerSyncReplicationTest_8E9D7E33840CEF05-001/shard-3-001/solr.xml
   [junit4]   2> 1477281 INFO  (TEST-PeerSyncReplicationTest.test-seed#[8E9D7E33840CEF05]) [    ] o.a.s.c.ZkContainer Zookeeper client=127.0.0.1:34419/solr
   [junit4]   2> 1477286 INFO  (TEST-PeerSyncReplicationTest.test-seed#[8E9D7E33840CEF05]) [    ] o.a.s.c.c.ZkStateReader Updated live nodes from ZooKeeper... (0) -> (3)
   [junit4]   2> 1477287 INFO  (TEST-PeerSyncReplicationTest.test-seed#[8E9D7E33840CEF05]) [    ] o.a.s.c.ZkController Register node as live in ZooKeeper:/live_nodes/127.0.0.1:33699_bb
   [junit4]   2> 1477287 INFO  (zkCallback-2333-thread-1) [    ] o.a.s.c.c.ZkStateReader Updated live nodes from ZooKeeper... (3) -> (4)
   [junit4]   2> 1477287 INFO  (zkCallback-2339-thread-1) [    ] o.a.s.c.c.ZkStateReader Updated live nodes from ZooKeeper... (3) -> (4)
   [junit4]   2> 1477288 INFO  (zkCallback-2345-thread-1) [    ] o.a.s.c.c.ZkStateReader Updated live nodes from ZooKeeper... (3) -> (4)
   [junit4]   2> 1477287 INFO  (zkCallback-2329-thread-3) [    ] o.a.s.c.c.ZkStateReader Updated live nodes from ZooKeeper... (3) -> (4)
   [junit4]   2> 1477288 INFO  (zkCallback-2352-thread-1) [    ] o.a.s.c.c.ZkStateReader Updated live nodes from ZooKeeper... (3) -> (4)
   [junit4]   2> 1477390 INFO  (zkCallback-2339-thread-1) [    ] o.a.s.c.c.ZkStateReader A cluster state change: [WatchedEvent state:SyncConnected type:NodeDataChanged path:/collections/collection1/state.json] for collection [collection1] has occurred - updating... (live nodes size: [4])
   [junit4]   2> 1477390 INFO  (zkCallback-2345-thread-1) [    ] o.a.s.c.c.ZkStateReader A cluster state change: [WatchedEvent state:SyncConnected type:NodeDataChanged path:/collections/collection1/state.json] for collection [collection1] has occurred - updating... (live nodes size: [4])
   [junit4]   2> 1477412 INFO  (TEST-PeerSyncReplicationTest.test-seed#[8E9D7E33840CEF05]) [    ] o.a.s.c.CorePropertiesLocator Found 1 core definitions underneath /home/jenkins/workspace/Lucene-Solr-master-Linux/solr/build/solr-core/test/J0/../../../../../../../../../home/jenkins/workspace/Lucene-Solr-master-Linux/solr/build/solr-core/test/J0/temp/solr.cloud.PeerSyncReplicationTest_8E9D7E33840CEF05-001/shard-3-001/cores
   [junit4]   2> 1477412 INFO  (TEST-PeerSyncReplicationTest.test-seed#[8E9D7E33840CEF05]) [    ] o.a.s.c.CorePropertiesLocator Cores are: [collection1]
   [junit4]   2> 1477414 INFO  (OverseerStateUpdate-97391619484745733-127.0.0.1:42730_bb-n_0000000000) [    ] o.a.s.c.o.ReplicaMutator Assigning new node to shard shard=shard1
   [junit4]   2> 1477515 INFO  (zkCallback-2339-thread-1) [    ] o.a.s.c.c.ZkStateReader A cluster state change: [WatchedEvent state:SyncConnected type:NodeDataChanged path:/collections/collection1/state.json] for collection [collection1] has occurred - updating... (live nodes size: [4])
   [junit4]   2> 1477515 INFO  (zkCallback-2345-thread-1) [    ] o.a.s.c.c.ZkStateReader A cluster state change: [WatchedEvent state:SyncConnected type:NodeDataChanged path:/collections/collection1/state.json] for collection [collection1] has occurred - updating... (live nodes size: [4])
   [junit4]   2> 1477515 INFO  (zkCallback-2352-thread-1) [    ] o.a.s.c.c.ZkStateReader A cluster state change: [WatchedEvent state:SyncConnected type:NodeDataChanged path:/collections/collection1/state.json] for collection [collection1] has occurred - updating... (live nodes size: [4])
   [junit4]   2> 1477876 INFO  (qtp1134676125-13429) [    ] o.a.s.h.a.PrepRecoveryOp In WaitForState(recovering): collection=collection1, shard=shard1, thisCore=collection1, leaderDoesNotNeedRecovery=false, isLeader? true, live=true, checkLive=true, currentState=recovering, localState=active, nodeName=127.0.0.1:41056_bb, coreNodeName=core_node2, onlyIfActiveCheckResult=false, nodeProps: core_node2:{"core":"collection1","base_url":"https://127.0.0.1:41056/bb","node_name":"127.0.0.1:41056_bb","state":"recovering"}
   [junit4]   2> 1477876 INFO  (qtp1134676125-13429) [    ] o.a.s.h.a.PrepRecoveryOp Waited coreNodeName: core_node2, state: recovering, checkLive: true, onlyIfLeader: true for: 1 seconds.
   [junit4]   2> 1477876 INFO  (qtp1134676125-13429) [    ] o.a.s.s.HttpSolrCall [admin] webapp=null path=/admin/cores params={nodeName=127.0.0.1:41056_bb&onlyIfLeaderActive=true&core=collection1&coreNodeName=core_node2&action=PREPRECOVERY&checkLive=true&state=recovering&onlyIfLeader=true&wt=javabin&version=2} status=0 QTime=1001
   [junit4]   2> 1478377 INFO  (recoveryExecutor-2343-thread-1) [    ] o.a.s.c.RecoveryStrategy Attempting to PeerSync from [https://127.0.0.1:40254/bb/collection1/] - recoveringAfterStartup=[true]
   [junit4]   2> 1478377 INFO  (recoveryExecutor-2343-thread-1) [    ] o.a.s.u.PeerSync PeerSync: core=collection1 url=https://127.0.0.1:41056/bb START replicas=[https://127.0.0.1:40254/bb/collection1/] nUpdates=1000
   [junit4]   2> 1478380 INFO  (qtp1134676125-13429) [    ] o.a.s.u.IndexFingerprint IndexFingerprint millis:0.0 result:{maxVersionSpecified=9223372036854775807, maxVersionEncountered=0, maxInHash=0, versionsHash=0, numVersions=0, numDocs=0, maxDoc=0}
   [junit4]   2> 1478380 INFO  (qtp1134676125-13429) [    ] o.a.s.c.S.Request [collection1]  webapp=/bb path=/get params={distrib=false&qt=/get&getFingerprint=9223372036854775807&wt=javabin&version=2} status=0 QTime=0
   [junit4]   2> 1478380 INFO  (recoveryExecutor-2343-thread-1) [    ] o.a.s.u.IndexFingerprint IndexFingerprint millis:0.0 result:{maxVersionSpecified=9223372036854775807, maxVersionEncountered=0, maxInHash=0, versionsHash=0, numVersions=0, numDocs=0, maxDoc=0}
   [junit4]   2> 1478380 INFO  (recoveryExecutor-2343-thread-1) [    ] o.a.s.u.PeerSync We are already in sync. No need to do a PeerSync 
   [junit4]   2> 1478380 INFO  (recoveryExecutor-2343-thread-1) [    ] o.a.s.u.DirectUpdateHandler2 start commit{,optimize=false,openSearcher=true,waitSearcher=true,expungeDeletes=false,softCommit=false,prepareCommit=false}
   [junit4]   2> 1478380 INFO  (recoveryExecutor-2343-thread-1) [    ] o.a.s.u.DirectUpdateHandler2 No uncommitted changes. Skipping IW.commit.
   [junit4]   2> 1478380 INFO  (recoveryExecutor-2343-thread-1) [    ] o.a.s.u.DirectUpdateHandler2 end_commit_flush
   [junit4]   2> 1478380 INFO  (recoveryExecutor-2343-thread-1) [    ] o.a.s.c.RecoveryStrategy PeerSync stage of recovery was successful.
   [junit4]   2> 1478380 INFO  (recoveryExecutor-2343-thread-1) [    ] o.a.s.c.RecoveryStrategy Replaying updates buffered during PeerSync.
   [junit4]   2> 1478381 INFO  (recoveryExecutor-2343-thread-1) [    ] o.a.s.c.RecoveryStrategy No replay needed.
   [junit4]   2> 1478381 INFO  (recoveryExecutor-2343-thread-1) [    ] o.a.s.c.RecoveryStrategy Registering as Active after recovery.
   [junit4]   2> 1478420 INFO  (coreLoadExecutor-6119-thread-1) [    ] o.a.s.c.SolrConfig Using Lucene MatchVersion: 7.0.0
   [junit4]   2> 1478429 INFO  (coreLoadExecutor-6119-thread-1) [    ] o.a.s.s.IndexSchema [collection1] Schema name=test
   [junit4]   2> 1478483 INFO  (zkCallback-2339-thread-1) [    ] o.a.s.c.c.ZkStateReader A cluster state change: [WatchedEvent state:SyncConnected type:NodeDataChanged path:/collections/collection1/state.json] for collection [collection1] has occurred - updating... (live nodes size: [4])
   [junit4]   2> 1478483 INFO  (zkCallback-2352-thread-1) [    ] o.a.s.c.c.ZkStateReader A cluster state change: [WatchedEvent state:SyncConnected type:NodeDataChanged path:/collections/collection1/state.json] for collection [collection1] has occurred - updating... (live nodes size: [4])
   [junit4]   2> 1478483 INFO  (zkCallback-2345-thread-1) [    ] o.a.s.c.c.ZkStateReader A cluster state change: [WatchedEvent state:SyncConnected type:NodeDataChanged path:/collections/collection1/state.json] for collection [collection1] has occurred - updating... (live nodes size: [4])
   [junit4]   2> 1478500 WARN  (coreLoadExecutor-6119-thread-1) [    ] o.a.s.s.IndexSchema [collection1] default search field in schema is text. WARNING: Deprecated, please use 'df' on request instead.
   [junit4]   2> 1478501 INFO  (coreLoadExecutor-6119-thread-1) [    ] o.a.s.s.IndexSchema Loaded schema test/1.0 with uniqueid field id
   [junit4]   2> 1478506 INFO  (coreLoadExecutor-6119-thread-1) [    ] o.a.s.c.CoreContainer Creating SolrCore 'collection1' using configuration from collection collection1
   [junit4]   2> 1478507 INFO  (coreLoadExecutor-6119-thread-1) [    ] o.a.s.c.SolrCore [[collection1] ] Opening new SolrCore at [/home/jenkins/workspace/Lucene-Solr-master-Linux/solr/build/solr-core/test/J0/temp/solr.cloud.PeerSyncReplicationTest_8E9D7E33840CEF05-001/shard-3-001/cores/collection1], dataDir=[/home/jenkins/workspace/Lucene-Solr-master-Linux/solr/build/solr-core/test/J0/../../../../../../../../../home/jenkins/workspace/Lucene-Solr-master-Linux/solr/build/solr-core/test/J0/temp/solr.cloud.PeerSyncReplicationTest_8E9D7E33840CEF05-001/shard-3-001/cores/collection1/data/]
   [junit4]   2> 1478507 INFO  (coreLoadExecutor-6119-thread-1) [    ] o.a.s.c.JmxMonitoredMap JMX monitoring is enabled. Adding Solr mbeans to JMX Server: com.sun.jmx.mbeanserver.JmxMBeanServer@38e96647
   [junit4]   2> 1478508 INFO  (coreLoadExecutor-6119-thread-1) [    ] o.a.s.u.RandomMergePolicy RandomMergePolicy wrapping class org.apache.lucene.index.LogByteSizeMergePolicy: [LogByteSizeMergePolicy: minMergeSize=1677721, mergeFactor=16, maxMergeSize=2147483648, maxMergeSizeForForcedMerge=9223372036854775807, calibrateSizeByDeletes=true, maxMergeDocs=2147483647, maxCFSSegmentSizeMB=8.796093022207999E12, noCFSRatio=0.5027371128844615]
   [junit4]   2> 1478551 WARN  (coreLoadExecutor-6119-thread-1) [    ] o.a.s.c.RequestHandlers INVALID paramSet a in requestHandler {type = requestHandler,name = /dump,class = DumpRequestHandler,attributes = {initParams=a, name=/dump, class=DumpRequestHandler},args = {defaults={a=A,b=B}}}
   [junit4]   2> 1478664 INFO  (coreLoadExecutor-6119-thread-1) [    ] o.a.s.u.UpdateHandler Using UpdateLog implementation: org.apache.solr.update.UpdateLog
   [junit4]   2> 1478664 INFO  (coreLoadExecutor-6119-thread-1) [    ] o.a.s.u.UpdateLog Initializing UpdateLog: dataDir= defaultSyncLevel=FLUSH numRecordsToKeep=1000 maxNumLogsToKeep=10 numVersionBuckets=65536
   [junit4]   2> 1478665 INFO  (coreLoadExecutor-6119-thread-1) [    ] o.a.s.u.CommitTracker Hard AutoCommit: disabled
   [junit4]   2> 1478665 INFO  (coreLoadExecutor-6119-thread-1) [    ] o.a.s.u.CommitTracker Soft AutoCommit: disabled
   [junit4]   2> 1478665 INFO  (coreLoadExecutor-6119-thread-1) [    ] o.a.s.u.RandomMergePolicy RandomMergePolicy wrapping class org.apache.lucene.index.TieredMergePolicy: [TieredMergePolicy: maxMergeAtOnce=12, maxMergeAtOnceExplicit=32, maxMergedSegmentMB=72.6650390625, floorSegmentMB=2.01953125, forceMergeDeletesPctAllowed=15.894269443842973, segmentsPerTier=31.0, maxCFSSegmentSizeMB=0.9365234375, noCFSRatio=0.1069102589467743
   [junit4]   2> 1478666 INFO  (coreLoadExecutor-6119-thread-1) [    ] o.a.s.s.SolrIndexSearcher Opening [Searcher@15021794[collection1] main]
   [junit4]   2> 1478666 INFO  (coreLoadExecutor-6119-thread-1) [    ] o.a.s.r.ManagedResourceStorage Configured ZooKeeperStorageIO with znodeBase: /configs/conf1
   [junit4]   2> 1478666 INFO  (coreLoadExecutor-6119-thread-1) [    ] o.a.s.r.ManagedResourceStorage Loaded null at path _rest_managed.json using ZooKeeperStorageIO:path=/configs/conf1
   [junit4]   2> 1478666 INFO  (coreLoadExecutor-6119-thread-1) [    ] o.a.s.h.ReplicationHandler Commits will be reserved for  10000
   [junit4]   2> 1478667 INFO  (searcherExecutor-6120-thread-1) [    ] o.a.s.c.SolrCore [collection1] Registered new searcher Searcher@15021794[collection1] main{ExitableDirectoryReader(UninvertingDirectoryReader())}
   [junit4]   2> 1478668 INFO  (coreLoadExecutor-6119-thread-1) [    ] o.a.s.u.UpdateLog Could not find max version in index or recent updates, using new clock 1558265920032342016
   [junit4]   2> 1478670 INFO  (coreZkRegister-6114-thread-1) [    ] o.a.s.c.ZkController Core needs to recover:collection1
   [junit4]   2> 1478671 INFO  (updateExecutor-2349-thread-1) [    ] o.a.s.u.DefaultSolrCoreState Running recovery
   [junit4]   2> 1478671 INFO  (recoveryExecutor-2350-thread-1) [    ] o.a.s.c.RecoveryStrategy Starting recovery process. recoveringAfterStartup=true
   [junit4]   2> 1478671 INFO  (recoveryExecutor-2350-thread-1) [    ] o.a.s.c.RecoveryStrategy ###### startupVersions=[[]]
   [junit4]   2> 1478671 INFO  (recoveryExecutor-2350-thread-1) [    ] o.a.s.c.RecoveryStrategy Begin buffering updates. core=[collection1]
   [junit4]   2> 1478671 INFO  (recoveryExecutor-2350-thread-1) [    ] o.a.s.u.UpdateLog Starting to buffer updates. FSUpdateLog{state=ACTIVE, tlog=null}
   [junit4]   2> 1478671 INFO  (recoveryExecutor-2350-thread-1) [    ] o.a.s.c.RecoveryStrategy Publishing state of core [collection1] as recovering, leader is [https://127.0.0.1:40254/bb/collection1/] and I am [https://127.0.0.1:33699/bb/collection1/]
   [junit4]   2> 1478673 INFO  (recoveryExecutor-2350-thread-1) [    ] o.a.s.c.RecoveryStrategy Sending prep recovery command to [https://127.0.0.1:40254/bb]; [WaitForState: action=PREPRECOVERY&core=collection1&nodeName=127.0.0.1:33699_bb&coreNodeName=core_node3&state=recovering&checkLive=true&onlyIfLeader=true&onlyIfLeaderActive=true]
   [junit4]   2> 1478676 INFO  (qtp1134676125-13436) [    ] o.a.s.h.a.PrepRecoveryOp Going to wait for coreNodeName: core_node3, state: recovering, checkLive: true, onlyIfLeader: true, onlyIfLeaderActive: true
   [junit4]   2> 1478676 INFO  (qtp1134676125-13436) [    ] o.a.s.h.a.PrepRecoveryOp Will wait a max of 183 seconds to see collection1 (shard1 of collection1) have state: recovering
   [junit4]   2> 1478676 INFO  (qtp1134676125-13436) [    ] o.a.s.h.a.PrepRecoveryOp In WaitForState(recovering): collection=collection1, shard=shard1, thisCore=collection1, leaderDoesNotNeedRecovery=false, isLeader? true, live=true, checkLive=true, currentState=down, localState=active, nodeName=127.0.0.1:33699_bb, coreNodeName=core_node3, onlyIfActiveCheckResult=false, nodeProps: core_node3:{"core":"collection1","base_url":"https://127.0.0.1:33699/bb","node_name":"127.0.0.1:33699_bb","state":"down"}
   [junit4]   2> 1478773 INFO  (zkCallback-2339-thread-1) [    ] o.a.s.c.c.ZkStateReader A cluster state change: [WatchedEvent state:SyncConnected type:NodeDataChanged path:/collections/collection1/state.json] for collection [collection1] has occurred - updating... (live nodes size: [4])
   [junit4]   2> 1478773 INFO  (zkCallback-2352-thread-1) [    ] o.a.s.c.c.ZkStateReader A cluster state change: [WatchedEvent state:SyncConnected type:NodeDataChanged path:/collections/collection1/state.json] for collection [collection1] has occurred - updating... (live nodes size: [4])
   [junit4]   2> 1478773 INFO  (zkCallback-2345-thread-1) [    ] o.a.s.c.c.ZkStateReader A cluster state change: [WatchedEvent state:SyncConnected type:NodeDataChanged path:/collections/collection1/state.json] for collection [collection1] has occurred - updating... (live nodes size: [4])
   [junit4]   2> 1479083 INFO  (TEST-PeerSyncReplicationTest.test-seed#[8E9D7E33840CEF05]) [    ] o.a.s.SolrTestCaseJ4 ###Starting test
   [junit4]   2> 1479083 INFO  (TEST-PeerSyncReplicationTest.test-seed#[8E9D7E33840CEF05]) [    ] o.a.s.c.AbstractFullDistribZkTestBase Wait for recoveries to finish - wait 30 for each attempt
   [junit4]   2> 1479083 INFO  (TEST-PeerSyncReplicationTest.test-seed#[8E9D7E33840CEF05]) [    ] o.a.s.c.AbstractDistribZkTestBase Wait for recoveries to finish - collection: collection1 failOnTimeout:true timeout (sec):30
   [junit4]   2> 1479676 INFO  (qtp1134676125-13436) [    ] o.a.s.h.a.PrepRecoveryOp In WaitForState(recovering): collection=collection1, shard=shard1, thisCore=collection1, leaderDoesNotNeedRecovery=false, isLeader? true, live=true, checkLive=true, currentState=recovering, localState=active, nodeName=127.0.0.1:33699_bb, coreNodeName=core_node3, onlyIfActiveCheckResult=false, nodeProps: core_node3:{"core":"collection1","base_url":"https://127.0.0.1:33699/bb","node_name":"127.0.0.1:33699_bb","state":"recovering"}
   [junit4]   2> 1479676 INFO  (qtp1134676125-13436) [    ] o.a.s.h.a.PrepRecoveryOp Waited coreNodeName: core_node3, state: recovering, checkLive: true, onlyIfLeader: true for: 1 seconds.
   [junit4]   2> 1479676 INFO  (qtp1134676125-13436) [    ] o.a.s.s.HttpSolrCall [admin] webapp=null path=/admin/cores params={nodeName=127.0.0.1:33699_bb&onlyIfLeaderActive=true&core=collection1&coreNodeName=core_node3&action=PREPRECOVERY&checkLive=true&state=recovering&onlyIfLeader=true&wt=javabin&version=2} status=0 QTime=1000
   [junit4]   2> 1480177 INFO  (recoveryExecutor-2350-thread-1) [    ] o.a.s.c.RecoveryStrategy Attempting to PeerSync from [https://127.0.0.1:40254/bb/collection1/] - recoveringAfterStartup=[true]
   [junit4]   2> 1480177 INFO  (recoveryExecutor-2350-thread-1) [    ] o.a.s.u.PeerSync PeerSync: core=collection1 url=https://127.0.0.1:33699/bb START replicas=[https://127.0.0.1:40254/bb/collection1/] nUpdates=1000
   [junit4]   2> 1480179 INFO  (qtp1134676125-13429) [    ] o.a.s.u.IndexFingerprint IndexFingerprint millis:0.0 result:{maxVersionSpecified=9223372036854775807, maxVersionEncountered=0, maxInHash=0, versionsHash=0, numVersions=0, numDocs=0, maxDoc=0}
   [junit4]   2> 1480179 INFO  (qtp1134676125-13429) [    ] o.a.s.c.S.Request [collection1]  webapp=/bb path=/get params={distrib=false&qt=/get&getFingerprint=9223372036854775807&wt=javabin&version=2} status=0 QTime=0
   [junit4]   2> 1480180 INFO  (recoveryExecutor-2350-thread-1) [    ] o.a.s.u.IndexFingerprint IndexFingerprint millis:0.0 result:{maxVersionSpecified=9223372036854775807, maxVersionEncountered=0, maxInHash=0, versionsHash=0, numVersions=0, numDocs=0, maxDoc=0}
   [junit4]   2> 1480180 INFO  (recoveryExecutor-2350-thread-1) [    ] o.a.s.u.PeerSync We are already in sync. No need to do a PeerSync 
   [junit4]   2> 1480180 INFO  (recoveryExecutor-2350-thread-1) [    ] o.a.s.u.DirectUpdateHandler2 start commit{,optimize=false,openSearcher=true,waitSearcher=true,expungeDeletes=false,softCommit=false,prepareCommit=false}
   [junit4]   2> 1480180 INFO  (recoveryExecutor-2350-thread-1) [    ] o.a.s.u.DirectUpdateHandler2 No uncommitted changes. Skipping IW.commit.
   [junit4]   2> 1480180 INFO  (recoveryExecutor-2350-thread-1) [    ] o.a.s.u.DirectUpdateHandler2 end_commit_flush
   [junit4]   2> 1480180 INFO  (recoveryExecutor-2350-thread-1) [    ] o.a.s.c.RecoveryStrategy PeerSync stage of recovery was successful.
   [junit4]   2> 1480180 INFO  (recoveryExecutor-2350-thread-1) [    ] o.a.s.c.RecoveryStrategy Replaying updates buffered during PeerSync.
   [junit4]   2> 1480180 INFO  (recoveryExecutor-2350-thread-1) [    ] o.a.s.c.RecoveryStrategy No replay needed.
   [junit4]   2> 1480180 INFO  (recoveryExecutor-2350-thread-1) [    ] o.a.s.c.RecoveryStrategy Registering as Active after recovery.
   [junit4]   2> 1480282 INFO  (zkCallback-2339-thread-1) [    ] o.a.s.c.c.ZkStateReader A cluster state change: [WatchedEvent state:SyncConnected type:NodeDataChanged path:/collections/collection1/state.json] for collection [collection1] has occurred - updating... (live nodes size: [4])
   [junit4]   2> 1480282 INFO  (zkCallback-2345-thread-1) [    ] o.a.s.c.c.ZkStateReader A cluster state change: [WatchedEvent state:SyncConnected type:NodeDataChanged path:/collections/collection1/state.json] for collection [collection1] has occurred - updating... (live nodes size: [4])
   [junit4]   2> 1480282 INFO  (zkCallback-2352-thread-1) [    ] o.a.s.c.c.ZkStateReader A cluster state change: [WatchedEvent state:SyncConnected type:NodeDataChanged path:/collections/collection1/state.json] for collection [collection1] has occurred - updating... (live nodes size: [4])
   [junit4]   2> 1481085 INFO  (TEST-PeerSyncReplicationTest.test-seed#[8E9D7E33840CEF05]) [    ] o.a.s.c.AbstractDistribZkTestBase Recoveries finished - collection: collection1
   [junit4]   2> 1481098 INFO  (qtp1599809825-13390) [    ] o.a.s.u.DirectUpdateHandler2 start commit{,optimize=false,openSearcher=true,waitSearcher=true,expungeDeletes=false,softCommit=false,prepareCommit=false}
   [junit4]   2> 1481099 INFO  (qtp1599809825-13390) [    ] o.a.s.u.DirectUpdateHandler2 No uncommitted changes. Skipping IW.commit.
   [junit4]   2> 1481099 INFO  (qtp1599809825-13390) [    ] o.a.s.u.DirectUpdateHandler2 end_commit_flush
   [junit4]   2> 1481099 INFO  (qtp1599809825-13390) [    ] o.a.s.u.p.LogUpdateProcessorFactory [collection1]  webapp=/bb path=/update params={waitSearcher=true&commit=true&softCommit=false&wt=javabin&version=2}{commit=} 0 0
   [junit4]   2> 1481103 INFO  (qtp1134676125-13435) [    ] o.a.s.u.DirectUpdateHandler2 start commit{,optimize=false,openSearcher=true,waitSearcher=true,expungeDeletes=false,softCommit=false,prepareCommit=false}
   [junit4]   2> 1481103 INFO  (qtp1134676125-13435) [    ] o.a.s.u.DirectUpdateHandler2 No uncommitted changes. Skipping IW.commit.
   [junit4]   2> 1481103 INFO  (qtp1134676125-13435) [    ] o.a.s.u.DirectUpdateHandler2 end_commit_flush
   [junit4]   2> 1481103 INFO  (qtp1134676125-13435) [    ] o.a.s.u.p.LogUpdateProcessorFactory [collection1]  webapp=/bb path=/update params={update.distrib=FROMLEADER&waitSearcher=true&openSearcher=true&commit=true&softCommit=false&distrib.from=https://127.0.0.1:40254/bb/collection1/&commit_end_point=true&wt=javabin&version=2&expungeDeletes=false}{commit=} 0 0
   [junit4]   2> 1481116 INFO  (qtp1711915828-13458) [    ] o.a.s.u.DirectUpdateHandler2 start commit{,optimize=false,openSearcher=true,waitSearcher=true,expungeDeletes=false,softCommit=false,prepareCommit=false}
   [junit4]   2> 1481117 INFO  (qtp1711915828-13458) [    ] o.a.s.u.DirectUpdateHandler2 No uncommitted changes. Skipping IW.commit.
   [junit4]   2> 1481117 INFO  (qtp1711915828-13458) [    ] o.a.s.u.DirectUpdateHandler2 end_commit_flush
   [junit4]   2> 1481117 INFO  (qtp1711915828-13458) [    ] o.a.s.u.p.LogUpdateProcessorFactory [collection1]  webapp=/bb path=/update params={update.distrib=FROMLEADER&waitSearcher=true&openSearcher=true&commit=true&softCommit=false&distrib.from=https://127.0.0.1:40254/bb/collection1/&commit_end_point=true&wt=javabin&version=2&expungeDeletes=false}{commit=} 0 0
   [junit4]   2> 1481117 INFO  (qtp922760773-13493) [    ] o.a.s.u.DirectUpdateHandler2 start commit{,optimize=false,openSearcher=true,waitSearcher=true,expungeDeletes=false,softCommit=false,prepareCommit=false}
   [junit4]   2> 1481117 INFO  (qtp922760773-13493) [    ] o.a.s.u.DirectUpdateHandler2 No uncommitted changes. Skipping IW.commit.
   [junit4]   2> 1481117 INFO  (qtp922760773-13493) [    ] o.a.s.u.DirectUpdateHandler2 end_commit_flush
   [junit4]   2> 1481117 INFO  (qtp922760773-13493) [    ] o.a.s.u.p.LogUpdateProcessorFactory [collection1]  webapp=/bb path=/update params={update.distrib=FROMLEADER&waitSearcher=true&openSearcher=true&commit=true&softCommit=false&distrib.from=https://127.0.0.1:40254/bb/collection1/&commit_end_point=true&wt=javabin&version=2&expungeDeletes=false}{commit=} 0 0
   [junit4]   2> 1481118 INFO  (qtp1134676125-13436) [    ] o.a.s.u.p.LogUpdateProcessorFactory [collection1]  webapp=/bb path=/update params={_stateVer_=collection1:11&waitSearcher=true&commit=true&softCommit=false&wt=javabin&version=2}{commit=} 0 17
   [junit4]   2> 1481120 INFO  (qtp1134676125-13435) [    ] o.a.s.c.S.Request [collection1]  webapp=/bb path=/select params={q=*:*&distrib=false&tests=checkShardConsistency&rows=0&wt=javabin&version=2} hits=0 status=0 QTime=0
   [junit4]   2> 1481123 INFO  (qtp1711915828-13465) [    ] o.a.s.c.S.Request [collection1]  webapp=/bb path=/select params={q=*:*&distrib=false&tests=checkShardConsistency&rows=0&wt=javabin&version=2} hits=0 status=0 QTime=0
   [junit4]   2> 1481125 INFO  (qtp922760773-13500) [    ] o.a.s.c.S.Request [collection1]  webapp=/bb path=/select params={q=*:*&distrib=false&tests=checkShardConsistency&rows=0&wt=javabin&version=2} hits=0 status=0 QTime=0
   [junit4]   2> 1483127 INFO  (qtp1599809825-13395) [    ] o.a.s.u.p.LogUpdateProcessorFactory [collection1]  webapp=/bb path=/update params={wt=javabin&version=2}{deleteByQuery=*:* (-1558265924706893824)} 0 1
   [junit4]   2> 1483130 INFO  (qtp1711915828-13463) [    ] o.a.s.u.p.LogUpdateProcessorFactory [collection1]  webapp=/bb path=/update params={update.distrib=FROMLEADER&_version_=-1558265924707942400&distrib.from=https://127.0.0.1:40254/bb/collection1/&wt=javabin&version=2}{deleteByQuery=*:* (-1558265924707942400)} 0 1
   [junit4]   2> 1483130 INFO  (qtp922760773-13498) [    ] o.a.s.u.p.LogUpdateProcessorFactory [collection1]  webapp=/bb path=/update params={update.distrib=FROMLEADER&_version_=-1558265924707942400&distrib.from=https://127.0.0.1:40254/bb/collection1/&wt=javabin&version=2}{deleteByQuery=*:* (-1558265924707942400)} 0 1
   [junit4]   2> 1483130 INFO  (qtp1134676125-13429) [    ] o.a.s.u.p.LogUpdateProcessorFactory [collection1]  webapp=/bb path=/update params={wt

[...truncated too long message...]

etSimilarityFactory, TestIBSimilarityFactory, TestFastWriter, TestJmxMonitoredMap, TestFastOutputStream, URLClassifyProcessorTest, PrimUtilsTest, DOMUtilTest, ClusterStateTest, TestUtils, ZkNodePropsTest, UUIDFieldTest, CursorPagingTest, ConnectionReuseTest, AssignTest, AsyncCallRequestStatusResponseTest, CollectionReloadTest, ConfigSetsAPITest, DeleteLastCustomShardedReplicaTest, DeleteReplicaTest, DistribJoinFromCollectionTest, LeaderFailureAfterFreshStartTest, PeerSyncReplicationTest]
   [junit4] Completed [507/692 (2!)] on J0 in 29.05s, 1 test, 1 failure <<< FAILURES!

[...truncated 199 lines...]
   [junit4] Suite: org.apache.solr.handler.admin.TestCoreAdminApis
   [junit4]   2> Creating dataDir: /home/jenkins/workspace/Lucene-Solr-master-Linux/solr/build/solr-core/test/J0/temp/solr.handler.admin.TestCoreAdminApis_8E9D7E33840CEF05-001/init-core-data-001
   [junit4]   2> 1717802 INFO  (SUITE-TestCoreAdminApis-seed#[8E9D7E33840CEF05]-worker) [    ] o.a.s.SolrTestCaseJ4 Using TrieFields
   [junit4]   2> 1717803 INFO  (SUITE-TestCoreAdminApis-seed#[8E9D7E33840CEF05]-worker) [    ] o.a.s.SolrTestCaseJ4 Randomized ssl (false) and clientAuth (false) via: @org.apache.solr.util.RandomizeSSL(reason="", ssl=0.0/0.0, value=0.0/0.0, clientAuth=0.0/0.0)
   [junit4]   2> 1717804 INFO  (TEST-TestCoreAdminApis.testCalls-seed#[8E9D7E33840CEF05]) [    ] o.a.s.SolrTestCaseJ4 ###Starting testCalls
   [junit4]   2> 1717841 INFO  (TEST-TestCoreAdminApis.testCalls-seed#[8E9D7E33840CEF05]) [    ] o.a.s.SolrTestCaseJ4 ###Ending testCalls
   [junit4]   2> NOTE: reproduce with: ant test  -Dtestcase=TestCoreAdminApis -Dtests.method=testCalls -Dtests.seed=8E9D7E33840CEF05 -Dtests.multiplier=3 -Dtests.slow=true -Dtests.locale=fr-NC -Dtests.timezone=Asia/Phnom_Penh -Dtests.asserts=true -Dtests.file.encoding=UTF-8
   [junit4] ERROR   0.04s J0 | TestCoreAdminApis.testCalls <<<
   [junit4]    > Throwable #1: java.lang.ExceptionInInitializerError
   [junit4]    > 	at __randomizedtesting.SeedInfo.seed([8E9D7E33840CEF05:BC5C615801805CA2]:0)
   [junit4]    > 	at net.sf.cglib.core.KeyFactory$Generator.generateClass(KeyFactory.java:166)
   [junit4]    > 	at net.sf.cglib.core.DefaultGeneratorStrategy.generate(DefaultGeneratorStrategy.java:25)
   [junit4]    > 	at net.sf.cglib.core.AbstractClassGenerator.create(AbstractClassGenerator.java:216)
   [junit4]    > 	at net.sf.cglib.core.KeyFactory$Generator.create(KeyFactory.java:144)
   [junit4]    > 	at net.sf.cglib.core.KeyFactory.create(KeyFactory.java:116)
   [junit4]    > 	at net.sf.cglib.core.KeyFactory.create(KeyFactory.java:108)
   [junit4]    > 	at net.sf.cglib.core.KeyFactory.create(KeyFactory.java:104)
   [junit4]    > 	at net.sf.cglib.proxy.Enhancer.<clinit>(Enhancer.java:69)
   [junit4]    > 	at org.easymock.internal.ClassProxyFactory.createEnhancer(ClassProxyFactory.java:259)
   [junit4]    > 	at org.easymock.internal.ClassProxyFactory.createProxy(ClassProxyFactory.java:174)
   [junit4]    > 	at org.easymock.internal.MocksControl.createMock(MocksControl.java:60)
   [junit4]    > 	at org.easymock.EasyMock.createMock(EasyMock.java:104)
   [junit4]    > 	at org.apache.solr.handler.admin.TestCoreAdminApis.getCoreContainerMock(TestCoreAdminApis.java:76)
   [junit4]    > 	at org.apache.solr.handler.admin.TestCoreAdminApis.testCalls(TestCoreAdminApis.java:43)
   [junit4]    > 	at java.base/jdk.internal.reflect.NativeMethodAccessorImpl.invoke0(Native Method)
   [junit4]    > 	at java.base/jdk.internal.reflect.NativeMethodAccessorImpl.invoke(NativeMethodAccessorImpl.java:62)
   [junit4]    > 	at java.base/jdk.internal.reflect.DelegatingMethodAccessorImpl.invoke(DelegatingMethodAccessorImpl.java:43)
   [junit4]    > 	at java.base/java.lang.reflect.Method.invoke(Method.java:543)
   [junit4]    > 	at java.base/java.lang.Thread.run(Thread.java:844)
   [junit4]    > Caused by: java.lang.reflect.InaccessibleObjectException: Unable to make protected final java.lang.Class java.lang.ClassLoader.defineClass(java.lang.String,byte[],int,int,java.security.ProtectionDomain) throws java.lang.ClassFormatError accessible: module java.base does not "opens java.lang" to unnamed module @439013a0
   [junit4]    > 	at java.base/java.lang.reflect.AccessibleObject.checkCanSetAccessible(AccessibleObject.java:207)
   [junit4]    > 	at java.base/java.lang.reflect.Method.checkCanSetAccessible(Method.java:192)
   [junit4]    > 	at java.base/java.lang.reflect.Method.setAccessible(Method.java:186)
   [junit4]    > 	at net.sf.cglib.core.ReflectUtils$2.run(ReflectUtils.java:56)
   [junit4]    > 	at java.base/java.security.AccessController.doPrivileged(Native Method)
   [junit4]    > 	at net.sf.cglib.core.ReflectUtils.<clinit>(ReflectUtils.java:46)
   [junit4]    > 	... 52 more
   [junit4]   2> 1717842 INFO  (SUITE-TestCoreAdminApis-seed#[8E9D7E33840CEF05]-worker) [    ] o.a.s.SolrTestCaseJ4 ###deleteCore
   [junit4]   2> NOTE: leaving temporary files on disk at: /home/jenkins/workspace/Lucene-Solr-master-Linux/solr/build/solr-core/test/J0/temp/solr.handler.admin.TestCoreAdminApis_8E9D7E33840CEF05-001
   [junit4]   2> NOTE: test params are: codec=Asserting(Lucene70), sim=RandomSimilarity(queryNorm=false): {}, locale=fr-NC, timezone=Asia/Phnom_Penh
   [junit4]   2> NOTE: Linux 4.4.0-53-generic amd64/Oracle Corporation 9-ea (64-bit)/cpus=12,threads=1,free=136660656,total=530055168
   [junit4]   2> NOTE: All tests run in this JVM: [StandardRequestHandlerTest, RecoveryAfterSoftCommitTest, TestLeaderElectionZkExpiry, TestSolrConfigHandlerConcurrent, DisMaxRequestHandlerTest, TestLRUCache, DefaultValueUpdateProcessorTest, TestFunctionQuery, TestStressCloudBlindAtomicUpdates, TestCloudPivotFacet, RuleEngineTest, OverseerCollectionConfigSetProcessorTest, DistributedQueryComponentOptimizationTest, HdfsWriteToMultipleCollectionsTest, ConnectionManagerTest, TestFieldTypeResource, TestJavabinTupleStreamParser, TestTestInjection, TestSchemalessBufferedUpdates, ForceLeaderTest, TestFieldCollectionResource, BigEndianAscendingWordSerializerTest, DistributedQueueTest, BasicZkTest, TestSolrCloudSnapshots, TemplateUpdateProcessorTest, AnalyticsMergeStrategyTest, TestSolrDeletionPolicy2, AddBlockUpdateTest, TestOmitPositions, VersionInfoTest, SolrCLIZkUtilsTest, QueryElevationComponentTest, TestTolerantUpdateProcessorCloud, DistributedFacetPivotSmallTest, ReturnFieldsTest, RegexBoostProcessorTest, TestPathTrie, SyncSliceTest, DistribCursorPagingTest, HdfsCollectionsAPIDistributedZkTest, TestCodecSupport, TestReplicationHandler, CacheHeaderTest, TestBadConfig, TestSolrConfigHandler, LeaderElectionIntegrationTest, TestClassicSimilarityFactory, TestObjectReleaseTracker, TestDefaultSearchFieldResource, JavabinLoaderTest, TestAddFieldRealTimeGet, TestPerFieldSimilarityWithDefaultOverride, TestOrdValues, MultiThreadedOCPTest, TestReplicationHandlerBackup, TestFaceting, TestDFRSimilarityFactory, LeaderInitiatedRecoveryOnShardRestartTest, UUIDUpdateProcessorFallbackTest, TestHashQParserPlugin, PathHierarchyTokenizerFactoryTest, TestRandomFaceting, DateMathParserTest, TestDocTermOrds, TestManagedSchemaThreadSafety, CurrencyFieldOpenExchangeTest, BufferStoreTest, TestRandomRequestDistribution, TestDistributedSearch, MergeStrategyTest, TestFieldCacheSanityChecker, BooleanFieldTest, TestRuleBasedAuthorizationPlugin, TestBulkSchemaAPI, FullHLLTest, TestLockTree, DeleteInactiveReplicaTest, TestNRTOpen, QueryEqualityTest, PluginInfoTest, ScriptEngineTest, TestMiniSolrCloudClusterSSL, PeerSyncTest, CollectionStateFormat2Test, TestSolrFieldCacheMBean, TestAuthenticationFramework, TestExportWriter, TestSolr4Spatial, NumericFieldsTest, TestRandomDVFaceting, TestExpandComponent, SolrRequestParserTest, SolrMetricManagerTest, PreAnalyzedFieldManagedSchemaCloudTest, ReplicaListTransformerTest, TestBlendedInfixSuggestions, TestRangeQuery, SystemInfoHandlerTest, TriLevelCompositeIdRoutingTest, TestRTGBase, TestImplicitCoreProperties, PingRequestHandlerTest, TestImpersonationWithHadoopAuth, TestFoldingMultitermQuery, BasicDistributedZkTest, CdcrBootstrapTest, ClassificationUpdateProcessorFactoryTest, SolrSlf4jReporterTest, TestHighlightDedupGrouping, ParsingFieldUpdateProcessorsTest, TestConfigSetImmutable, TestRawTransformer, MinimalSchemaTest, TestManagedStopFilterFactory, OverseerTest, RecoveryZkTest, FullSolrCloudDistribCmdsTest, LeaderElectionTest, ZkControllerTest, TestRealTimeGet, HardAutoCommitTest, TestCoreContainer, SimpleFacetsTest, StatsComponentTest, ConvertedLegacyTest, TestSort, DistributedQueryElevationComponentTest, TestExtendedDismaxParser, SuggesterTest, WordBreakSolrSpellCheckerTest, SolrCoreCheckLockOnStartupTest, TestUpdate, TestRemoteStreaming, TestSolrDeletionPolicy1, DebugComponentTest, DirectSolrSpellCheckerTest, FileBasedSpellCheckerTest, TermsComponentTest, DocumentBuilderTest, TestIndexingPerformance, TestSolrQueryParser, LoggingHandlerTest, QueryParsingTest, BinaryUpdateRequestHandlerTest, SearchHandlerTest, TestLMDirichletSimilarityFactory, TestIBSimilarityFactory, TestFastWriter, TestJmxMonitoredMap, TestFastOutputStream, URLClassifyProcessorTest, PrimUtilsTest, DOMUtilTest, ClusterStateTest, TestUtils, ZkNodePropsTest, UUIDFieldTest, CursorPagingTest, ConnectionReuseTest, AssignTest, AsyncCallRequestStatusResponseTest, CollectionReloadTest, ConfigSetsAPITest, DeleteLastCustomShardedReplicaTest, DeleteReplicaTest, DistribJoinFromCollectionTest, LeaderFailureAfterFreshStartTest, PeerSyncReplicationTest, TestCloudRecovery, TestDistribDocBasedVersion, TestLocalFSCloudBackupRestore, TestRebalanceLeaders, TestSegmentSorting, TestTolerantUpdateProcessorRandomCloud, DirectoryFactoryTest, QueryResultKeyTest, TestConfigSetProperties, TestConfigSets, TestCorePropertiesReload, TestCustomStream, RequestLoggingTest, TestBlobHandler, TestSystemCollAutoCreate, SegmentsInfoRequestHandlerTest, TestCollectionAPIs, TestConfigsApi, TestCoreAdminApis]
   [junit4] Completed [571/692 (3!)] on J0 in 0.05s, 1 test, 1 error <<< FAILURES!

[...truncated 51919 lines...]


Mime
View raw message