lucene-dev mailing list archives

Site index · List index
Message view « Date » · « Thread »
Top « Date » · « Thread »
From Policeman Jenkins Server <jenk...@thetaphi.de>
Subject [JENKINS-EA] Lucene-Solr-master-Linux (32bit/jdk-9-ea+153) - Build # 18890 - Still Unstable!
Date Thu, 02 Feb 2017 10:00:43 GMT
Build: https://jenkins.thetaphi.de/job/Lucene-Solr-master-Linux/18890/
Java: 32bit/jdk-9-ea+153 -client -XX:+UseG1GC

3 tests failed.
FAILED:  org.apache.lucene.search.grouping.TestGrouping.testRandom

Error Message:
expected:<2526> but was:<1818>

Stack Trace:
java.lang.AssertionError: expected:<2526> but was:<1818>
	at __randomizedtesting.SeedInfo.seed([381A6A2BB3B21736:4A564F2402D2A145]:0)
	at org.junit.Assert.fail(Assert.java:93)
	at org.junit.Assert.failNotEquals(Assert.java:647)
	at org.junit.Assert.assertEquals(Assert.java:128)
	at org.junit.Assert.assertEquals(Assert.java:472)
	at org.junit.Assert.assertEquals(Assert.java:456)
	at org.apache.lucene.search.grouping.TestGrouping.assertEquals(TestGrouping.java:1299)
	at org.apache.lucene.search.grouping.TestGrouping.testRandom(TestGrouping.java:1141)
	at java.base/jdk.internal.reflect.NativeMethodAccessorImpl.invoke0(Native Method)
	at java.base/jdk.internal.reflect.NativeMethodAccessorImpl.invoke(NativeMethodAccessorImpl.java:62)
	at java.base/jdk.internal.reflect.DelegatingMethodAccessorImpl.invoke(DelegatingMethodAccessorImpl.java:43)
	at java.base/java.lang.reflect.Method.invoke(Method.java:543)
	at com.carrotsearch.randomizedtesting.RandomizedRunner.invoke(RandomizedRunner.java:1713)
	at com.carrotsearch.randomizedtesting.RandomizedRunner$8.evaluate(RandomizedRunner.java:907)
	at com.carrotsearch.randomizedtesting.RandomizedRunner$9.evaluate(RandomizedRunner.java:943)
	at com.carrotsearch.randomizedtesting.RandomizedRunner$10.evaluate(RandomizedRunner.java:957)
	at org.apache.lucene.util.TestRuleSetupTeardownChained$1.evaluate(TestRuleSetupTeardownChained.java:49)
	at org.apache.lucene.util.AbstractBeforeAfterRule$1.evaluate(AbstractBeforeAfterRule.java:45)
	at org.apache.lucene.util.TestRuleThreadAndTestName$1.evaluate(TestRuleThreadAndTestName.java:48)
	at org.apache.lucene.util.TestRuleIgnoreAfterMaxFailures$1.evaluate(TestRuleIgnoreAfterMaxFailures.java:64)
	at org.apache.lucene.util.TestRuleMarkFailure$1.evaluate(TestRuleMarkFailure.java:47)
	at com.carrotsearch.randomizedtesting.rules.StatementAdapter.evaluate(StatementAdapter.java:36)
	at com.carrotsearch.randomizedtesting.ThreadLeakControl$StatementRunner.run(ThreadLeakControl.java:368)
	at com.carrotsearch.randomizedtesting.ThreadLeakControl.forkTimeoutingTask(ThreadLeakControl.java:817)
	at com.carrotsearch.randomizedtesting.ThreadLeakControl$3.evaluate(ThreadLeakControl.java:468)
	at com.carrotsearch.randomizedtesting.RandomizedRunner.runSingleTest(RandomizedRunner.java:916)
	at com.carrotsearch.randomizedtesting.RandomizedRunner$5.evaluate(RandomizedRunner.java:802)
	at com.carrotsearch.randomizedtesting.RandomizedRunner$6.evaluate(RandomizedRunner.java:852)
	at com.carrotsearch.randomizedtesting.RandomizedRunner$7.evaluate(RandomizedRunner.java:863)
	at org.apache.lucene.util.AbstractBeforeAfterRule$1.evaluate(AbstractBeforeAfterRule.java:45)
	at com.carrotsearch.randomizedtesting.rules.StatementAdapter.evaluate(StatementAdapter.java:36)
	at org.apache.lucene.util.TestRuleStoreClassName$1.evaluate(TestRuleStoreClassName.java:41)
	at com.carrotsearch.randomizedtesting.rules.NoShadowingOrOverridesOnMethodsRule$1.evaluate(NoShadowingOrOverridesOnMethodsRule.java:40)
	at com.carrotsearch.randomizedtesting.rules.NoShadowingOrOverridesOnMethodsRule$1.evaluate(NoShadowingOrOverridesOnMethodsRule.java:40)
	at com.carrotsearch.randomizedtesting.rules.StatementAdapter.evaluate(StatementAdapter.java:36)
	at com.carrotsearch.randomizedtesting.rules.StatementAdapter.evaluate(StatementAdapter.java:36)
	at org.apache.lucene.util.TestRuleAssertionsRequired$1.evaluate(TestRuleAssertionsRequired.java:53)
	at org.apache.lucene.util.TestRuleMarkFailure$1.evaluate(TestRuleMarkFailure.java:47)
	at org.apache.lucene.util.TestRuleIgnoreAfterMaxFailures$1.evaluate(TestRuleIgnoreAfterMaxFailures.java:64)
	at org.apache.lucene.util.TestRuleIgnoreTestSuites$1.evaluate(TestRuleIgnoreTestSuites.java:54)
	at com.carrotsearch.randomizedtesting.rules.StatementAdapter.evaluate(StatementAdapter.java:36)
	at com.carrotsearch.randomizedtesting.ThreadLeakControl$StatementRunner.run(ThreadLeakControl.java:368)
	at java.base/java.lang.Thread.run(Thread.java:844)


FAILED:  org.apache.solr.handler.admin.TestApiFramework.testFramework

Error Message:


Stack Trace:
java.lang.ExceptionInInitializerError
	at __randomizedtesting.SeedInfo.seed([D661D5D9DBFD6DF0:C1171FFEDD2981CD]:0)
	at net.sf.cglib.core.KeyFactory$Generator.generateClass(KeyFactory.java:166)
	at net.sf.cglib.core.DefaultGeneratorStrategy.generate(DefaultGeneratorStrategy.java:25)
	at net.sf.cglib.core.AbstractClassGenerator.create(AbstractClassGenerator.java:216)
	at net.sf.cglib.core.KeyFactory$Generator.create(KeyFactory.java:144)
	at net.sf.cglib.core.KeyFactory.create(KeyFactory.java:116)
	at net.sf.cglib.core.KeyFactory.create(KeyFactory.java:108)
	at net.sf.cglib.core.KeyFactory.create(KeyFactory.java:104)
	at net.sf.cglib.proxy.Enhancer.<clinit>(Enhancer.java:69)
	at org.easymock.internal.ClassProxyFactory.createEnhancer(ClassProxyFactory.java:259)
	at org.easymock.internal.ClassProxyFactory.createProxy(ClassProxyFactory.java:174)
	at org.easymock.internal.MocksControl.createMock(MocksControl.java:60)
	at org.easymock.EasyMock.createMock(EasyMock.java:104)
	at org.apache.solr.handler.admin.TestCoreAdminApis.getCoreContainerMock(TestCoreAdminApis.java:76)
	at org.apache.solr.handler.admin.TestApiFramework.testFramework(TestApiFramework.java:59)
	at java.base/jdk.internal.reflect.NativeMethodAccessorImpl.invoke0(Native Method)
	at java.base/jdk.internal.reflect.NativeMethodAccessorImpl.invoke(NativeMethodAccessorImpl.java:62)
	at java.base/jdk.internal.reflect.DelegatingMethodAccessorImpl.invoke(DelegatingMethodAccessorImpl.java:43)
	at java.base/java.lang.reflect.Method.invoke(Method.java:543)
	at com.carrotsearch.randomizedtesting.RandomizedRunner.invoke(RandomizedRunner.java:1713)
	at com.carrotsearch.randomizedtesting.RandomizedRunner$8.evaluate(RandomizedRunner.java:907)
	at com.carrotsearch.randomizedtesting.RandomizedRunner$9.evaluate(RandomizedRunner.java:943)
	at com.carrotsearch.randomizedtesting.RandomizedRunner$10.evaluate(RandomizedRunner.java:957)
	at com.carrotsearch.randomizedtesting.rules.SystemPropertiesRestoreRule$1.evaluate(SystemPropertiesRestoreRule.java:57)
	at org.apache.lucene.util.TestRuleSetupTeardownChained$1.evaluate(TestRuleSetupTeardownChained.java:49)
	at org.apache.lucene.util.AbstractBeforeAfterRule$1.evaluate(AbstractBeforeAfterRule.java:45)
	at org.apache.lucene.util.TestRuleThreadAndTestName$1.evaluate(TestRuleThreadAndTestName.java:48)
	at org.apache.lucene.util.TestRuleIgnoreAfterMaxFailures$1.evaluate(TestRuleIgnoreAfterMaxFailures.java:64)
	at org.apache.lucene.util.TestRuleMarkFailure$1.evaluate(TestRuleMarkFailure.java:47)
	at com.carrotsearch.randomizedtesting.rules.StatementAdapter.evaluate(StatementAdapter.java:36)
	at com.carrotsearch.randomizedtesting.ThreadLeakControl$StatementRunner.run(ThreadLeakControl.java:368)
	at com.carrotsearch.randomizedtesting.ThreadLeakControl.forkTimeoutingTask(ThreadLeakControl.java:817)
	at com.carrotsearch.randomizedtesting.ThreadLeakControl$3.evaluate(ThreadLeakControl.java:468)
	at com.carrotsearch.randomizedtesting.RandomizedRunner.runSingleTest(RandomizedRunner.java:916)
	at com.carrotsearch.randomizedtesting.RandomizedRunner$5.evaluate(RandomizedRunner.java:802)
	at com.carrotsearch.randomizedtesting.RandomizedRunner$6.evaluate(RandomizedRunner.java:852)
	at com.carrotsearch.randomizedtesting.RandomizedRunner$7.evaluate(RandomizedRunner.java:863)
	at com.carrotsearch.randomizedtesting.rules.StatementAdapter.evaluate(StatementAdapter.java:36)
	at com.carrotsearch.randomizedtesting.rules.SystemPropertiesRestoreRule$1.evaluate(SystemPropertiesRestoreRule.java:57)
	at org.apache.lucene.util.AbstractBeforeAfterRule$1.evaluate(AbstractBeforeAfterRule.java:45)
	at com.carrotsearch.randomizedtesting.rules.StatementAdapter.evaluate(StatementAdapter.java:36)
	at org.apache.lucene.util.TestRuleStoreClassName$1.evaluate(TestRuleStoreClassName.java:41)
	at com.carrotsearch.randomizedtesting.rules.NoShadowingOrOverridesOnMethodsRule$1.evaluate(NoShadowingOrOverridesOnMethodsRule.java:40)
	at com.carrotsearch.randomizedtesting.rules.NoShadowingOrOverridesOnMethodsRule$1.evaluate(NoShadowingOrOverridesOnMethodsRule.java:40)
	at com.carrotsearch.randomizedtesting.rules.StatementAdapter.evaluate(StatementAdapter.java:36)
	at com.carrotsearch.randomizedtesting.rules.StatementAdapter.evaluate(StatementAdapter.java:36)
	at org.apache.lucene.util.TestRuleAssertionsRequired$1.evaluate(TestRuleAssertionsRequired.java:53)
	at org.apache.lucene.util.TestRuleMarkFailure$1.evaluate(TestRuleMarkFailure.java:47)
	at org.apache.lucene.util.TestRuleIgnoreAfterMaxFailures$1.evaluate(TestRuleIgnoreAfterMaxFailures.java:64)
	at org.apache.lucene.util.TestRuleIgnoreTestSuites$1.evaluate(TestRuleIgnoreTestSuites.java:54)
	at com.carrotsearch.randomizedtesting.rules.StatementAdapter.evaluate(StatementAdapter.java:36)
	at com.carrotsearch.randomizedtesting.ThreadLeakControl$StatementRunner.run(ThreadLeakControl.java:368)
	at java.base/java.lang.Thread.run(Thread.java:844)
Caused by: java.lang.reflect.InaccessibleObjectException: Unable to make protected final java.lang.Class
java.lang.ClassLoader.defineClass(java.lang.String,byte[],int,int,java.security.ProtectionDomain)
throws java.lang.ClassFormatError accessible: module java.base does not "opens java.lang"
to unnamed module @f1ca63
	at java.base/java.lang.reflect.AccessibleObject.checkCanSetAccessible(AccessibleObject.java:207)
	at java.base/java.lang.reflect.Method.checkCanSetAccessible(Method.java:192)
	at java.base/java.lang.reflect.Method.setAccessible(Method.java:186)
	at net.sf.cglib.core.ReflectUtils$2.run(ReflectUtils.java:56)
	at java.base/java.security.AccessController.doPrivileged(Native Method)
	at net.sf.cglib.core.ReflectUtils.<clinit>(ReflectUtils.java:46)
	... 52 more


FAILED:  org.apache.solr.handler.admin.TestCoreAdminApis.testCalls

Error Message:


Stack Trace:
java.lang.ExceptionInInitializerError
	at __randomizedtesting.SeedInfo.seed([D661D5D9DBFD6DF0:E4A0CAB25E71DE57]:0)
	at net.sf.cglib.core.KeyFactory$Generator.generateClass(KeyFactory.java:166)
	at net.sf.cglib.core.DefaultGeneratorStrategy.generate(DefaultGeneratorStrategy.java:25)
	at net.sf.cglib.core.AbstractClassGenerator.create(AbstractClassGenerator.java:216)
	at net.sf.cglib.core.KeyFactory$Generator.create(KeyFactory.java:144)
	at net.sf.cglib.core.KeyFactory.create(KeyFactory.java:116)
	at net.sf.cglib.core.KeyFactory.create(KeyFactory.java:108)
	at net.sf.cglib.core.KeyFactory.create(KeyFactory.java:104)
	at net.sf.cglib.proxy.Enhancer.<clinit>(Enhancer.java:69)
	at org.easymock.internal.ClassProxyFactory.createEnhancer(ClassProxyFactory.java:259)
	at org.easymock.internal.ClassProxyFactory.createProxy(ClassProxyFactory.java:174)
	at org.easymock.internal.MocksControl.createMock(MocksControl.java:60)
	at org.easymock.EasyMock.createMock(EasyMock.java:104)
	at org.apache.solr.handler.admin.TestCoreAdminApis.getCoreContainerMock(TestCoreAdminApis.java:76)
	at org.apache.solr.handler.admin.TestCoreAdminApis.testCalls(TestCoreAdminApis.java:43)
	at java.base/jdk.internal.reflect.NativeMethodAccessorImpl.invoke0(Native Method)
	at java.base/jdk.internal.reflect.NativeMethodAccessorImpl.invoke(NativeMethodAccessorImpl.java:62)
	at java.base/jdk.internal.reflect.DelegatingMethodAccessorImpl.invoke(DelegatingMethodAccessorImpl.java:43)
	at java.base/java.lang.reflect.Method.invoke(Method.java:543)
	at com.carrotsearch.randomizedtesting.RandomizedRunner.invoke(RandomizedRunner.java:1713)
	at com.carrotsearch.randomizedtesting.RandomizedRunner$8.evaluate(RandomizedRunner.java:907)
	at com.carrotsearch.randomizedtesting.RandomizedRunner$9.evaluate(RandomizedRunner.java:943)
	at com.carrotsearch.randomizedtesting.RandomizedRunner$10.evaluate(RandomizedRunner.java:957)
	at com.carrotsearch.randomizedtesting.rules.SystemPropertiesRestoreRule$1.evaluate(SystemPropertiesRestoreRule.java:57)
	at org.apache.lucene.util.TestRuleSetupTeardownChained$1.evaluate(TestRuleSetupTeardownChained.java:49)
	at org.apache.lucene.util.AbstractBeforeAfterRule$1.evaluate(AbstractBeforeAfterRule.java:45)
	at org.apache.lucene.util.TestRuleThreadAndTestName$1.evaluate(TestRuleThreadAndTestName.java:48)
	at org.apache.lucene.util.TestRuleIgnoreAfterMaxFailures$1.evaluate(TestRuleIgnoreAfterMaxFailures.java:64)
	at org.apache.lucene.util.TestRuleMarkFailure$1.evaluate(TestRuleMarkFailure.java:47)
	at com.carrotsearch.randomizedtesting.rules.StatementAdapter.evaluate(StatementAdapter.java:36)
	at com.carrotsearch.randomizedtesting.ThreadLeakControl$StatementRunner.run(ThreadLeakControl.java:368)
	at com.carrotsearch.randomizedtesting.ThreadLeakControl.forkTimeoutingTask(ThreadLeakControl.java:817)
	at com.carrotsearch.randomizedtesting.ThreadLeakControl$3.evaluate(ThreadLeakControl.java:468)
	at com.carrotsearch.randomizedtesting.RandomizedRunner.runSingleTest(RandomizedRunner.java:916)
	at com.carrotsearch.randomizedtesting.RandomizedRunner$5.evaluate(RandomizedRunner.java:802)
	at com.carrotsearch.randomizedtesting.RandomizedRunner$6.evaluate(RandomizedRunner.java:852)
	at com.carrotsearch.randomizedtesting.RandomizedRunner$7.evaluate(RandomizedRunner.java:863)
	at com.carrotsearch.randomizedtesting.rules.StatementAdapter.evaluate(StatementAdapter.java:36)
	at com.carrotsearch.randomizedtesting.rules.SystemPropertiesRestoreRule$1.evaluate(SystemPropertiesRestoreRule.java:57)
	at org.apache.lucene.util.AbstractBeforeAfterRule$1.evaluate(AbstractBeforeAfterRule.java:45)
	at com.carrotsearch.randomizedtesting.rules.StatementAdapter.evaluate(StatementAdapter.java:36)
	at org.apache.lucene.util.TestRuleStoreClassName$1.evaluate(TestRuleStoreClassName.java:41)
	at com.carrotsearch.randomizedtesting.rules.NoShadowingOrOverridesOnMethodsRule$1.evaluate(NoShadowingOrOverridesOnMethodsRule.java:40)
	at com.carrotsearch.randomizedtesting.rules.NoShadowingOrOverridesOnMethodsRule$1.evaluate(NoShadowingOrOverridesOnMethodsRule.java:40)
	at com.carrotsearch.randomizedtesting.rules.StatementAdapter.evaluate(StatementAdapter.java:36)
	at com.carrotsearch.randomizedtesting.rules.StatementAdapter.evaluate(StatementAdapter.java:36)
	at org.apache.lucene.util.TestRuleAssertionsRequired$1.evaluate(TestRuleAssertionsRequired.java:53)
	at org.apache.lucene.util.TestRuleMarkFailure$1.evaluate(TestRuleMarkFailure.java:47)
	at org.apache.lucene.util.TestRuleIgnoreAfterMaxFailures$1.evaluate(TestRuleIgnoreAfterMaxFailures.java:64)
	at org.apache.lucene.util.TestRuleIgnoreTestSuites$1.evaluate(TestRuleIgnoreTestSuites.java:54)
	at com.carrotsearch.randomizedtesting.rules.StatementAdapter.evaluate(StatementAdapter.java:36)
	at com.carrotsearch.randomizedtesting.ThreadLeakControl$StatementRunner.run(ThreadLeakControl.java:368)
	at java.base/java.lang.Thread.run(Thread.java:844)
Caused by: java.lang.reflect.InaccessibleObjectException: Unable to make protected final java.lang.Class
java.lang.ClassLoader.defineClass(java.lang.String,byte[],int,int,java.security.ProtectionDomain)
throws java.lang.ClassFormatError accessible: module java.base does not "opens java.lang"
to unnamed module @16d22e9
	at java.base/java.lang.reflect.AccessibleObject.checkCanSetAccessible(AccessibleObject.java:207)
	at java.base/java.lang.reflect.Method.checkCanSetAccessible(Method.java:192)
	at java.base/java.lang.reflect.Method.setAccessible(Method.java:186)
	at net.sf.cglib.core.ReflectUtils$2.run(ReflectUtils.java:56)
	at java.base/java.security.AccessController.doPrivileged(Native Method)
	at net.sf.cglib.core.ReflectUtils.<clinit>(ReflectUtils.java:46)
	... 52 more




Build Log:
[...truncated 7029 lines...]
   [junit4] Suite: org.apache.lucene.search.grouping.TestGrouping
   [junit4]   2> NOTE: reproduce with: ant test  -Dtestcase=TestGrouping -Dtests.method=testRandom
-Dtests.seed=381A6A2BB3B21736 -Dtests.multiplier=3 -Dtests.slow=true -Dtests.locale=nyn -Dtests.timezone=Antarctica/McMurdo
-Dtests.asserts=true -Dtests.file.encoding=US-ASCII
   [junit4] FAILURE 8.72s J0 | TestGrouping.testRandom <<<
   [junit4]    > Throwable #1: java.lang.AssertionError: expected:<2526> but was:<1818>
   [junit4]    > 	at __randomizedtesting.SeedInfo.seed([381A6A2BB3B21736:4A564F2402D2A145]:0)
   [junit4]    > 	at org.apache.lucene.search.grouping.TestGrouping.assertEquals(TestGrouping.java:1299)
   [junit4]    > 	at org.apache.lucene.search.grouping.TestGrouping.testRandom(TestGrouping.java:1141)
   [junit4]    > 	at java.base/jdk.internal.reflect.NativeMethodAccessorImpl.invoke0(Native
Method)
   [junit4]    > 	at java.base/jdk.internal.reflect.NativeMethodAccessorImpl.invoke(NativeMethodAccessorImpl.java:62)
   [junit4]    > 	at java.base/jdk.internal.reflect.DelegatingMethodAccessorImpl.invoke(DelegatingMethodAccessorImpl.java:43)
   [junit4]    > 	at java.base/java.lang.reflect.Method.invoke(Method.java:543)
   [junit4]    > 	at java.base/java.lang.Thread.run(Thread.java:844)
   [junit4]   2> NOTE: test params are: codec=Asserting(Lucene70): {groupend=PostingsFormat(name=Direct),
sort1=PostingsFormat(name=LuceneVarGapFixedInterval), sort2=PostingsFormat(name=Direct), content=PostingsFormat(name=LuceneVarGapDocFreqInterval),
group=PostingsFormat(name=LuceneVarGapFixedInterval)}, docValues:{groupend=DocValuesFormat(name=Lucene70),
author=DocValuesFormat(name=Memory), sort1=DocValuesFormat(name=Memory), id=DocValuesFormat(name=Memory),
sort2=DocValuesFormat(name=Lucene70), content=DocValuesFormat(name=Direct), group=DocValuesFormat(name=Memory)},
maxPointsInLeafNode=1292, maxMBSortInHeap=6.668104559353747, sim=RandomSimilarity(queryNorm=true):
{content=DFI(Standardized)}, locale=nyn, timezone=Antarctica/McMurdo
   [junit4]   2> NOTE: Linux 4.4.0-53-generic i386/Oracle Corporation 9-ea (32-bit)/cpus=12,threads=1,free=23290544,total=79691776
   [junit4]   2> NOTE: All tests run in this JVM: [TestGrouping]
   [junit4] Completed [6/6 (1!)] on J0 in 9.64s, 2 tests, 1 failure <<< FAILURES!

[...truncated 5593 lines...]
   [junit4] Suite: org.apache.solr.handler.admin.TestApiFramework
   [junit4]   2> Creating dataDir: /home/jenkins/workspace/Lucene-Solr-master-Linux/solr/build/solr-core/test/J2/temp/solr.handler.admin.TestApiFramework_D661D5D9DBFD6DF0-001/init-core-data-001
   [junit4]   2> 2230438 INFO  (SUITE-TestApiFramework-seed#[D661D5D9DBFD6DF0]-worker)
[    ] o.a.s.SolrTestCaseJ4 Using TrieFields
   [junit4]   2> 2230440 INFO  (SUITE-TestApiFramework-seed#[D661D5D9DBFD6DF0]-worker)
[    ] o.a.s.SolrTestCaseJ4 Randomized ssl (false) and clientAuth (false) via: @org.apache.solr.util.RandomizeSSL(reason="",
ssl=0.0/0.0, value=0.0/0.0, clientAuth=0.0/0.0)
   [junit4]   2> 2230441 INFO  (TEST-TestApiFramework.testTrailingTemplatePaths-seed#[D661D5D9DBFD6DF0])
[    ] o.a.s.SolrTestCaseJ4 ###Starting testTrailingTemplatePaths
   [junit4]   2> 2230441 INFO  (TEST-TestApiFramework.testTrailingTemplatePaths-seed#[D661D5D9DBFD6DF0])
[    ] o.a.s.SolrTestCaseJ4 ###Ending testTrailingTemplatePaths
   [junit4]   2> 2230442 INFO  (TEST-TestApiFramework.testFramework-seed#[D661D5D9DBFD6DF0])
[    ] o.a.s.SolrTestCaseJ4 ###Starting testFramework
   [junit4]   2> 2230482 INFO  (TEST-TestApiFramework.testFramework-seed#[D661D5D9DBFD6DF0])
[    ] o.a.s.SolrTestCaseJ4 ###Ending testFramework
   [junit4]   2> NOTE: reproduce with: ant test  -Dtestcase=TestApiFramework -Dtests.method=testFramework
-Dtests.seed=D661D5D9DBFD6DF0 -Dtests.multiplier=3 -Dtests.slow=true -Dtests.locale=pt-ST
-Dtests.timezone=Europe/Tirane -Dtests.asserts=true -Dtests.file.encoding=US-ASCII
   [junit4] ERROR   0.04s J2 | TestApiFramework.testFramework <<<
   [junit4]    > Throwable #1: java.lang.ExceptionInInitializerError
   [junit4]    > 	at __randomizedtesting.SeedInfo.seed([D661D5D9DBFD6DF0:C1171FFEDD2981CD]:0)
   [junit4]    > 	at net.sf.cglib.core.KeyFactory$Generator.generateClass(KeyFactory.java:166)
   [junit4]    > 	at net.sf.cglib.core.DefaultGeneratorStrategy.generate(DefaultGeneratorStrategy.java:25)
   [junit4]    > 	at net.sf.cglib.core.AbstractClassGenerator.create(AbstractClassGenerator.java:216)
   [junit4]    > 	at net.sf.cglib.core.KeyFactory$Generator.create(KeyFactory.java:144)
   [junit4]    > 	at net.sf.cglib.core.KeyFactory.create(KeyFactory.java:116)
   [junit4]    > 	at net.sf.cglib.core.KeyFactory.create(KeyFactory.java:108)
   [junit4]    > 	at net.sf.cglib.core.KeyFactory.create(KeyFactory.java:104)
   [junit4]    > 	at net.sf.cglib.proxy.Enhancer.<clinit>(Enhancer.java:69)
   [junit4]    > 	at org.easymock.internal.ClassProxyFactory.createEnhancer(ClassProxyFactory.java:259)
   [junit4]    > 	at org.easymock.internal.ClassProxyFactory.createProxy(ClassProxyFactory.java:174)
   [junit4]    > 	at org.easymock.internal.MocksControl.createMock(MocksControl.java:60)
   [junit4]    > 	at org.easymock.EasyMock.createMock(EasyMock.java:104)
   [junit4]    > 	at org.apache.solr.handler.admin.TestCoreAdminApis.getCoreContainerMock(TestCoreAdminApis.java:76)
   [junit4]    > 	at org.apache.solr.handler.admin.TestApiFramework.testFramework(TestApiFramework.java:59)
   [junit4]    > 	at java.base/jdk.internal.reflect.NativeMethodAccessorImpl.invoke0(Native
Method)
   [junit4]    > 	at java.base/jdk.internal.reflect.NativeMethodAccessorImpl.invoke(NativeMethodAccessorImpl.java:62)
   [junit4]    > 	at java.base/jdk.internal.reflect.DelegatingMethodAccessorImpl.invoke(DelegatingMethodAccessorImpl.java:43)
   [junit4]    > 	at java.base/java.lang.reflect.Method.invoke(Method.java:543)
   [junit4]    > 	at java.base/java.lang.Thread.run(Thread.java:844)
   [junit4]    > Caused by: java.lang.reflect.InaccessibleObjectException: Unable to make
protected final java.lang.Class java.lang.ClassLoader.defineClass(java.lang.String,byte[],int,int,java.security.ProtectionDomain)
throws java.lang.ClassFormatError accessible: module java.base does not "opens java.lang"
to unnamed module @f1ca63
   [junit4]    > 	at java.base/java.lang.reflect.AccessibleObject.checkCanSetAccessible(AccessibleObject.java:207)
   [junit4]    > 	at java.base/java.lang.reflect.Method.checkCanSetAccessible(Method.java:192)
   [junit4]    > 	at java.base/java.lang.reflect.Method.setAccessible(Method.java:186)
   [junit4]    > 	at net.sf.cglib.core.ReflectUtils$2.run(ReflectUtils.java:56)
   [junit4]    > 	at java.base/java.security.AccessController.doPrivileged(Native Method)
   [junit4]    > 	at net.sf.cglib.core.ReflectUtils.<clinit>(ReflectUtils.java:46)
   [junit4]    > 	... 52 more
   [junit4]   2> 2230484 INFO  (SUITE-TestApiFramework-seed#[D661D5D9DBFD6DF0]-worker)
[    ] o.a.s.SolrTestCaseJ4 ###deleteCore
   [junit4]   2> NOTE: leaving temporary files on disk at: /home/jenkins/workspace/Lucene-Solr-master-Linux/solr/build/solr-core/test/J2/temp/solr.handler.admin.TestApiFramework_D661D5D9DBFD6DF0-001
   [junit4]   2> NOTE: test params are: codec=DummyCompressingStoredFields(storedFieldsFormat=CompressingStoredFieldsFormat(compressionMode=DUMMY,
chunkSize=10910, maxDocsPerChunk=3, blockSize=186), termVectorsFormat=CompressingTermVectorsFormat(compressionMode=DUMMY,
chunkSize=10910, blockSize=186)), sim=RandomSimilarity(queryNorm=false): {}, locale=pt-ST,
timezone=Europe/Tirane
   [junit4]   2> NOTE: Linux 4.4.0-53-generic i386/Oracle Corporation 9-ea (32-bit)/cpus=12,threads=1,free=190404600,total=536870912
   [junit4]   2> NOTE: All tests run in this JVM: [TestCollapseQParserPlugin, TestWriterPerf,
TestCoreDiscovery, TestRecovery, TestSort, TestBulkSchemaConcurrent, TestLuceneMatchVersion,
TestFieldTypeCollectionResource, TestClusterStateMutator, HdfsUnloadDistributedZkTest, TestUniqueKeyFieldResource,
HdfsSyncSliceTest, BlobRepositoryCloudTest, PrimUtilsTest, TestLMDirichletSimilarityFactory,
BadCopyFieldTest, TestSimpleQParserPlugin, FullSolrCloudDistribCmdsTest, TestGroupingSearch,
SimpleCollectionCreateDeleteTest, BasicDistributedZk2Test, TestRandomFlRTGCloud, BaseCdcrDistributedZkTest,
TestSizeLimitedDistributedMap, TestRecoveryHdfs, CoreSorterTest, TestDocSet, SolrCoreCheckLockOnStartupTest,
DistributedFacetExistsSmallTest, HardAutoCommitTest, TestFieldCacheReopen, TestGraphMLResponseWriter,
TestExtendedDismaxParser, TestConfigSetsAPI, TestSolrCloudWithSecureImpersonation, SolrMetricsIntegrationTest,
SolrCoreMetricManagerTest, TestCollationField, FieldMutatingUpdateProcessorTest, HdfsLockFactoryTest,
TestIntervalFaceting, ResourceLoaderTest, TestUnifiedSolrHighlighter, TestScoreJoinQPScore,
SortSpecParsingTest, BigEndianAscendingWordDeserializerTest, TestSSLRandomization, TestPKIAuthenticationPlugin,
ClassificationUpdateProcessorTest, TestSolrConfigHandlerCloud, TestLocalFSCloudBackupRestore,
OverseerTest, SimpleFacetsTest, HLLUtilTest, CheckHdfsIndexTest, TlogReplayBufferedWhileIndexingTest,
MissingSegmentRecoveryTest, TestReplicaProperties, PreAnalyzedFieldTest, UpdateLogTest, HdfsBasicDistributedZk2Test,
TestSolrCLIRunExample, TestConfig, EchoParamsTest, SecurityConfHandlerTest, TestReversedWildcardFilterFactory,
TestConfigOverlay, JSONWriterTest, ShowFileRequestHandlerTest, TestIBSimilarityFactory, CursorMarkTest,
DateRangeFieldTest, HttpSolrCallGetCoreTest, TestLeaderElectionWithEmptyReplica, TestHdfsBackupRestoreCore,
LukeRequestHandlerTest, DirectUpdateHandlerOptimizeTest, SpatialHeatmapFacetsTest, CurrencyFieldXmlFileTest,
TestDefaultStatsCache, TermVectorComponentDistributedTest, TestAnalyzeInfixSuggestions, SolrIndexConfigTest,
TestJettySolrRunner, URLClassifyProcessorTest, TestGraphTermsQParserPlugin, ShardSplitTest,
TestDelegationWithHadoopAuth, V2ApiIntegrationTest, RecoveryZkTest, TestPhraseSuggestions,
PeerSyncReplicationTest, TestConfigSets, LeaderElectionTest, TestCloudInspectUtil, PrimitiveFieldTypeTest,
TestRawResponseWriter, SolrTestCaseJ4Test, TestUtils, HdfsRecoverLeaseTest, HdfsDirectoryFactoryTest,
DocValuesNotIndexedTest, SuggesterWFSTTest, TestDynamicFieldResource, CircularListTest, TestStressLiveNodes,
CollectionsAPIAsyncDistributedZkTest, JsonValidatorTest, TestInitParams, TestLegacyFieldCache,
UpdateParamsTest, TestLazyCores, AnalysisAfterCoreReloadTest, SuggesterFSTTest, SolrRequestParserTest,
TestFoldingMultitermQuery, SuggesterTSTTest, SuggesterTest, NoCacheHeaderTest, TestUpdate,
StatelessScriptUpdateProcessorFactoryTest, TestSolrDeletionPolicy1, TestSurroundQueryParser,
DirectSolrSpellCheckerTest, RequestHandlersTest, MoreLikeThisHandlerTest, TestSolrQueryParser,
TestJmxIntegration, MBeansHandlerTest, BinaryUpdateRequestHandlerTest, CSVRequestHandlerTest,
TestQuerySenderListener, BadComponentTest, TestMergePolicyConfig, MultiTermTest, SampleTest,
TestBinaryField, OutputWriterTest, TestPostingsSolrHighlighter, TestCodecSupport, TestBM25SimilarityFactory,
OpenExchangeRatesOrgProviderTest, ChaosMonkeyNothingIsSafeTest, CdcrReplicationHandlerTest,
CdcrRequestHandlerTest, CollectionReloadTest, CreateCollectionCleanupTest, DeleteInactiveReplicaTest,
DeleteReplicaTest, DistribJoinFromCollectionTest, LeaderElectionContextKeyTest, LeaderFailoverAfterPartitionTest,
LeaderInitiatedRecoveryOnCommitTest, OutOfBoxZkACLAndCredentialsProvidersTest, OverriddenZkACLAndCredentialsProvidersTest,
OverseerStatusTest, RemoteQueryErrorTest, ReplaceNodeTest, SolrXmlInZkTest, TestCloudPivotFacet,
TestConfigSetsAPIExclusivity, TestDistribDocBasedVersion, TestRandomRequestDistribution, TestRequestStatusCollectionAPI,
TestShortCircuitedRequests, TestStressInPlaceUpdates, TestConfigSetProperties, TestCustomStream,
TestReplicationHandlerBackup, TestReqParamsAPI, TestRestoreCore, TestSQLHandlerNonCloud, CoreMergeIndexesAdminHandlerTest,
InfoHandlerTest, TestApiFramework]
   [junit4] Completed [579/692 (1!)] on J2 in 0.06s, 2 tests, 1 error <<< FAILURES!

[...truncated 7 lines...]
   [junit4] Suite: org.apache.solr.handler.admin.TestCoreAdminApis
   [junit4]   2> Creating dataDir: /home/jenkins/workspace/Lucene-Solr-master-Linux/solr/build/solr-core/test/J0/temp/solr.handler.admin.TestCoreAdminApis_D661D5D9DBFD6DF0-001/init-core-data-001
   [junit4]   2> 2230684 INFO  (SUITE-TestCoreAdminApis-seed#[D661D5D9DBFD6DF0]-worker)
[    ] o.a.s.SolrTestCaseJ4 Using TrieFields
   [junit4]   2> 2230687 INFO  (SUITE-TestCoreAdminApis-seed#[D661D5D9DBFD6DF0]-worker)
[    ] o.a.s.SolrTestCaseJ4 Randomized ssl (true) and clientAuth (true) via: @org.apache.solr.util.RandomizeSSL(reason="",
ssl=0.0/0.0, value=0.0/0.0, clientAuth=0.0/0.0)
   [junit4]   2> 2230691 INFO  (TEST-TestCoreAdminApis.testCalls-seed#[D661D5D9DBFD6DF0])
[    ] o.a.s.SolrTestCaseJ4 ###Starting testCalls
   [junit4]   2> 2230768 INFO  (TEST-TestCoreAdminApis.testCalls-seed#[D661D5D9DBFD6DF0])
[    ] o.a.s.SolrTestCaseJ4 ###Ending testCalls
   [junit4]   2> NOTE: reproduce with: ant test  -Dtestcase=TestCoreAdminApis -Dtests.method=testCalls
-Dtests.seed=D661D5D9DBFD6DF0 -Dtests.multiplier=3 -Dtests.slow=true -Dtests.locale=lag -Dtests.timezone=Mexico/BajaNorte
-Dtests.asserts=true -Dtests.file.encoding=US-ASCII
   [junit4] ERROR   0.08s J0 | TestCoreAdminApis.testCalls <<<
   [junit4]    > Throwable #1: java.lang.ExceptionInInitializerError
   [junit4]    > 	at __randomizedtesting.SeedInfo.seed([D661D5D9DBFD6DF0:E4A0CAB25E71DE57]:0)
   [junit4]    > 	at net.sf.cglib.core.KeyFactory$Generator.generateClass(KeyFactory.java:166)
   [junit4]    > 	at net.sf.cglib.core.DefaultGeneratorStrategy.generate(DefaultGeneratorStrategy.java:25)
   [junit4]    > 	at net.sf.cglib.core.AbstractClassGenerator.create(AbstractClassGenerator.java:216)
   [junit4]    > 	at net.sf.cglib.core.KeyFactory$Generator.create(KeyFactory.java:144)
   [junit4]    > 	at net.sf.cglib.core.KeyFactory.create(KeyFactory.java:116)
   [junit4]    > 	at net.sf.cglib.core.KeyFactory.create(KeyFactory.java:108)
   [junit4]    > 	at net.sf.cglib.core.KeyFactory.create(KeyFactory.java:104)
   [junit4]    > 	at net.sf.cglib.proxy.Enhancer.<clinit>(Enhancer.java:69)
   [junit4]    > 	at org.easymock.internal.ClassProxyFactory.createEnhancer(ClassProxyFactory.java:259)
   [junit4]    > 	at org.easymock.internal.ClassProxyFactory.createProxy(ClassProxyFactory.java:174)
   [junit4]    > 	at org.easymock.internal.MocksControl.createMock(MocksControl.java:60)
   [junit4]    > 	at org.easymock.EasyMock.createMock(EasyMock.java:104)
   [junit4]    > 	at org.apache.solr.handler.admin.TestCoreAdminApis.getCoreContainerMock(TestCoreAdminApis.java:76)
   [junit4]    > 	at org.apache.solr.handler.admin.TestCoreAdminApis.testCalls(TestCoreAdminApis.java:43)
   [junit4]    > 	at java.base/jdk.internal.reflect.NativeMethodAccessorImpl.invoke0(Native
Method)
   [junit4]    > 	at java.base/jdk.internal.reflect.NativeMethodAccessorImpl.invoke(NativeMethodAccessorImpl.java:62)
   [junit4]    > 	at java.base/jdk.internal.reflect.DelegatingMethodAccessorImpl.invoke(DelegatingMethodAccessorImpl.java:43)
   [junit4]    > 	at java.base/java.lang.reflect.Method.invoke(Method.java:543)
   [junit4]    > 	at java.base/java.lang.Thread.run(Thread.java:844)
   [junit4]    > Caused by: java.lang.reflect.InaccessibleObjectException: Unable to make
protected final java.lang.Class java.lang.ClassLoader.defineClass(java.lang.String,byte[],int,int,java.security.ProtectionDomain)
throws java.lang.ClassFormatError accessible: module java.base does not "opens java.lang"
to unnamed module @16d22e9
   [junit4]    > 	at java.base/java.lang.reflect.AccessibleObject.checkCanSetAccessible(AccessibleObject.java:207)
   [junit4]    > 	at java.base/java.lang.reflect.Method.checkCanSetAccessible(Method.java:192)
   [junit4]    > 	at java.base/java.lang.reflect.Method.setAccessible(Method.java:186)
   [junit4]    > 	at net.sf.cglib.core.ReflectUtils$2.run(ReflectUtils.java:56)
   [junit4]    > 	at java.base/java.security.AccessController.doPrivileged(Native Method)
   [junit4]    > 	at net.sf.cglib.core.ReflectUtils.<clinit>(ReflectUtils.java:46)
   [junit4]    > 	... 52 more
   [junit4]   2> 2230770 INFO  (SUITE-TestCoreAdminApis-seed#[D661D5D9DBFD6DF0]-worker)
[    ] o.a.s.SolrTestCaseJ4 ###deleteCore
   [junit4]   2> NOTE: leaving temporary files on disk at: /home/jenkins/workspace/Lucene-Solr-master-Linux/solr/build/solr-core/test/J0/temp/solr.handler.admin.TestCoreAdminApis_D661D5D9DBFD6DF0-001
   [junit4]   2> NOTE: test params are: codec=Asserting(Lucene70): {}, docValues:{}, maxPointsInLeafNode=870,
maxMBSortInHeap=5.856041825355497, sim=RandomSimilarity(queryNorm=true): {}, locale=lag, timezone=Mexico/BajaNorte
   [junit4]   2> NOTE: Linux 4.4.0-53-generic i386/Oracle Corporation 9-ea (32-bit)/cpus=12,threads=1,free=244954464,total=536870912
   [junit4]   2> NOTE: All tests run in this JVM: [FileBasedSpellCheckerTest, CollectionStateFormat2Test,
TestDeleteCollectionOnDownNodes, BasicZkTest, TestSolrQueryParserDefaultOperatorResource,
TestMacroExpander, TestHighFrequencyDictionaryFactory, AddBlockUpdateTest, TestLockTree, ZkStateReaderTest,
SignatureUpdateProcessorFactoryTest, TestSolr4Spatial, LeaderInitiatedRecoveryOnShardRestartTest,
TestRequestForwarding, BooleanFieldTest, PluginInfoTest, TestImplicitCoreProperties, SmileWriterTest,
TestRealTimeGet, TestSuggestSpellingConverter, TestOrdValues, TestSlowCompositeReaderWrapper,
TestReloadDeadlock, TestBlendedInfixSuggestions, TestImpersonationWithHadoopAuth, TestPseudoReturnFields,
AnalyticsMergeStrategyTest, TestMiniSolrCloudClusterSSL, TestTrieFacet, ConnectionReuseTest,
ConnectionManagerTest, CollectionsAPISolrJTest, SSLMigrationTest, TestSolrDeletionPolicy2,
DistributedDebugComponentTest, CloneFieldUpdateProcessorFactoryTest, TestCorePropertiesReload,
BasicDistributedZkTest, TestSolrConfigHandler, CleanupOldIndexTest, SpellPossibilityIteratorTest,
TestCSVLoader, TestTestInjection, TestLeaderElectionZkExpiry, ZkNodePropsTest, DataDrivenBlockJoinTest,
SolrCoreTest, TestComplexPhraseLeadingWildcard, SearchHandlerTest, UUIDFieldTest, TestLFUCache,
DistributedFacetPivotSmallTest, XsltUpdateRequestHandlerTest, ForceLeaderTest, GraphQueryTest,
CopyFieldTest, DocumentAnalysisRequestHandlerTest, TestAuthenticationFramework, TestDFRSimilarityFactory,
ClusterStateTest, StandardRequestHandlerTest, RegexBoostProcessorTest, JavabinLoaderTest,
TestSchemaSimilarityResource, TestLRUCache, ResponseHeaderTest, SharedFSAutoReplicaFailoverTest,
ParsingFieldUpdateProcessorsTest, TestHashQParserPlugin, UniqFieldsUpdateProcessorFactoryTest,
FullHLLTest, CoreAdminCreateDiscoverTest, TestBulkSchemaAPI, SuggestComponentContextFilterQueryTest,
TestSolrFieldCacheMBean, TestRuleBasedAuthorizationPlugin, TestLRUStatsCache, TestRandomFaceting,
HdfsWriteToMultipleCollectionsTest, QueryEqualityTest, BufferStoreTest, TestFieldCollectionResource,
TestSolrConfigHandlerConcurrent, RuleEngineTest, VersionInfoTest, CurrencyFieldOpenExchangeTest,
ReplicaListTransformerTest, SolrSlf4jReporterTest, SolrMetricManagerTest, DistributedFacetPivotLargeTest,
TestJsonRequest, PeerSyncTest, SolrGangliaReporterTest, TestAtomicUpdateErrorCases, TestCloudManagedSchema,
TestFastWriter, TestSchemalessBufferedUpdates, TestCrossCoreJoin, DistribCursorPagingTest,
TestExportWriter, SparseHLLTest, DefaultValueUpdateProcessorTest, ResponseLogComponentTest,
TestObjectReleaseTracker, TestRangeQuery, TestFieldTypeResource, TestSolrCoreProperties, TestFieldCacheVsDocValues,
TestExpandComponent, TestSQLHandler, TestSolrCloudSnapshots, NotRequiredUniqueKeyTest, ZkSolrClientTest,
ZkCLITest, AutoCommitTest, TestDistributedGrouping, TestFaceting, DistributedSpellCheckComponentTest,
TestJoin, DistributedTermsComponentTest, SpellCheckComponentTest, TestFunctionQuery, BasicFunctionalityTest,
DirectUpdateHandlerTest, TestBadConfig, TestIndexSearcher, DistributedQueryElevationComponentTest,
DocValuesTest, TestWordDelimiterFilterFactory, SortByFunctionTest, DocValuesMultiTest, CacheHeaderTest,
TestQueryUtils, TestOmitPositions, TestValueSourceCache, TestIndexingPerformance, RequiredFieldsTest,
FastVectorHighlighterTest, UpdateRequestProcessorFactoryTest, TestCSVResponseWriter, QueryParsingTest,
TestPHPSerializedResponseWriter, TestComponentsName, HighlighterConfigTest, TestQuerySenderNoQuery,
TestStressRecovery, NumericFieldsTest, MinimalSchemaTest, ExternalFileFieldSortTest, DirectSolrConnectionTest,
SynonymTokenizerTest, TestSweetSpotSimilarityFactory, TestLMJelinekMercerSimilarityFactory,
TestJmxMonitoredMap, TestFastOutputStream, ScriptEngineTest, TestFastLRUCache, DateMathParserTest,
DateFieldTest, SpellingQueryConverterTest, RAMDirectoryFactoryTest, TestSolrJ, TestDocumentBuilder,
SliceStateTest, SystemInfoHandlerTest, FileUtilsTest, TestRTGBase, DistributedIntervalFacetingTest,
TestHighlightDedupGrouping, TestSimpleTrackingShardHandler, AssignTest, AsyncCallRequestStatusResponseTest,
CdcrBootstrapTest, DistributedQueueTest, HttpPartitionTest, OverseerRolesTest, RecoveryAfterSoftCommitTest,
SharedFSAutoReplicaFailoverUtilsTest, SolrCLIZkUtilsTest, TestCloudDeleteByQuery, TestCloudRecovery,
TestCryptoKeys, TestMiniSolrCloudCluster, TestSolrCloudWithDelegationTokens, TestSolrCloudWithKerberosAlt,
TestStressCloudBlindAtomicUpdates, TriLevelCompositeIdRoutingTest, CachingDirectoryFactoryTest,
DirectoryFactoryTest, ExitableDirectoryReaderTest, QueryResultKeyTest, TestConfigSetImmutable,
TestDynamicLoading, SegmentsInfoRequestHandlerTest, TestCollectionAPIs, TestCoreAdminApis]
   [junit4] Completed [582/692 (2!)] on J0 in 0.11s, 1 test, 1 error <<< FAILURES!

[...truncated 51891 lines...]


Mime
View raw message