lucene-dev mailing list archives

Site index · List index
Message view « Date » · « Thread »
Top « Date » · « Thread »
From Policeman Jenkins Server <jenk...@thetaphi.de>
Subject [JENKINS-EA] Lucene-Solr-master-Linux (64bit/jdk-9-ea+153) - Build # 18892 - Unstable!
Date Thu, 02 Feb 2017 19:50:57 GMT
Build: https://jenkins.thetaphi.de/job/Lucene-Solr-master-Linux/18892/
Java: 64bit/jdk-9-ea+153 -XX:+UseCompressedOops -XX:+UseSerialGC

2 tests failed.
FAILED:  org.apache.solr.handler.admin.TestApiFramework.testFramework

Error Message:


Stack Trace:
java.lang.ExceptionInInitializerError
	at __randomizedtesting.SeedInfo.seed([4F9D366E3805A3C3:58EBFC493ED14FFE]:0)
	at net.sf.cglib.core.KeyFactory$Generator.generateClass(KeyFactory.java:166)
	at net.sf.cglib.core.DefaultGeneratorStrategy.generate(DefaultGeneratorStrategy.java:25)
	at net.sf.cglib.core.AbstractClassGenerator.create(AbstractClassGenerator.java:216)
	at net.sf.cglib.core.KeyFactory$Generator.create(KeyFactory.java:144)
	at net.sf.cglib.core.KeyFactory.create(KeyFactory.java:116)
	at net.sf.cglib.core.KeyFactory.create(KeyFactory.java:108)
	at net.sf.cglib.core.KeyFactory.create(KeyFactory.java:104)
	at net.sf.cglib.proxy.Enhancer.<clinit>(Enhancer.java:69)
	at org.easymock.internal.ClassProxyFactory.createEnhancer(ClassProxyFactory.java:259)
	at org.easymock.internal.ClassProxyFactory.createProxy(ClassProxyFactory.java:174)
	at org.easymock.internal.MocksControl.createMock(MocksControl.java:60)
	at org.easymock.EasyMock.createMock(EasyMock.java:104)
	at org.apache.solr.handler.admin.TestCoreAdminApis.getCoreContainerMock(TestCoreAdminApis.java:76)
	at org.apache.solr.handler.admin.TestApiFramework.testFramework(TestApiFramework.java:59)
	at java.base/jdk.internal.reflect.NativeMethodAccessorImpl.invoke0(Native Method)
	at java.base/jdk.internal.reflect.NativeMethodAccessorImpl.invoke(NativeMethodAccessorImpl.java:62)
	at java.base/jdk.internal.reflect.DelegatingMethodAccessorImpl.invoke(DelegatingMethodAccessorImpl.java:43)
	at java.base/java.lang.reflect.Method.invoke(Method.java:543)
	at com.carrotsearch.randomizedtesting.RandomizedRunner.invoke(RandomizedRunner.java:1713)
	at com.carrotsearch.randomizedtesting.RandomizedRunner$8.evaluate(RandomizedRunner.java:907)
	at com.carrotsearch.randomizedtesting.RandomizedRunner$9.evaluate(RandomizedRunner.java:943)
	at com.carrotsearch.randomizedtesting.RandomizedRunner$10.evaluate(RandomizedRunner.java:957)
	at com.carrotsearch.randomizedtesting.rules.SystemPropertiesRestoreRule$1.evaluate(SystemPropertiesRestoreRule.java:57)
	at org.apache.lucene.util.TestRuleSetupTeardownChained$1.evaluate(TestRuleSetupTeardownChained.java:49)
	at org.apache.lucene.util.AbstractBeforeAfterRule$1.evaluate(AbstractBeforeAfterRule.java:45)
	at org.apache.lucene.util.TestRuleThreadAndTestName$1.evaluate(TestRuleThreadAndTestName.java:48)
	at org.apache.lucene.util.TestRuleIgnoreAfterMaxFailures$1.evaluate(TestRuleIgnoreAfterMaxFailures.java:64)
	at org.apache.lucene.util.TestRuleMarkFailure$1.evaluate(TestRuleMarkFailure.java:47)
	at com.carrotsearch.randomizedtesting.rules.StatementAdapter.evaluate(StatementAdapter.java:36)
	at com.carrotsearch.randomizedtesting.ThreadLeakControl$StatementRunner.run(ThreadLeakControl.java:368)
	at com.carrotsearch.randomizedtesting.ThreadLeakControl.forkTimeoutingTask(ThreadLeakControl.java:817)
	at com.carrotsearch.randomizedtesting.ThreadLeakControl$3.evaluate(ThreadLeakControl.java:468)
	at com.carrotsearch.randomizedtesting.RandomizedRunner.runSingleTest(RandomizedRunner.java:916)
	at com.carrotsearch.randomizedtesting.RandomizedRunner$5.evaluate(RandomizedRunner.java:802)
	at com.carrotsearch.randomizedtesting.RandomizedRunner$6.evaluate(RandomizedRunner.java:852)
	at com.carrotsearch.randomizedtesting.RandomizedRunner$7.evaluate(RandomizedRunner.java:863)
	at com.carrotsearch.randomizedtesting.rules.StatementAdapter.evaluate(StatementAdapter.java:36)
	at com.carrotsearch.randomizedtesting.rules.SystemPropertiesRestoreRule$1.evaluate(SystemPropertiesRestoreRule.java:57)
	at org.apache.lucene.util.AbstractBeforeAfterRule$1.evaluate(AbstractBeforeAfterRule.java:45)
	at com.carrotsearch.randomizedtesting.rules.StatementAdapter.evaluate(StatementAdapter.java:36)
	at org.apache.lucene.util.TestRuleStoreClassName$1.evaluate(TestRuleStoreClassName.java:41)
	at com.carrotsearch.randomizedtesting.rules.NoShadowingOrOverridesOnMethodsRule$1.evaluate(NoShadowingOrOverridesOnMethodsRule.java:40)
	at com.carrotsearch.randomizedtesting.rules.NoShadowingOrOverridesOnMethodsRule$1.evaluate(NoShadowingOrOverridesOnMethodsRule.java:40)
	at com.carrotsearch.randomizedtesting.rules.StatementAdapter.evaluate(StatementAdapter.java:36)
	at com.carrotsearch.randomizedtesting.rules.StatementAdapter.evaluate(StatementAdapter.java:36)
	at org.apache.lucene.util.TestRuleAssertionsRequired$1.evaluate(TestRuleAssertionsRequired.java:53)
	at org.apache.lucene.util.TestRuleMarkFailure$1.evaluate(TestRuleMarkFailure.java:47)
	at org.apache.lucene.util.TestRuleIgnoreAfterMaxFailures$1.evaluate(TestRuleIgnoreAfterMaxFailures.java:64)
	at org.apache.lucene.util.TestRuleIgnoreTestSuites$1.evaluate(TestRuleIgnoreTestSuites.java:54)
	at com.carrotsearch.randomizedtesting.rules.StatementAdapter.evaluate(StatementAdapter.java:36)
	at com.carrotsearch.randomizedtesting.ThreadLeakControl$StatementRunner.run(ThreadLeakControl.java:368)
	at java.base/java.lang.Thread.run(Thread.java:844)
Caused by: java.lang.reflect.InaccessibleObjectException: Unable to make protected final java.lang.Class
java.lang.ClassLoader.defineClass(java.lang.String,byte[],int,int,java.security.ProtectionDomain)
throws java.lang.ClassFormatError accessible: module java.base does not "opens java.lang"
to unnamed module @1e4d952f
	at java.base/java.lang.reflect.AccessibleObject.checkCanSetAccessible(AccessibleObject.java:207)
	at java.base/java.lang.reflect.Method.checkCanSetAccessible(Method.java:192)
	at java.base/java.lang.reflect.Method.setAccessible(Method.java:186)
	at net.sf.cglib.core.ReflectUtils$2.run(ReflectUtils.java:56)
	at java.base/java.security.AccessController.doPrivileged(Native Method)
	at net.sf.cglib.core.ReflectUtils.<clinit>(ReflectUtils.java:46)
	... 52 more


FAILED:  org.apache.solr.handler.admin.TestCoreAdminApis.testCalls

Error Message:


Stack Trace:
java.lang.ExceptionInInitializerError
	at __randomizedtesting.SeedInfo.seed([4F9D366E3805A3C3:7D5C2905BD891064]:0)
	at net.sf.cglib.core.KeyFactory$Generator.generateClass(KeyFactory.java:166)
	at net.sf.cglib.core.DefaultGeneratorStrategy.generate(DefaultGeneratorStrategy.java:25)
	at net.sf.cglib.core.AbstractClassGenerator.create(AbstractClassGenerator.java:216)
	at net.sf.cglib.core.KeyFactory$Generator.create(KeyFactory.java:144)
	at net.sf.cglib.core.KeyFactory.create(KeyFactory.java:116)
	at net.sf.cglib.core.KeyFactory.create(KeyFactory.java:108)
	at net.sf.cglib.core.KeyFactory.create(KeyFactory.java:104)
	at net.sf.cglib.proxy.Enhancer.<clinit>(Enhancer.java:69)
	at org.easymock.internal.ClassProxyFactory.createEnhancer(ClassProxyFactory.java:259)
	at org.easymock.internal.ClassProxyFactory.createProxy(ClassProxyFactory.java:174)
	at org.easymock.internal.MocksControl.createMock(MocksControl.java:60)
	at org.easymock.EasyMock.createMock(EasyMock.java:104)
	at org.apache.solr.handler.admin.TestCoreAdminApis.getCoreContainerMock(TestCoreAdminApis.java:76)
	at org.apache.solr.handler.admin.TestCoreAdminApis.testCalls(TestCoreAdminApis.java:43)
	at java.base/jdk.internal.reflect.NativeMethodAccessorImpl.invoke0(Native Method)
	at java.base/jdk.internal.reflect.NativeMethodAccessorImpl.invoke(NativeMethodAccessorImpl.java:62)
	at java.base/jdk.internal.reflect.DelegatingMethodAccessorImpl.invoke(DelegatingMethodAccessorImpl.java:43)
	at java.base/java.lang.reflect.Method.invoke(Method.java:543)
	at com.carrotsearch.randomizedtesting.RandomizedRunner.invoke(RandomizedRunner.java:1713)
	at com.carrotsearch.randomizedtesting.RandomizedRunner$8.evaluate(RandomizedRunner.java:907)
	at com.carrotsearch.randomizedtesting.RandomizedRunner$9.evaluate(RandomizedRunner.java:943)
	at com.carrotsearch.randomizedtesting.RandomizedRunner$10.evaluate(RandomizedRunner.java:957)
	at com.carrotsearch.randomizedtesting.rules.SystemPropertiesRestoreRule$1.evaluate(SystemPropertiesRestoreRule.java:57)
	at org.apache.lucene.util.TestRuleSetupTeardownChained$1.evaluate(TestRuleSetupTeardownChained.java:49)
	at org.apache.lucene.util.AbstractBeforeAfterRule$1.evaluate(AbstractBeforeAfterRule.java:45)
	at org.apache.lucene.util.TestRuleThreadAndTestName$1.evaluate(TestRuleThreadAndTestName.java:48)
	at org.apache.lucene.util.TestRuleIgnoreAfterMaxFailures$1.evaluate(TestRuleIgnoreAfterMaxFailures.java:64)
	at org.apache.lucene.util.TestRuleMarkFailure$1.evaluate(TestRuleMarkFailure.java:47)
	at com.carrotsearch.randomizedtesting.rules.StatementAdapter.evaluate(StatementAdapter.java:36)
	at com.carrotsearch.randomizedtesting.ThreadLeakControl$StatementRunner.run(ThreadLeakControl.java:368)
	at com.carrotsearch.randomizedtesting.ThreadLeakControl.forkTimeoutingTask(ThreadLeakControl.java:817)
	at com.carrotsearch.randomizedtesting.ThreadLeakControl$3.evaluate(ThreadLeakControl.java:468)
	at com.carrotsearch.randomizedtesting.RandomizedRunner.runSingleTest(RandomizedRunner.java:916)
	at com.carrotsearch.randomizedtesting.RandomizedRunner$5.evaluate(RandomizedRunner.java:802)
	at com.carrotsearch.randomizedtesting.RandomizedRunner$6.evaluate(RandomizedRunner.java:852)
	at com.carrotsearch.randomizedtesting.RandomizedRunner$7.evaluate(RandomizedRunner.java:863)
	at com.carrotsearch.randomizedtesting.rules.StatementAdapter.evaluate(StatementAdapter.java:36)
	at com.carrotsearch.randomizedtesting.rules.SystemPropertiesRestoreRule$1.evaluate(SystemPropertiesRestoreRule.java:57)
	at org.apache.lucene.util.AbstractBeforeAfterRule$1.evaluate(AbstractBeforeAfterRule.java:45)
	at com.carrotsearch.randomizedtesting.rules.StatementAdapter.evaluate(StatementAdapter.java:36)
	at org.apache.lucene.util.TestRuleStoreClassName$1.evaluate(TestRuleStoreClassName.java:41)
	at com.carrotsearch.randomizedtesting.rules.NoShadowingOrOverridesOnMethodsRule$1.evaluate(NoShadowingOrOverridesOnMethodsRule.java:40)
	at com.carrotsearch.randomizedtesting.rules.NoShadowingOrOverridesOnMethodsRule$1.evaluate(NoShadowingOrOverridesOnMethodsRule.java:40)
	at com.carrotsearch.randomizedtesting.rules.StatementAdapter.evaluate(StatementAdapter.java:36)
	at com.carrotsearch.randomizedtesting.rules.StatementAdapter.evaluate(StatementAdapter.java:36)
	at org.apache.lucene.util.TestRuleAssertionsRequired$1.evaluate(TestRuleAssertionsRequired.java:53)
	at org.apache.lucene.util.TestRuleMarkFailure$1.evaluate(TestRuleMarkFailure.java:47)
	at org.apache.lucene.util.TestRuleIgnoreAfterMaxFailures$1.evaluate(TestRuleIgnoreAfterMaxFailures.java:64)
	at org.apache.lucene.util.TestRuleIgnoreTestSuites$1.evaluate(TestRuleIgnoreTestSuites.java:54)
	at com.carrotsearch.randomizedtesting.rules.StatementAdapter.evaluate(StatementAdapter.java:36)
	at com.carrotsearch.randomizedtesting.ThreadLeakControl$StatementRunner.run(ThreadLeakControl.java:368)
	at java.base/java.lang.Thread.run(Thread.java:844)
Caused by: java.lang.reflect.InaccessibleObjectException: Unable to make protected final java.lang.Class
java.lang.ClassLoader.defineClass(java.lang.String,byte[],int,int,java.security.ProtectionDomain)
throws java.lang.ClassFormatError accessible: module java.base does not "opens java.lang"
to unnamed module @2ae00eca
	at java.base/java.lang.reflect.AccessibleObject.checkCanSetAccessible(AccessibleObject.java:207)
	at java.base/java.lang.reflect.Method.checkCanSetAccessible(Method.java:192)
	at java.base/java.lang.reflect.Method.setAccessible(Method.java:186)
	at net.sf.cglib.core.ReflectUtils$2.run(ReflectUtils.java:56)
	at java.base/java.security.AccessController.doPrivileged(Native Method)
	at net.sf.cglib.core.ReflectUtils.<clinit>(ReflectUtils.java:46)
	... 52 more




Build Log:
[...truncated 10986 lines...]
   [junit4] Suite: org.apache.solr.handler.admin.TestCoreAdminApis
   [junit4]   2> Creating dataDir: /home/jenkins/workspace/Lucene-Solr-master-Linux/solr/build/solr-core/test/J2/temp/solr.handler.admin.TestCoreAdminApis_4F9D366E3805A3C3-001/init-core-data-001
   [junit4]   2> 278079 INFO  (SUITE-TestCoreAdminApis-seed#[4F9D366E3805A3C3]-worker)
[    ] o.a.s.SolrTestCaseJ4 Using TrieFields
   [junit4]   2> 278080 INFO  (SUITE-TestCoreAdminApis-seed#[4F9D366E3805A3C3]-worker)
[    ] o.a.s.SolrTestCaseJ4 Randomized ssl (false) and clientAuth (true) via: @org.apache.solr.util.RandomizeSSL(reason="",
ssl=0.0/0.0, value=0.0/0.0, clientAuth=0.0/0.0)
   [junit4]   2> 278081 INFO  (TEST-TestCoreAdminApis.testCalls-seed#[4F9D366E3805A3C3])
[    ] o.a.s.SolrTestCaseJ4 ###Starting testCalls
   [junit4]   2> 278121 INFO  (TEST-TestCoreAdminApis.testCalls-seed#[4F9D366E3805A3C3])
[    ] o.a.s.SolrTestCaseJ4 ###Ending testCalls
   [junit4]   2> NOTE: reproduce with: ant test  -Dtestcase=TestCoreAdminApis -Dtests.method=testCalls
-Dtests.seed=4F9D366E3805A3C3 -Dtests.multiplier=3 -Dtests.slow=true -Dtests.locale=mer -Dtests.timezone=Etc/GMT+8
-Dtests.asserts=true -Dtests.file.encoding=UTF-8
   [junit4] ERROR   0.04s J2 | TestCoreAdminApis.testCalls <<<
   [junit4]    > Throwable #1: java.lang.ExceptionInInitializerError
   [junit4]    > 	at __randomizedtesting.SeedInfo.seed([4F9D366E3805A3C3:7D5C2905BD891064]:0)
   [junit4]    > 	at net.sf.cglib.core.KeyFactory$Generator.generateClass(KeyFactory.java:166)
   [junit4]    > 	at net.sf.cglib.core.DefaultGeneratorStrategy.generate(DefaultGeneratorStrategy.java:25)
   [junit4]    > 	at net.sf.cglib.core.AbstractClassGenerator.create(AbstractClassGenerator.java:216)
   [junit4]    > 	at net.sf.cglib.core.KeyFactory$Generator.create(KeyFactory.java:144)
   [junit4]    > 	at net.sf.cglib.core.KeyFactory.create(KeyFactory.java:116)
   [junit4]    > 	at net.sf.cglib.core.KeyFactory.create(KeyFactory.java:108)
   [junit4]    > 	at net.sf.cglib.core.KeyFactory.create(KeyFactory.java:104)
   [junit4]    > 	at net.sf.cglib.proxy.Enhancer.<clinit>(Enhancer.java:69)
   [junit4]    > 	at org.easymock.internal.ClassProxyFactory.createEnhancer(ClassProxyFactory.java:259)
   [junit4]    > 	at org.easymock.internal.ClassProxyFactory.createProxy(ClassProxyFactory.java:174)
   [junit4]    > 	at org.easymock.internal.MocksControl.createMock(MocksControl.java:60)
   [junit4]    > 	at org.easymock.EasyMock.createMock(EasyMock.java:104)
   [junit4]    > 	at org.apache.solr.handler.admin.TestCoreAdminApis.getCoreContainerMock(TestCoreAdminApis.java:76)
   [junit4]    > 	at org.apache.solr.handler.admin.TestCoreAdminApis.testCalls(TestCoreAdminApis.java:43)
   [junit4]    > 	at java.base/jdk.internal.reflect.NativeMethodAccessorImpl.invoke0(Native
Method)
   [junit4]    > 	at java.base/jdk.internal.reflect.NativeMethodAccessorImpl.invoke(NativeMethodAccessorImpl.java:62)
   [junit4]    > 	at java.base/jdk.internal.reflect.DelegatingMethodAccessorImpl.invoke(DelegatingMethodAccessorImpl.java:43)
   [junit4]    > 	at java.base/java.lang.reflect.Method.invoke(Method.java:543)
   [junit4]    > 	at java.base/java.lang.Thread.run(Thread.java:844)
   [junit4]    > Caused by: java.lang.reflect.InaccessibleObjectException: Unable to make
protected final java.lang.Class java.lang.ClassLoader.defineClass(java.lang.String,byte[],int,int,java.security.ProtectionDomain)
throws java.lang.ClassFormatError accessible: module java.base does not "opens java.lang"
to unnamed module @2ae00eca
   [junit4]    > 	at java.base/java.lang.reflect.AccessibleObject.checkCanSetAccessible(AccessibleObject.java:207)
   [junit4]    > 	at java.base/java.lang.reflect.Method.checkCanSetAccessible(Method.java:192)
   [junit4]    > 	at java.base/java.lang.reflect.Method.setAccessible(Method.java:186)
   [junit4]    > 	at net.sf.cglib.core.ReflectUtils$2.run(ReflectUtils.java:56)
   [junit4]    > 	at java.base/java.security.AccessController.doPrivileged(Native Method)
   [junit4]    > 	at net.sf.cglib.core.ReflectUtils.<clinit>(ReflectUtils.java:46)
   [junit4]    > 	... 52 more
   [junit4]   2> 278122 INFO  (SUITE-TestCoreAdminApis-seed#[4F9D366E3805A3C3]-worker)
[    ] o.a.s.SolrTestCaseJ4 ###deleteCore
   [junit4]   2> NOTE: leaving temporary files on disk at: /home/jenkins/workspace/Lucene-Solr-master-Linux/solr/build/solr-core/test/J2/temp/solr.handler.admin.TestCoreAdminApis_4F9D366E3805A3C3-001
   [junit4]   2> NOTE: test params are: codec=Asserting(Lucene70): {}, docValues:{}, maxPointsInLeafNode=1615,
maxMBSortInHeap=7.545207398701791, sim=RandomSimilarity(queryNorm=true): {}, locale=mer, timezone=Etc/GMT+8
   [junit4]   2> NOTE: Linux 4.4.0-53-generic amd64/Oracle Corporation 9-ea (64-bit)/cpus=12,threads=1,free=187354480,total=509476864
   [junit4]   2> NOTE: All tests run in this JVM: [DeleteNodeTest, BlockJoinFacetSimpleTest,
DistributedQueryComponentCustomSortTest, UpdateParamsTest, DirectUpdateHandlerTest, CdcrUpdateLogTest,
OverriddenZkACLAndCredentialsProvidersTest, PreAnalyzedFieldTest, DateFieldTest, BlockDirectoryTest,
LeaderInitiatedRecoveryOnCommitTest, TestTolerantSearch, TestGraphMLResponseWriter, TestExtendedDismaxParser,
TestAnalyzeInfixSuggestions, ExternalFileFieldSortTest, TestDocSet, TestSolrConfigHandlerCloud,
TestReload, TestSchemaManager, TestBulkSchemaConcurrent, BinaryUpdateRequestHandlerTest, TestCoreAdminApis]
   [junit4] Completed [69/692 (1!)] on J2 in 0.05s, 1 test, 1 error <<< FAILURES!

[...truncated 1614 lines...]
   [junit4] Suite: org.apache.solr.handler.admin.TestApiFramework
   [junit4]   2> Creating dataDir: /home/jenkins/workspace/Lucene-Solr-master-Linux/solr/build/solr-core/test/J0/temp/solr.handler.admin.TestApiFramework_4F9D366E3805A3C3-001/init-core-data-001
   [junit4]   2> 2032288 INFO  (SUITE-TestApiFramework-seed#[4F9D366E3805A3C3]-worker)
[    ] o.a.s.SolrTestCaseJ4 Using PointFields
   [junit4]   2> 2032289 INFO  (SUITE-TestApiFramework-seed#[4F9D366E3805A3C3]-worker)
[    ] o.a.s.SolrTestCaseJ4 Randomized ssl (false) and clientAuth (true) via: @org.apache.solr.util.RandomizeSSL(reason="",
ssl=0.0/0.0, value=0.0/0.0, clientAuth=0.0/0.0)
   [junit4]   2> 2032290 INFO  (TEST-TestApiFramework.testFramework-seed#[4F9D366E3805A3C3])
[    ] o.a.s.SolrTestCaseJ4 ###Starting testFramework
   [junit4]   2> 2032333 INFO  (TEST-TestApiFramework.testFramework-seed#[4F9D366E3805A3C3])
[    ] o.a.s.SolrTestCaseJ4 ###Ending testFramework
   [junit4]   2> NOTE: reproduce with: ant test  -Dtestcase=TestApiFramework -Dtests.method=testFramework
-Dtests.seed=4F9D366E3805A3C3 -Dtests.multiplier=3 -Dtests.slow=true -Dtests.locale=ta-SG
-Dtests.timezone=Canada/East-Saskatchewan -Dtests.asserts=true -Dtests.file.encoding=UTF-8
   [junit4] ERROR   0.05s J0 | TestApiFramework.testFramework <<<
   [junit4]    > Throwable #1: java.lang.ExceptionInInitializerError
   [junit4]    > 	at __randomizedtesting.SeedInfo.seed([4F9D366E3805A3C3:58EBFC493ED14FFE]:0)
   [junit4]    > 	at net.sf.cglib.core.KeyFactory$Generator.generateClass(KeyFactory.java:166)
   [junit4]    > 	at net.sf.cglib.core.DefaultGeneratorStrategy.generate(DefaultGeneratorStrategy.java:25)
   [junit4]    > 	at net.sf.cglib.core.AbstractClassGenerator.create(AbstractClassGenerator.java:216)
   [junit4]    > 	at net.sf.cglib.core.KeyFactory$Generator.create(KeyFactory.java:144)
   [junit4]    > 	at net.sf.cglib.core.KeyFactory.create(KeyFactory.java:116)
   [junit4]    > 	at net.sf.cglib.core.KeyFactory.create(KeyFactory.java:108)
   [junit4]    > 	at net.sf.cglib.core.KeyFactory.create(KeyFactory.java:104)
   [junit4]    > 	at net.sf.cglib.proxy.Enhancer.<clinit>(Enhancer.java:69)
   [junit4]    > 	at org.easymock.internal.ClassProxyFactory.createEnhancer(ClassProxyFactory.java:259)
   [junit4]    > 	at org.easymock.internal.ClassProxyFactory.createProxy(ClassProxyFactory.java:174)
   [junit4]    > 	at org.easymock.internal.MocksControl.createMock(MocksControl.java:60)
   [junit4]    > 	at org.easymock.EasyMock.createMock(EasyMock.java:104)
   [junit4]    > 	at org.apache.solr.handler.admin.TestCoreAdminApis.getCoreContainerMock(TestCoreAdminApis.java:76)
   [junit4]    > 	at org.apache.solr.handler.admin.TestApiFramework.testFramework(TestApiFramework.java:59)
   [junit4]    > 	at java.base/jdk.internal.reflect.NativeMethodAccessorImpl.invoke0(Native
Method)
   [junit4]    > 	at java.base/jdk.internal.reflect.NativeMethodAccessorImpl.invoke(NativeMethodAccessorImpl.java:62)
   [junit4]    > 	at java.base/jdk.internal.reflect.DelegatingMethodAccessorImpl.invoke(DelegatingMethodAccessorImpl.java:43)
   [junit4]    > 	at java.base/java.lang.reflect.Method.invoke(Method.java:543)
   [junit4]    > 	at java.base/java.lang.Thread.run(Thread.java:844)
   [junit4]    > Caused by: java.lang.reflect.InaccessibleObjectException: Unable to make
protected final java.lang.Class java.lang.ClassLoader.defineClass(java.lang.String,byte[],int,int,java.security.ProtectionDomain)
throws java.lang.ClassFormatError accessible: module java.base does not "opens java.lang"
to unnamed module @1e4d952f
   [junit4]    > 	at java.base/java.lang.reflect.AccessibleObject.checkCanSetAccessible(AccessibleObject.java:207)
   [junit4]    > 	at java.base/java.lang.reflect.Method.checkCanSetAccessible(Method.java:192)
   [junit4]    > 	at java.base/java.lang.reflect.Method.setAccessible(Method.java:186)
   [junit4]    > 	at net.sf.cglib.core.ReflectUtils$2.run(ReflectUtils.java:56)
   [junit4]    > 	at java.base/java.security.AccessController.doPrivileged(Native Method)
   [junit4]    > 	at net.sf.cglib.core.ReflectUtils.<clinit>(ReflectUtils.java:46)
   [junit4]    > 	... 52 more
   [junit4]   2> 2032335 INFO  (TEST-TestApiFramework.testTrailingTemplatePaths-seed#[4F9D366E3805A3C3])
[    ] o.a.s.SolrTestCaseJ4 ###Starting testTrailingTemplatePaths
   [junit4]   2> 2032335 INFO  (TEST-TestApiFramework.testTrailingTemplatePaths-seed#[4F9D366E3805A3C3])
[    ] o.a.s.SolrTestCaseJ4 ###Ending testTrailingTemplatePaths
   [junit4]   2> 2032336 INFO  (SUITE-TestApiFramework-seed#[4F9D366E3805A3C3]-worker)
[    ] o.a.s.SolrTestCaseJ4 ###deleteCore
   [junit4]   2> NOTE: leaving temporary files on disk at: /home/jenkins/workspace/Lucene-Solr-master-Linux/solr/build/solr-core/test/J0/temp/solr.handler.admin.TestApiFramework_4F9D366E3805A3C3-001
   [junit4]   2> NOTE: test params are: codec=Asserting(Lucene70): {}, docValues:{}, maxPointsInLeafNode=1858,
maxMBSortInHeap=7.509684844903505, sim=RandomSimilarity(queryNorm=true): {}, locale=ta-SG,
timezone=Canada/East-Saskatchewan
   [junit4]   2> NOTE: Linux 4.4.0-53-generic amd64/Oracle Corporation 9-ea (64-bit)/cpus=12,threads=1,free=103495352,total=518979584
   [junit4]   2> NOTE: All tests run in this JVM: [DistributedSpellCheckComponentTest,
TestFieldTypeResource, TestSolrConfigHandlerConcurrent, TestSolrQueryParserDefaultOperatorResource,
LeaderFailoverAfterPartitionTest, UUIDUpdateProcessorFallbackTest, TestDistributedSearch,
TestSolrConfigHandler, TestImpersonationWithHadoopAuth, TestConfigSetImmutable, TestHighlightDedupGrouping,
ZkNodePropsTest, SystemInfoHandlerTest, SolrCoreTest, PeerSyncTest, TestDefaultSearchFieldResource,
QueryElevationComponentTest, TestSolrDeletionPolicy2, TestFieldCacheSanityChecker, TestClassicSimilarityFactory,
DisMaxRequestHandlerTest, TestAtomicUpdateErrorCases, HdfsThreadLeakTest, ForceLeaderTest,
SharedFSAutoReplicaFailoverTest, TestLMJelinekMercerSimilarityFactory, RegexBoostProcessorTest,
TestSchemaSimilarityResource, TestDocTermOrds, ClusterStateTest, TestFieldCacheVsDocValues,
TestLRUStatsCache, TestTrieFacet, TestSolrCloudWithDelegationTokens, TestAnalyzedSuggestions,
TestSegmentSorting, TestRuleBasedAuthorizationPlugin, TestRandomFaceting, ResponseLogComponentTest,
CollectionsAPISolrJTest, LeaderInitiatedRecoveryOnShardRestartTest, SolrCLIZkUtilsTest, TestLFUCache,
TestRTGBase, JavabinLoaderTest, TestCloudManagedSchema, TestFieldCollectionResource, TestMacroExpander,
BasicDistributedZkTest, ReturnFieldsTest, CurrencyFieldOpenExchangeTest, TestSQLHandler, HdfsCollectionsAPIDistributedZkTest,
TemplateUpdateProcessorTest, DefaultValueUpdateProcessorTest, TestInPlaceUpdatesDistrib, CacheHeaderTest,
TestPseudoReturnFields, TestCloudPivotFacet, TestMaxScoreQueryParser, SyncSliceTest, MultiTermTest,
ReplicationFactorTest, DistributedQueryComponentOptimizationTest, SolrGangliaReporterTest,
TestAuthenticationFramework, DeleteReplicaTest, BooleanFieldTest, BufferStoreTest, HdfsWriteToMultipleCollectionsTest,
TestExpandComponent, NumericFieldsTest, TestImplicitCoreProperties, NotRequiredUniqueKeyTest,
SolrMetricManagerTest, CloneFieldUpdateProcessorFactoryTest, TestTolerantUpdateProcessorCloud,
GraphQueryTest, TestSolrCoreProperties, FileBasedSpellCheckerTest, CdcrRequestHandlerTest,
OverseerCollectionConfigSetProcessorTest, TestPathTrie, TestCodecSupport, TestConfigSetsAPIExclusivity,
TestBlobHandler, AnalyticsMergeStrategyTest, TestValueSourceCache, DeleteInactiveReplicaTest,
TestFastWriter, TestSchemalessBufferedUpdates, TestFieldSortValues, TestNumericTerms32, TestDeleteCollectionOnDownNodes,
AssignTest, ConnectionManagerTest, TestReplicationHandlerBackup, DateMathParserTest, TestDocBasedVersionConstraints,
TestManagedSchemaThreadSafety, TestComplexPhraseLeadingWildcard, TestRequestForwarding, RuleEngineTest,
TestSolrCloudSnapshots, TestLeaderElectionZkExpiry, DistributedQueueTest, TestRawTransformer,
TestCollationFieldDocValues, MergeStrategyTest, TestBulkSchemaAPI, ClassificationUpdateProcessorFactoryTest,
ReplicaListTransformerTest, TestSmileRequest, UnloadDistributedZkTest, BasicZkTest, TestReplicationHandler,
TestJoin, TestRangeQuery, JsonLoaderTest, CSVRequestHandlerTest, HighlighterConfigTest, SOLR749Test,
TestQuerySenderListener, TestQuerySenderNoQuery, CopyFieldTest, SampleTest, TestBinaryField,
TestSearchPerf, MinimalSchemaTest, TestConfig, TestFuzzyAnalyzedSuggestions, TestLuceneMatchVersion,
TestSweetSpotSimilarityFactory, TestPerFieldSimilarity, TestBM25SimilarityFactory, TimeZoneUtilsTest,
ScriptEngineTest, PrimUtilsTest, TestSuggestSpellingConverter, DOMUtilTest, RAMDirectoryFactoryTest,
TestSolrJ, TestLRUCache, TestUtils, TestDocumentBuilder, SliceStateTest, UUIDFieldTest, CircularListTest,
DistributedMLTComponentTest, SolrTestCaseJ4Test, TestCrossCoreJoin, TestSimpleTrackingShardHandler,
ActionThrottleTest, BaseCdcrDistributedZkTest, CdcrBootstrapTest, ConfigSetsAPITest, CustomCollectionTest,
DistribCursorPagingTest, MultiThreadedOCPTest, RecoveryAfterSoftCommitTest, RemoteQueryErrorTest,
RollingRestartTest, TestExclusionRuleCollectionAccess, TestHdfsCloudBackupRestore, TestLeaderElectionWithEmptyReplica,
TestLockTree, TestMiniSolrCloudCluster, TestStressInPlaceUpdates, BlobRepositoryCloudTest,
TestInfoStreamLogging, TestInitParams, TestNRTOpen, TestReloadAndDeleteDocs, TestSolrCoreSnapshots,
RequestLoggingTest, TestHdfsBackupRestoreCore, TestReqParamsAPI, CoreAdminCreateDiscoverTest,
CoreMergeIndexesAdminHandlerTest, InfoHandlerTest, MetricsHandlerTest, SegmentsInfoRequestHandlerTest,
TestApiFramework]
   [junit4] Completed [569/692 (2!)] on J0 in 0.06s, 2 tests, 1 error <<< FAILURES!

[...truncated 51916 lines...]


Mime
View raw message