lucene-dev mailing list archives

Site index · List index
Message view « Date » · « Thread »
Top « Date » · « Thread »
From Apache Jenkins Server <jenk...@builds.apache.org>
Subject [JENKINS] Lucene-Solr-SmokeRelease-6.x - Build # 252 - Still Failing
Date Sun, 05 Feb 2017 14:55:38 GMT
Build: https://builds.apache.org/job/Lucene-Solr-SmokeRelease-6.x/252/

No tests ran.

Build Log:
[...truncated 41902 lines...]
prepare-release-no-sign:
    [mkdir] Created dir: /x1/jenkins/jenkins-slave/workspace/Lucene-Solr-SmokeRelease-6.x/lucene/build/smokeTestRelease/dist
     [copy] Copying 476 files to /x1/jenkins/jenkins-slave/workspace/Lucene-Solr-SmokeRelease-6.x/lucene/build/smokeTestRelease/dist/lucene
     [copy] Copying 260 files to /x1/jenkins/jenkins-slave/workspace/Lucene-Solr-SmokeRelease-6.x/lucene/build/smokeTestRelease/dist/solr
   [smoker] Java 1.8 JAVA_HOME=/home/jenkins/tools/java/latest1.8
   [smoker] NOTE: output encoding is UTF-8
   [smoker] 
   [smoker] Load release URL "file:/x1/jenkins/jenkins-slave/workspace/Lucene-Solr-SmokeRelease-6.x/lucene/build/smokeTestRelease/dist/"...
   [smoker] 
   [smoker] Test Lucene...
   [smoker]   test basics...
   [smoker]   get KEYS
   [smoker]     0.2 MB in 0.01 sec (22.2 MB/sec)
   [smoker]   check changes HTML...
   [smoker]   download lucene-6.5.0-src.tgz...
   [smoker]     30.7 MB in 0.03 sec (882.8 MB/sec)
   [smoker]     verify md5/sha1 digests
   [smoker]   download lucene-6.5.0.tgz...
   [smoker]     65.2 MB in 0.07 sec (890.5 MB/sec)
   [smoker]     verify md5/sha1 digests
   [smoker]   download lucene-6.5.0.zip...
   [smoker]     75.5 MB in 0.08 sec (890.7 MB/sec)
   [smoker]     verify md5/sha1 digests
   [smoker]   unpack lucene-6.5.0.tgz...
   [smoker]     verify JAR metadata/identity/no javax.* or java.* classes...
   [smoker]     test demo with 1.8...
   [smoker]       got 6220 hits for query "lucene"
   [smoker]     checkindex with 1.8...
   [smoker]     check Lucene's javadoc JAR
   [smoker]   unpack lucene-6.5.0.zip...
   [smoker]     verify JAR metadata/identity/no javax.* or java.* classes...
   [smoker]     test demo with 1.8...
   [smoker]       got 6220 hits for query "lucene"
   [smoker]     checkindex with 1.8...
   [smoker]     check Lucene's javadoc JAR
   [smoker]   unpack lucene-6.5.0-src.tgz...
   [smoker]     make sure no JARs/WARs in src dist...
   [smoker]     run "ant validate"
   [smoker]     run tests w/ Java 8 and testArgs='-Dtests.slow=false'...
   [smoker] 
   [smoker] command "export JAVA_HOME="/home/jenkins/tools/java/latest1.8" PATH="/home/jenkins/tools/java/latest1.8/bin:$PATH" JAVACMD="/home/jenkins/tools/java/latest1.8/bin/java"; ant clean test -Dtests.slow=false" failed:
   [smoker] Buildfile: /x1/jenkins/jenkins-slave/workspace/Lucene-Solr-SmokeRelease-6.x/lucene/build/smokeTestRelease/tmp/unpack/lucene-6.5.0/build.xml
   [smoker] 
   [smoker] clean:
   [smoker]    [delete] Deleting directory /x1/jenkins/jenkins-slave/workspace/Lucene-Solr-SmokeRelease-6.x/lucene/build/smokeTestRelease/tmp/unpack/lucene-6.5.0/build
   [smoker] 
   [smoker] ivy-availability-check:
   [smoker] 
   [smoker] ivy-fail:
   [smoker] 
   [smoker] ivy-configure:
   [smoker] [ivy:configure] :: Apache Ivy 2.3.0 - 20130110142753 :: http://ant.apache.org/ivy/ ::
   [smoker] [ivy:configure] :: loading settings :: file = /x1/jenkins/jenkins-slave/workspace/Lucene-Solr-SmokeRelease-6.x/lucene/build/smokeTestRelease/tmp/unpack/lucene-6.5.0/top-level-ivy-settings.xml
   [smoker] 
   [smoker] -clover.load:
   [smoker] 
   [smoker] resolve-groovy:
   [smoker] [ivy:cachepath] :: resolving dependencies :: org.codehaus.groovy#groovy-all-caller;working
   [smoker] [ivy:cachepath] 	confs: [default]
   [smoker] [ivy:cachepath] 	found org.codehaus.groovy#groovy-all;2.4.8 in public
   [smoker] [ivy:cachepath] :: resolution report :: resolve 206ms :: artifacts dl 3ms
   [smoker] 	---------------------------------------------------------------------
   [smoker] 	|                  |            modules            ||   artifacts   |
   [smoker] 	|       conf       | number| search|dwnlded|evicted|| number|dwnlded|
   [smoker] 	---------------------------------------------------------------------
   [smoker] 	|      default     |   1   |   0   |   0   |   0   ||   1   |   0   |
   [smoker] 	---------------------------------------------------------------------
   [smoker] 
   [smoker] -init-totals:
   [smoker] 
   [smoker] test-core:
   [smoker] 
   [smoker] -clover.disable:
   [smoker] 
   [smoker] ivy-availability-check:
   [smoker] 
   [smoker] ivy-fail:
   [smoker] 
   [smoker] ivy-configure:
   [smoker] [ivy:configure] :: loading settings :: file = /x1/jenkins/jenkins-slave/workspace/Lucene-Solr-SmokeRelease-6.x/lucene/build/smokeTestRelease/tmp/unpack/lucene-6.5.0/top-level-ivy-settings.xml
   [smoker] 
   [smoker] -clover.load:
   [smoker] 
   [smoker] -clover.classpath:
   [smoker] 
   [smoker] -clover.setup:
   [smoker] 
   [smoker] clover:
   [smoker] 
   [smoker] -check-git-state:
   [smoker] 
   [smoker] -git-cleanroot:
   [smoker] 
   [smoker] -copy-git-state:
   [smoker] 
   [smoker] git-autoclean:
   [smoker] 
   [smoker] resolve:
   [smoker] 
   [smoker] init:
   [smoker] 
   [smoker] compile-core:
   [smoker]     [mkdir] Created dir: /x1/jenkins/jenkins-slave/workspace/Lucene-Solr-SmokeRelease-6.x/lucene/build/smokeTestRelease/tmp/unpack/lucene-6.5.0/build/core/classes/java
   [smoker]     [javac] Compiling 810 source files to /x1/jenkins/jenkins-slave/workspace/Lucene-Solr-SmokeRelease-6.x/lucene/build/smokeTestRelease/tmp/unpack/lucene-6.5.0/build/core/classes/java
   [smoker]     [javac] Note: Some input files use or override a deprecated API.
   [smoker]     [javac] Note: Recompile with -Xlint:deprecation for details.
   [smoker]     [javac] Creating empty /x1/jenkins/jenkins-slave/workspace/Lucene-Solr-SmokeRelease-6.x/lucene/build/smokeTestRelease/tmp/unpack/lucene-6.5.0/build/core/classes/java/org/apache/lucene/util/graph/package-info.class
   [smoker]     [javac] Creating empty /x1/jenkins/jenkins-slave/workspace/Lucene-Solr-SmokeRelease-6.x/lucene/build/smokeTestRelease/tmp/unpack/lucene-6.5.0/build/core/classes/java/org/apache/lucene/document/package-info.class
   [smoker]     [javac] Creating empty /x1/jenkins/jenkins-slave/workspace/Lucene-Solr-SmokeRelease-6.x/lucene/build/smokeTestRelease/tmp/unpack/lucene-6.5.0/build/core/classes/java/org/apache/lucene/package-info.class
   [smoker]     [javac] Creating empty /x1/jenkins/jenkins-slave/workspace/Lucene-Solr-SmokeRelease-6.x/lucene/build/smokeTestRelease/tmp/unpack/lucene-6.5.0/build/core/classes/java/org/apache/lucene/util/bkd/package-info.class
   [smoker]     [javac] Creating empty /x1/jenkins/jenkins-slave/workspace/Lucene-Solr-SmokeRelease-6.x/lucene/build/smokeTestRelease/tmp/unpack/lucene-6.5.0/build/core/classes/java/org/apache/lucene/codecs/compressing/package-info.class
   [smoker]     [javac] Creating empty /x1/jenkins/jenkins-slave/workspace/Lucene-Solr-SmokeRelease-6.x/lucene/build/smokeTestRelease/tmp/unpack/lucene-6.5.0/build/core/classes/java/org/apache/lucene/codecs/lucene60/package-info.class
   [smoker]     [javac] Creating empty /x1/jenkins/jenkins-slave/workspace/Lucene-Solr-SmokeRelease-6.x/lucene/build/smokeTestRelease/tmp/unpack/lucene-6.5.0/build/core/classes/java/org/apache/lucene/codecs/package-info.class
   [smoker]     [javac] Creating empty /x1/jenkins/jenkins-slave/workspace/Lucene-Solr-SmokeRelease-6.x/lucene/build/smokeTestRelease/tmp/unpack/lucene-6.5.0/build/core/classes/java/org/apache/lucene/util/package-info.class
   [smoker]     [javac] Creating empty /x1/jenkins/jenkins-slave/workspace/Lucene-Solr-SmokeRelease-6.x/lucene/build/smokeTestRelease/tmp/unpack/lucene-6.5.0/build/core/classes/java/org/apache/lucene/index/package-info.class
   [smoker]     [javac] Creating empty /x1/jenkins/jenkins-slave/workspace/Lucene-Solr-SmokeRelease-6.x/lucene/build/smokeTestRelease/tmp/unpack/lucene-6.5.0/build/core/classes/java/org/apache/lucene/util/fst/package-info.class
   [smoker]     [javac] Creating empty /x1/jenkins/jenkins-slave/workspace/Lucene-Solr-SmokeRelease-6.x/lucene/build/smokeTestRelease/tmp/unpack/lucene-6.5.0/build/core/classes/java/org/apache/lucene/analysis/tokenattributes/package-info.class
   [smoker]     [javac] Creating empty /x1/jenkins/jenkins-slave/workspace/Lucene-Solr-SmokeRelease-6.x/lucene/build/smokeTestRelease/tmp/unpack/lucene-6.5.0/build/core/classes/java/org/apache/lucene/search/package-info.class
   [smoker]     [javac] Creating empty /x1/jenkins/jenkins-slave/workspace/Lucene-Solr-SmokeRelease-6.x/lucene/build/smokeTestRelease/tmp/unpack/lucene-6.5.0/build/core/classes/java/org/apache/lucene/codecs/lucene62/package-info.class
   [smoker]     [javac] Creating empty /x1/jenkins/jenkins-slave/workspace/Lucene-Solr-SmokeRelease-6.x/lucene/build/smokeTestRelease/tmp/unpack/lucene-6.5.0/build/core/classes/java/org/apache/lucene/util/packed/package-info.class
   [smoker]     [javac] Creating empty /x1/jenkins/jenkins-slave/workspace/Lucene-Solr-SmokeRelease-6.x/lucene/build/smokeTestRelease/tmp/unpack/lucene-6.5.0/build/core/classes/java/org/apache/lucene/util/mutable/package-info.class
   [smoker]     [javac] Creating empty /x1/jenkins/jenkins-slave/workspace/Lucene-Solr-SmokeRelease-6.x/lucene/build/smokeTestRelease/tmp/unpack/lucene-6.5.0/build/core/classes/java/org/apache/lucene/codecs/perfield/package-info.class
   [smoker]     [javac] Creating empty /x1/jenkins/jenkins-slave/workspace/Lucene-Solr-SmokeRelease-6.x/lucene/build/smokeTestRelease/tmp/unpack/lucene-6.5.0/build/core/classes/java/org/apache/lucene/analysis/package-info.class
   [smoker]     [javac] Creating empty /x1/jenkins/jenkins-slave/workspace/Lucene-Solr-SmokeRelease-6.x/lucene/build/smokeTestRelease/tmp/unpack/lucene-6.5.0/build/core/classes/java/org/apache/lucene/analysis/standard/package-info.class
   [smoker]     [javac] Creating empty /x1/jenkins/jenkins-slave/workspace/Lucene-Solr-SmokeRelease-6.x/lucene/build/smokeTestRelease/tmp/unpack/lucene-6.5.0/build/core/classes/java/org/apache/lucene/store/package-info.class
   [smoker]     [javac] Creating empty /x1/jenkins/jenkins-slave/workspace/Lucene-Solr-SmokeRelease-6.x/lucene/build/smokeTestRelease/tmp/unpack/lucene-6.5.0/build/core/classes/java/org/apache/lucene/codecs/blocktree/package-info.class
   [smoker]     [javac] Creating empty /x1/jenkins/jenkins-slave/workspace/Lucene-Solr-SmokeRelease-6.x/lucene/build/smokeTestRelease/tmp/unpack/lucene-6.5.0/build/core/classes/java/org/apache/lucene/search/spans/package-info.class
   [smoker]     [javac] Creating empty /x1/jenkins/jenkins-slave/workspace/Lucene-Solr-SmokeRelease-6.x/lucene/build/smokeTestRelease/tmp/unpack/lucene-6.5.0/build/core/classes/java/org/apache/lucene/codecs/lucene54/package-info.class
   [smoker]     [javac] Creating empty /x1/jenkins/jenkins-slave/workspace/Lucene-Solr-SmokeRelease-6.x/lucene/build/smokeTestRelease/tmp/unpack/lucene-6.5.0/build/core/classes/java/org/apache/lucene/search/similarities/package-info.class
   [smoker]     [javac] Creating empty /x1/jenkins/jenkins-slave/workspace/Lucene-Solr-SmokeRelease-6.x/lucene/build/smokeTestRelease/tmp/unpack/lucene-6.5.0/build/core/classes/java/org/apache/lucene/util/automaton/package-info.class
   [smoker]     [javac] Creating empty /x1/jenkins/jenkins-slave/workspace/Lucene-Solr-SmokeRelease-6.x/lucene/build/smokeTestRelease/tmp/unpack/lucene-6.5.0/build/core/classes/java/org/apache/lucene/codecs/lucene53/package-info.class
   [smoker]     [javac] Creating empty /x1/jenkins/jenkins-slave/workspace/Lucene-Solr-SmokeRelease-6.x/lucene/build/smokeTestRelease/tmp/unpack/lucene-6.5.0/build/core/classes/java/org/apache/lucene/codecs/lucene50/package-info.class
   [smoker]     [javac] Creating empty /x1/jenkins/jenkins-slave/workspace/Lucene-Solr-SmokeRelease-6.x/lucene/build/smokeTestRelease/tmp/unpack/lucene-6.5.0/build/core/classes/java/org/apache/lucene/geo/package-info.class
   [smoker]      [copy] Copying 3 files to /x1/jenkins/jenkins-slave/workspace/Lucene-Solr-SmokeRelease-6.x/lucene/build/smokeTestRelease/tmp/unpack/lucene-6.5.0/build/core/classes/java
   [smoker] 
   [smoker] compile-test-framework:
   [smoker] 
   [smoker] -check-git-state:
   [smoker] 
   [smoker] -git-cleanroot:
   [smoker] 
   [smoker] -copy-git-state:
   [smoker] 
   [smoker] git-autoclean:
   [smoker] 
   [smoker] ivy-availability-check:
   [smoker] 
   [smoker] ivy-fail:
   [smoker] 
   [smoker] ivy-configure:
   [smoker] [ivy:configure] :: loading settings :: file = /x1/jenkins/jenkins-slave/workspace/Lucene-Solr-SmokeRelease-6.x/lucene/build/smokeTestRelease/tmp/unpack/lucene-6.5.0/top-level-ivy-settings.xml
   [smoker] 
   [smoker] resolve:
   [smoker] 
   [smoker] init:
   [smoker] 
   [smoker] compile-lucene-core:
   [smoker] 
   [smoker] -check-git-state:
   [smoker] 
   [smoker] -git-cleanroot:
   [smoker] 
   [smoker] -copy-git-state:
   [smoker] 
   [smoker] git-autoclean:
   [smoker] 
   [smoker] ivy-availability-check:
   [smoker] 
   [smoker] ivy-fail:
   [smoker] 
   [smoker] ivy-configure:
   [smoker] [ivy:configure] :: loading settings :: file = /x1/jenkins/jenkins-slave/workspace/Lucene-Solr-SmokeRelease-6.x/lucene/build/smokeTestRelease/tmp/unpack/lucene-6.5.0/top-level-ivy-settings.xml
   [smoker] 
   [smoker] resolve:
   [smoker] 
   [smoker] init:
   [smoker] 
   [smoker] -clover.disable:
   [smoker] 
   [smoker] -clover.load:
   [smoker] 
   [smoker] -clover.classpath:
   [smoker] 
   [smoker] -clover.setup:
   [smoker] 
   [smoker] clover:
   [smoker] 
   [smoker] compile-core:
   [smoker] 
   [smoker] compile-codecs:
   [smoker] 
   [smoker] -check-git-state:
   [smoker] 
   [smoker] -git-cleanroot:
   [smoker] 
   [smoker] -copy-git-state:
   [smoker] 
   [smoker] git-autoclean:
   [smoker] 
   [smoker] ivy-availability-check:
   [smoker] 
   [smoker] ivy-fail:
   [smoker] 
   [smoker] ivy-configure:
   [smoker] [ivy:configure] :: loading settings :: file = /x1/jenkins/jenkins-slave/workspace/Lucene-Solr-SmokeRelease-6.x/lucene/build/smokeTestRelease/tmp/unpack/lucene-6.5.0/top-level-ivy-settings.xml
   [smoker] 
   [smoker] resolve:
   [smoker] 
   [smoker] common.init:
   [smoker] 
   [smoker] compile-lucene-core:
   [smoker] 
   [smoker] init:
   [smoker] 
   [smoker] -clover.disable:
   [smoker] 
   [smoker] -clover.load:
   [smoker] 
   [smoker] -clover.classpath:
   [smoker] 
   [smoker] -clover.setup:
   [smoker] 
   [smoker] clover:
   [smoker] 
   [smoker] compile-core:
   [smoker]     [mkdir] Created dir: /x1/jenkins/jenkins-slave/workspace/Lucene-Solr-SmokeRelease-6.x/lucene/build/smokeTestRelease/tmp/unpack/lucene-6.5.0/build/codecs/classes/java
   [smoker]     [javac] Compiling 67 source files to /x1/jenkins/jenkins-slave/workspace/Lucene-Solr-SmokeRelease-6.x/lucene/build/smokeTestRelease/tmp/unpack/lucene-6.5.0/build/codecs/classes/java
   [smoker]     [javac] Creating empty /x1/jenkins/jenkins-slave/workspace/Lucene-Solr-SmokeRelease-6.x/lucene/build/smokeTestRelease/tmp/unpack/lucene-6.5.0/build/codecs/classes/java/org/apache/lucene/codecs/bloom/package-info.class
   [smoker]     [javac] Creating empty /x1/jenkins/jenkins-slave/workspace/Lucene-Solr-SmokeRelease-6.x/lucene/build/smokeTestRelease/tmp/unpack/lucene-6.5.0/build/codecs/classes/java/org/apache/lucene/codecs/memory/package-info.class
   [smoker]     [javac] Creating empty /x1/jenkins/jenkins-slave/workspace/Lucene-Solr-SmokeRelease-6.x/lucene/build/smokeTestRelease/tmp/unpack/lucene-6.5.0/build/codecs/classes/java/org/apache/lucene/codecs/simpletext/package-info.class
   [smoker]     [javac] Creating empty /x1/jenkins/jenkins-slave/workspace/Lucene-Solr-SmokeRelease-6.x/lucene/build/smokeTestRelease/tmp/unpack/lucene-6.5.0/build/codecs/classes/java/org/apache/lucene/codecs/blockterms/package-info.class
   [smoker]     [javac] Creating empty /x1/jenkins/jenkins-slave/workspace/Lucene-Solr-SmokeRelease-6.x/lucene/build/smokeTestRelease/tmp/unpack/lucene-6.5.0/build/codecs/classes/java/org/apache/lucene/codecs/blocktreeords/package-info.class
   [smoker]      [copy] Copying 3 files to /x1/jenkins/jenkins-slave/workspace/Lucene-Solr-SmokeRelease-6.x/lucene/build/smokeTestRelease/tmp/unpack/lucene-6.5.0/build/codecs/classes/java
   [smoker] 
   [smoker] -clover.disable:
   [smoker] 
   [smoker] -clover.load:
   [smoker] 
   [smoker] -clover.classpath:
   [smoker] 
   [smoker] -clover.setup:
   [smoker] 
   [smoker] clover:
   [smoker] 
   [smoker] common.compile-core:
   [smoker]     [mkdir] Created dir: /x1/jenkins/jenkins-slave/workspace/Lucene-Solr-SmokeRelease-6.x/lucene/build/smokeTestRelease/tmp/unpack/lucene-6.5.0/build/test-framework/classes/java
   [smoker]     [javac] Compiling 185 source files to /x1/jenkins/jenkins-slave/workspace/Lucene-Solr-SmokeRelease-6.x/lucene/build/smokeTestRelease/tmp/unpack/lucene-6.5.0/build/test-framework/classes/java
   [smoker]     [javac] Note: Some input files use or override a deprecated API.
   [smoker]     [javac] Note: Recompile with -Xlint:deprecation for details.
   [smoker]     [javac] Creating empty /x1/jenkins/jenkins-slave/workspace/Lucene-Solr-SmokeRelease-6.x/lucene/build/smokeTestRelease/tmp/unpack/lucene-6.5.0/build/test-framework/classes/java/org/apache/lucene/codecs/asserting/package-info.class
   [smoker]     [javac] Creating empty /x1/jenkins/jenkins-slave/workspace/Lucene-Solr-SmokeRelease-6.x/lucene/build/smokeTestRelease/tmp/unpack/lucene-6.5.0/build/test-framework/classes/java/org/apache/lucene/codecs/ramonly/package-info.class
   [smoker]     [javac] Creating empty /x1/jenkins/jenkins-slave/workspace/Lucene-Solr-SmokeRelease-6.x/lucene/build/smokeTestRelease/tmp/unpack/lucene-6.5.0/build/test-framework/classes/java/org/apache/lucene/mockfile/package-info.class
   [smoker]     [javac] Creating empty /x1/jenkins/jenkins-slave/workspace/Lucene-Solr-SmokeRelease-6.x/lucene/build/smokeTestRelease/tmp/unpack/lucene-6.5.0/build/test-framework/classes/java/org/apache/lucene/codecs/cheapbastard/package-info.class
   [smoker]     [javac] Creating empty /x1/jenkins/jenkins-slave/workspace/Lucene-Solr-SmokeRelease-6.x/lucene/build/smokeTestRelease/tmp/unpack/lucene-6.5.0/build/test-framework/classes/java/org/apache/lucene/codecs/mockrandom/package-info.class
   [smoker]     [javac] Creating empty /x1/jenkins/jenkins-slave/workspace/Lucene-Solr-SmokeRelease-6.x/lucene/build/smokeTestRelease/tmp/unpack/lucene-6.5.0/build/test-framework/classes/java/org/apache/lucene/codecs/cranky/package-info.class
   [smoker]     [javac] Creating empty /x1/jenkins/jenkins-slave/workspace/Lucene-Solr-SmokeRelease-6.x/lucene/build/smokeTestRelease/tmp/unpack/lucene-6.5.0/build/test-framework/classes/java/org/apache/lucene/codecs/compressing/dummy/package-info.class
   [smoker]      [copy] Copying 4 files to /x1/jenkins/jenkins-slave/workspace/Lucene-Solr-SmokeRelease-6.x/lucene/build/smokeTestRelease/tmp/unpack/lucene-6.5.0/build/test-framework/classes/java
   [smoker] 
   [smoker] compile-core:
   [smoker] 
   [smoker] compile-test:
   [smoker]     [mkdir] Created dir: /x1/jenkins/jenkins-slave/workspace/Lucene-Solr-SmokeRelease-6.x/lucene/build/smokeTestRelease/tmp/unpack/lucene-6.5.0/build/core/classes/test
   [smoker]     [javac] Compiling 458 source files to /x1/jenkins/jenkins-slave/workspace/Lucene-Solr-SmokeRelease-6.x/lucene/build/smokeTestRelease/tmp/unpack/lucene-6.5.0/build/core/classes/test
   [smoker]     [javac] Note: Some input files use or override a deprecated API.
   [smoker]     [javac] Note: Recompile with -Xlint:deprecation for details.
   [smoker]      [copy] Copying 3 files to /x1/jenkins/jenkins-slave/workspace/Lucene-Solr-SmokeRelease-6.x/lucene/build/smokeTestRelease/tmp/unpack/lucene-6.5.0/build/core/classes/test
   [smoker] 
   [smoker] install-junit4-taskdef:
   [smoker] 
   [smoker] validate:
   [smoker] 
   [smoker] resolve-groovy:
   [smoker] 
   [smoker] -init-totals:
   [smoker] 
   [smoker] -test:
   [smoker]     [mkdir] Created dir: /x1/jenkins/jenkins-slave/workspace/Lucene-Solr-SmokeRelease-6.x/lucene/build/smokeTestRelease/tmp/unpack/lucene-6.5.0/build/core/test
   [smoker]     [mkdir] Created dir: /x1/jenkins/jenkins-slave/workspace/Lucene-Solr-SmokeRelease-6.x/lucene/build/smokeTestRelease/tmp/unpack/lucene-6.5.0/build/core/test/temp
   [smoker]     [mkdir] Created dir: /x1/jenkins/jenkins-slave/workspace/Lucene-Solr-SmokeRelease-6.x/lucene/build/smokeTestRelease/tmp/unpack/.caches/test-stats/core
   [smoker]    [junit4] <JUnit4> says hi! Master seed: F094FE342C7F9580
   [smoker]    [junit4] Executing 451 suites with 3 JVMs.
   [smoker]    [junit4] 
   [smoker]    [junit4] Started J1 PID(18438@localhost).
   [smoker]    [junit4] Started J0 PID(18437@localhost).
   [smoker]    [junit4] Started J2 PID(18436@localhost).
   [smoker]    [junit4] Suite: org.apache.lucene.search.TestBooleanQueryVisitSubscorers
   [smoker]    [junit4] Completed [1/451] on J1 in 3.04s, 5 tests
   [smoker]    [junit4] 
   [smoker]    [junit4] Suite: org.apache.lucene.search.TestMultiPhraseQuery
   [smoker]    [junit4] Completed [2/451] on J2 in 3.83s, 17 tests, 1 skipped
   [smoker]    [junit4] 
   [smoker]    [junit4] Suite: org.apache.lucene.index.TestTransactionRollback
   [smoker]    [junit4] Completed [3/451] on J1 in 2.25s, 2 tests
   [smoker]    [junit4] 
   [smoker]    [junit4] Suite: org.apache.lucene.search.TestDocValuesRewriteMethod
   [smoker]    [junit4] Completed [4/451] on J2 in 8.24s, 2 tests
   [smoker]    [junit4] 
   [smoker]    [junit4] Suite: org.apache.lucene.search.TestMultiThreadTermVectors
   [smoker]    [junit4] Completed [5/451] on J1 in 8.69s, 1 test
   [smoker]    [junit4] 
   [smoker]    [junit4] Suite: org.apache.lucene.TestExternalCodecs
   [smoker]    [junit4] Completed [6/451] on J1 in 2.58s, 1 test
   [smoker]    [junit4] 
   [smoker]    [junit4] Suite: org.apache.lucene.codecs.lucene50.TestBlockPostingsFormat2
   [smoker]    [junit4] Completed [7/451] on J0 in 17.93s, 4 tests
   [smoker]    [junit4] 
   [smoker]    [junit4] Suite: org.apache.lucene.util.TestFixedBitDocIdSet
   [smoker]    [junit4] Completed [8/451] on J1 in 2.44s, 5 tests
   [smoker]    [junit4] 
   [smoker]    [junit4] Suite: org.apache.lucene.search.spans.TestNearSpansOrdered
   [smoker]    [junit4] Completed [9/451] on J0 in 1.46s, 19 tests
   [smoker]    [junit4] 
   [smoker]    [junit4] Suite: org.apache.lucene.search.TestDateSort
   [smoker]    [junit4] Completed [10/451] on J1 in 0.61s, 1 test
   [smoker]    [junit4] 
   [smoker]    [junit4] Suite: org.apache.lucene.index.TestTryDelete
   [smoker]    [junit4] Completed [11/451] on J1 in 0.30s, 3 tests
   [smoker]    [junit4] 
   [smoker]    [junit4] Suite: org.apache.lucene.index.TestPerSegmentDeletes
   [smoker]    [junit4] Completed [12/451] on J0 in 0.47s, 1 test
   [smoker]    [junit4] 
   [smoker]    [junit4] Suite: org.apache.lucene.store.TestLockFactory
   [smoker]    [junit4] Completed [13/451] on J1 in 0.08s, 2 tests
   [smoker]    [junit4] 
   [smoker]    [junit4] Suite: org.apache.lucene.util.TestQueryBuilder
   [smoker]    [junit4] Completed [14/451] on J1 in 0.29s, 21 tests
   [smoker]    [junit4] 
   [smoker]    [junit4] Suite: org.apache.lucene.search.TestDocValuesScoring
   [smoker]    [junit4] Completed [15/451] on J0 in 0.60s, 1 test
   [smoker]    [junit4] 
   [smoker]    [junit4] Suite: org.apache.lucene.search.FuzzyTermOnShortTermsTest
   [smoker]    [junit4] Completed [16/451] on J0 in 0.78s, 1 test
   [smoker]    [junit4] 
   [smoker]    [junit4] Suite: org.apache.lucene.search.TestSearcherManager
   [smoker]    [junit4] Completed [17/451] on J2 in 12.38s, 11 tests
   [smoker]    [junit4] 
   [smoker]    [junit4] Suite: org.apache.lucene.TestAssertions
   [smoker]    [junit4] Completed [18/451] on J2 in 0.07s, 1 test
   [smoker]    [junit4] 
   [smoker]    [junit4] Suite: org.apache.lucene.util.TestLSBRadixSorter
   [smoker]    [junit4] Completed [19/451] on J2 in 0.23s, 6 tests
   [smoker]    [junit4] 
   [smoker]    [junit4] Suite: org.apache.lucene.search.similarities.TestSimilarityBase
   [smoker]    [junit4] Completed [20/451] on J0 in 4.78s, 32 tests
   [smoker]    [junit4] 
   [smoker]    [junit4] Suite: org.apache.lucene.index.TestMaxTermFrequency
   [smoker]    [junit4] Completed [21/451] on J0 in 0.43s, 1 test
   [smoker]    [junit4] 
   [smoker]    [junit4] Suite: org.apache.lucene.util.TestLongBitSet
   [smoker]    [junit4] IGNOR/A 0.02s J0 | TestLongBitSet.testHugeCapacity
   [smoker]    [junit4]    > Assumption #1: 'nightly' test group is disabled (@Nightly())
   [smoker]    [junit4] Completed [22/451] on J0 in 2.30s, 9 tests, 1 skipped
   [smoker]    [junit4] 
   [smoker]    [junit4] Suite: org.apache.lucene.index.TestExitableDirectoryReader
   [smoker]    [junit4] Completed [23/451] on J0 in 0.02s, 1 test, 1 skipped
   [smoker]    [junit4] 
   [smoker]    [junit4] Suite: org.apache.lucene.search.TestPhraseQuery
   [smoker]    [junit4] Completed [24/451] on J2 in 5.76s, 21 tests
   [smoker]    [junit4] 
   [smoker]    [junit4] Suite: org.apache.lucene.search.TestEarlyTermination
   [smoker]    [junit4] Completed [25/451] on J2 in 0.74s, 1 test
   [smoker]    [junit4] 
   [smoker]    [junit4] Suite: org.apache.lucene.store.TestFilterDirectory
   [smoker]    [junit4] IGNOR/A 0.03s J2 | TestFilterDirectory.testFsyncDoesntCreateNewFiles
   [smoker]    [junit4]    > Assumption #1: test only works for FSDirectory subclasses
   [smoker]    [junit4] IGNOR/A 0.01s J2 | TestFilterDirectory.testPendingDeletions
   [smoker]    [junit4]    > Assumption #1: we can only install VirusCheckingFS on an FSDirectory
   [smoker]    [junit4] Completed [26/451] on J2 in 1.77s, 46 tests, 2 skipped
   [smoker]    [junit4] 
   [smoker]    [junit4] Suite: org.apache.lucene.analysis.TestGraphTokenizers
   [smoker]    [junit4] Completed [27/451] on J1 in 14.40s, 23 tests
   [smoker]    [junit4] 
   [smoker]    [junit4] Suite: org.apache.lucene.index.TestDocumentsWriterDeleteQueue
   [smoker]    [junit4] Completed [28/451] on J1 in 0.52s, 5 tests
   [smoker]    [junit4] 
   [smoker]    [junit4] Suite: org.apache.lucene.index.TestTermVectorsReader
   [smoker]    [junit4] Completed [29/451] on J1 in 0.71s, 13 tests
   [smoker]    [junit4] 
   [smoker]    [junit4] Suite: org.apache.lucene.index.TestMaxPosition
   [smoker]    [junit4] Completed [30/451] on J1 in 0.12s, 2 tests
   [smoker]    [junit4] 
   [smoker]    [junit4] Suite: org.apache.lucene.util.TestSloppyMath
   [smoker]    [junit4] Completed [31/451] on J2 in 6.27s, 8 tests
   [smoker]    [junit4] 
   [smoker]    [junit4] Suite: org.apache.lucene.analysis.TestToken
   [smoker]    [junit4] Completed [32/451] on J2 in 0.09s, 5 tests
   [smoker]    [junit4] 
   [smoker]    [junit4] Suite: org.apache.lucene.index.TestBagOfPostings
   [smoker]    [junit4] Completed [33/451] on J0 in 11.08s, 1 test
   [smoker]    [junit4] 
   [smoker]    [junit4] Suite: org.apache.lucene.search.similarities.TestAxiomaticSimilarity
   [smoker]    [junit4] Completed [34/451] on J0 in 0.09s, 4 tests
   [smoker]    [junit4] 
   [smoker]    [junit4] Suite: org.apache.lucene.util.TestMSBRadixSorter
   [smoker]    [junit4] Completed [35/451] on J1 in 10.08s, 8 tests
   [smoker]    [junit4] 
   [smoker]    [junit4] Suite: org.apache.lucene.search.TermInSetQueryTest
   [smoker]    [junit4] Completed [36/451] on J1 in 3.45s, 10 tests
   [smoker]    [junit4] 
   [smoker]    [junit4] Suite: org.apache.lucene.search.TestFuzzyQuery
   [smoker]    [junit4] Completed [37/451] on J0 in 14.84s, 11 tests
   [smoker]    [junit4] 
   [smoker]    [junit4] Suite: org.apache.lucene.util.automaton.TestOperations
   [smoker]    [junit4] Completed [38/451] on J0 in 1.66s, 5 tests
   [smoker]    [junit4] 
   [smoker]    [junit4] Suite: org.apache.lucene.util.TestIntsRef
   [smoker]    [junit4] Completed [39/451] on J0 in 0.05s, 2 tests
   [smoker]    [junit4] 
   [smoker]    [junit4] Suite: org.apache.lucene.index.TestIndexWriterDelete
   [smoker]    [junit4] IGNOR/A 0.00s J2 | TestIndexWriterDelete.testApplyDeletesOnFlush
   [smoker]    [junit4]    > Assumption #1: 'nightly' test group is disabled (@Nightly())
   [smoker]    [junit4] Completed [40/451] on J2 in 17.57s, 27 tests, 1 skipped
   [smoker]    [junit4] 
   [smoker]    [junit4] Suite: org.apache.lucene.index.TestNRTThreads
   [smoker]    [junit4] Completed [41/451] on J0 in 7.66s, 1 test
   [smoker]    [junit4] 
   [smoker]    [junit4] Suite: org.apache.lucene.util.TestMergedIterator
   [smoker]    [junit4] Completed [42/451] on J0 in 0.57s, 25 tests
   [smoker]    [junit4] 
   [smoker]    [junit4] Suite: org.apache.lucene.index.TestLazyProxSkipping
   [smoker]    [junit4] Completed [43/451] on J0 in 0.93s, 2 tests
   [smoker]    [junit4] 
   [smoker]    [junit4] Suite: org.apache.lucene.TestSearch
   [smoker]    [junit4] Completed [44/451] on J0 in 0.21s, 2 tests
   [smoker]    [junit4] 
   [smoker]    [junit4] Suite: org.apache.lucene.search.TestConjunctionDISI
   [smoker]    [junit4] Completed [45/451] on J2 in 10.56s, 5 tests
   [smoker]    [junit4] 
   [smoker]    [junit4] Suite: org.apache.lucene.index.TestPayloadsOnVectors
   [smoker]    [junit4] Completed [46/451] on J2 in 0.36s, 3 tests
   [smoker]    [junit4] 
   [smoker]    [junit4] Suite: org.apache.lucene.index.TestAllFilesDetectTruncation
   [smoker]    [junit4] Completed [47/451] on J0 in 1.77s, 1 test
   [smoker]    [junit4] 
   [smoker]    [junit4] Suite: org.apache.lucene.util.TestRamUsageEstimator
   [smoker]    [junit4] IGNOR/A 0.02s J2 | TestRamUsageEstimator.testPrintValues
   [smoker]    [junit4]    > Assumption #1: Specify -Dtests.verbose=true to print constants of RamUsageEstimator.
   [smoker]    [junit4] Completed [48/451] on J2 in 0.11s, 5 tests, 1 skipped
   [smoker]    [junit4] 
   [smoker]    [junit4] Suite: org.apache.lucene.search.TestGraphQuery
   [smoker]    [junit4] Completed [49/451] on J2 in 0.05s, 5 tests
   [smoker]    [junit4] 
   [smoker]    [junit4] Suite: org.apache.lucene.search.TestPositiveScoresOnlyCollector
   [smoker]    [junit4] Completed [50/451] on J2 in 0.05s, 1 test
   [smoker]    [junit4] 
   [smoker]    [junit4] Suite: org.apache.lucene.util.TestIntArrayDocIdSet
   [smoker]    [junit4] Completed [51/451] on J2 in 1.09s, 5 tests
   [smoker]    [junit4] 
   [smoker]    [junit4] Suite: org.apache.lucene.search.MultiCollectorTest
   [smoker]    [junit4] Completed [52/451] on J2 in 0.10s, 4 tests
   [smoker]    [junit4] 
   [smoker]    [junit4] Suite: org.apache.lucene.store.TestDirectory
   [smoker]    [junit4] Completed [53/451] on J0 in 2.15s, 3 tests
   [smoker]    [junit4] 
   [smoker]    [junit4] Suite: org.apache.lucene.search.TestFieldValueQuery
   [smoker]    [junit4] Completed [54/451] on J0 in 7.85s, 6 tests
   [smoker]    [junit4] 
   [smoker]    [junit4] Suite: org.apache.lucene.index.TestIndexWriterConfig
   [smoker]    [junit4] Completed [55/451] on J0 in 0.22s, 8 tests
   [smoker]    [junit4] 
   [smoker]    [junit4] Suite: org.apache.lucene.search.TestLRUQueryCache
   [smoker]    [junit4] Completed [56/451] on J2 in 14.55s, 18 tests
   [smoker]    [junit4] 
   [smoker]    [junit4] Suite: org.apache.lucene.util.TestDocIdSetBuilder
   [smoker]    [junit4] Completed [57/451] on J0 in 6.71s, 7 tests
   [smoker]    [junit4] 
   [smoker]    [junit4] Suite: org.apache.lucene.search.TestSortedNumericSortField
   [smoker]    [junit4] Completed [58/451] on J0 in 0.31s, 9 tests
   [smoker]    [junit4] 
   [smoker]    [junit4] Suite: org.apache.lucene.search.TestCachingCollector
   [smoker]    [junit4] Completed [59/451] on J0 in 0.11s, 4 tests
   [smoker]    [junit4] 
   [smoker]    [junit4] Suite: org.apache.lucene.search.spans.TestSpanNotQuery
   [smoker]    [junit4] Completed [60/451] on J0 in 0.12s, 3 tests
   [smoker]    [junit4] 
   [smoker]    [junit4] Suite: org.apache.lucene.util.TestIOUtils
   [smoker]    [junit4] Completed [61/451] on J0 in 0.47s, 18 tests
   [smoker]    [junit4] 
   [smoker]    [junit4] Suite: org.apache.lucene.search.TestEarlyTerminatingSortingCollector
   [smoker]    [junit4] Completed [62/451] on J1 in 36.30s, 4 tests
   [smoker]    [junit4] 
   [smoker]    [junit4] Suite: org.apache.lucene.util.TestFilterIterator
   [smoker]    [junit4] Completed [63/451] on J1 in 0.12s, 8 tests
   [smoker]    [junit4] 
   [smoker]    [junit4] Suite: org.apache.lucene.index.TestDocsAndPositions
   [smoker]    [junit4] Completed [64/451] on J2 in 1.86s, 6 tests
   [smoker]    [junit4] 
   [smoker]    [junit4] Suite: org.apache.lucene.index.TestCodecHoldsOpenFiles
   [smoker]    [junit4] Completed [65/451] on J0 in 0.17s, 1 test
   [smoker]    [junit4] 
   [smoker]    [junit4] Suite: org.apache.lucene.util.TestAttributeSource
   [smoker]    [junit4] Completed [66/451] on J0 in 0.19s, 7 tests
   [smoker]    [junit4] 
   [smoker]    [junit4] Suite: org.apache.lucene.index.TestReadOnlyIndex
   [smoker]    [junit4] Completed [67/451] on J1 in 0.52s, 1 test
   [smoker]    [junit4] 
   [smoker]    [junit4] Suite: org.apache.lucene.search.TestQueryRescorer
   [smoker]    [junit4] Completed [68/451] on J2 in 2.11s, 6 tests
   [smoker]    [junit4] 
   [smoker]    [junit4] Suite: org.apache.lucene.search.TestAutomatonQuery
   [smoker]    [junit4] Completed [69/451] on J1 in 8.81s, 8 tests
   [smoker]    [junit4] 
   [smoker]    [junit4] Suite: org.apache.lucene.util.automaton.TestUTF32ToUTF8
   [smoker]    [junit4] Completed [70/451] on J2 in 8.89s, 6 tests
   [smoker]    [junit4] 
   [smoker]    [junit4] Suite: org.apache.lucene.search.spans.TestSpanBoostQuery
   [smoker]    [junit4] Completed [71/451] on J2 in 0.05s, 2 tests
   [smoker]    [junit4] 
   [smoker]    [junit4] Suite: org.apache.lucene.util.TestTimSorterWorstCase
   [smoker]    [junit4] IGNOR/A 0.00s J2 | TestTimSorterWorstCase.testWorstCaseStackSize
   [smoker]    [junit4]    > Assumption #1: 'slow' test group is disabled (@Slow())
   [smoker]    [junit4] Completed [72/451] on J2 in 0.02s, 1 test, 1 skipped
   [smoker]    [junit4] 
   [smoker]    [junit4] Suite: org.apache.lucene.util.automaton.TestCompiledAutomaton
   [smoker]    [junit4] Completed [73/451] on J2 in 0.84s, 6 tests
   [smoker]    [junit4] 
   [smoker]    [junit4] Suite: org.apache.lucene.search.TestWildcardRandom
   [smoker]    [junit4] Completed [74/451] on J2 in 0.25s, 1 test
   [smoker]    [junit4] 
   [smoker]    [junit4] Suite: org.apache.lucene.util.TestBytesRefHash
   [smoker]    [junit4] Completed [75/451] on J2 in 6.42s, 8 tests
   [smoker]    [junit4] 
   [smoker]    [junit4] Suite: org.apache.lucene.util.TestRecyclingIntBlockAllocator
   [smoker]    [junit4] Completed [76/451] on J2 in 0.14s, 3 tests
   [smoker]    [junit4] 
   [smoker]    [junit4] Suite: org.apache.lucene.index.TestConcurrentMergeScheduler
   [smoker]    [junit4] Completed [77/451] on J1 in 10.12s, 16 tests
   [smoker]    [junit4] 
   [smoker]    [junit4] Suite: org.apache.lucene.search.TestIndexSearcher
   [smoker]    [junit4] Completed [78/451] on J1 in 0.41s, 5 tests
   [smoker]    [junit4] 
   [smoker]    [junit4] Suite: org.apache.lucene.util.automaton.TestRegExp
   [smoker]    [junit4] Completed [79/451] on J1 in 0.59s, 5 tests
   [smoker]    [junit4] 
   [smoker]    [junit4] Suite: org.apache.lucene.search.TestTermScorer
   [smoker]    [junit4] Completed [80/451] on J1 in 0.19s, 4 tests
   [smoker]    [junit4] 
   [smoker]    [junit4] Suite: org.apache.lucene.util.TestSentinelIntSet
   [smoker]    [junit4] Completed [81/451] on J1 in 0.36s, 2 tests
   [smoker]    [junit4] 
   [smoker]    [junit4] Suite: org.apache.lucene.util.TestVirtualMethod
   [smoker]    [junit4] Completed [82/451] on J1 in 0.16s, 2 tests
   [smoker]    [junit4] 
   [smoker]    [junit4] Suite: org.apache.lucene.search.TestSortedSetSelector
   [smoker]    [junit4] Completed [83/451] on J1 in 0.38s, 15 tests
   [smoker]    [junit4] 
   [smoker]    [junit4] Suite: org.apache.lucene.util.TestNumericUtils
   [smoker]    [junit4] Completed [84/451] on J2 in 4.99s, 24 tests
   [smoker]    [junit4] 
   [smoker]    [junit4] Suite: org.apache.lucene.analysis.standard.TestStandardAnalyzer
   [smoker]    [junit4] IGNOR/A 0.00s J0 | TestStandardAnalyzer.testLargePartiallyMatchingToken
   [smoker]    [junit4]    > Assumption #1: 'slow' test group is disabled (@Slow())
   [smoker]    [junit4] Completed [85/451] on J0 in 24.19s, 34 tests, 1 skipped
   [smoker]    [junit4] 
   [smoker]    [junit4] Suite: org.apache.lucene.search.TestElevationComparator
   [smoker]    [junit4] Completed [86/451] on J0 in 0.14s, 1 test
   [smoker]    [junit4] 
   [smoker]    [junit4] Suite: org.apache.lucene.codecs.lucene62.TestLucene62SegmentInfoFormat
   [smoker]    [junit4] Completed [87/451] on J2 in 1.35s, 16 tests
   [smoker]    [junit4] 
   [smoker]    [junit4] Suite: org.apache.lucene.util.fst.TestBytesStore
   [smoker]    [junit4] Completed [88/451] on J2 in 3.52s, 1 test
   [smoker]    [junit4] 
   [smoker]    [junit4] Suite: org.apache.lucene.search.TestSimpleExplanationsOfNonMatches
   [smoker]    [junit4] Completed [89/451] on J2 in 0.44s, 70 tests
   [smoker]    [junit4] 
   [smoker]    [junit4] Suite: org.apache.lucene.util.TestArrayUtil
   [smoker]    [junit4] Completed [90/451] on J1 in 11.52s, 14 tests
   [smoker]    [junit4] 
   [smoker]    [junit4] Suite: org.apache.lucene.util.TestNotDocIdSet
   [smoker]    [junit4] Completed [91/451] on J1 in 1.94s, 6 tests
   [smoker]    [junit4] 
   [smoker]    [junit4] Suite: org.apache.lucene.util.TestIntroSorter
   [smoker]    [junit4] Completed [92/451] on J1 in 0.23s, 9 tests
   [smoker]    [junit4] 
   [smoker]    [junit4] Suite: org.apache.lucene.index.TestIndexWriterUnicode
   [smoker]    [junit4] Completed [93/451] on J0 in 11.21s, 5 tests
   [smoker]    [junit4] 
   [smoker]    [junit4] Suite: org.apache.lucene.util.TestSparseFixedBitDocIdSet
   [smoker]    [junit4] Completed [94/451] on J0 in 3.40s, 5 tests
   [smoker]    [junit4] 
   [smoker]    [junit4] Suite: org.apache.lucene.index.TestIndexWriterWithThreads
   [smoker]    [junit4] IGNOR/A 0.00s J0 | TestIndexWriterWithThreads.testCloseWithThreads
   [smoker]    [junit4]    > Assumption #1: 'slow' test group is disabled (@Slow())
   [smoker]    [junit4] IGNOR/A 0.00s J0 | TestIndexWriterWithThreads.testIOExceptionDuringAbort
   [smoker]    [junit4]    > Assumption #1: 'slow' test group is disabled (@Slow())
   [smoker]    [junit4] IGNOR/A 0.00s J0 | TestIndexWriterWithThreads.testRollbackAndCommitWithThreads
   [smoker]    [junit4]    > Assumption #1: 'slow' test group is disabled (@Slow())
   [smoker]    [junit4] IGNOR/A 0.00s J0 | TestIndexWriterWithThreads.testIOExceptionDuringWriteSegmentWithThreadsOnlyOnce
   [smoker]    [junit4]    > Assumption #1: 'slow' test group is disabled (@Slow())
   [smoker]    [junit4] IGNOR/A 0.00s J0 | TestIndexWriterWithThreads.testIOExceptionDuringAbortWithThreadsOnlyOnce
   [smoker]    [junit4]    > Assumption #1: 'slow' test group is disabled (@Slow())
   [smoker]    [junit4] IGNOR/A 0.00s J0 | TestIndexWriterWithThreads.testIOExceptionDuringWriteSegmentOnlyOnce
   [smoker]    [junit4]    > Assumption #1: 'slow' test group is disabled (@Slow())
   [smoker]    [junit4] IGNOR/A 0.00s J0 | TestIndexWriterWithThreads.testIOExceptionDuringWriteSegmentWithThreads
   [smoker]    [junit4]    > Assumption #1: 'slow' test group is disabled (@Slow())
   [smoker]    [junit4] IGNOR/A 0.00s J0 | TestIndexWriterWithThreads.testIOExceptionDuringAbortOnlyOnce
   [smoker]    [junit4]    > Assumption #1: 'slow' test group is disabled (@Slow())
   [smoker]    [junit4] IGNOR/A 0.00s J0 | TestIndexWriterWithThreads.testImmediateDiskFullWithThreads
   [smoker]    [junit4]    > Assumption #1: 'slow' test group is disabled (@Slow())
   [smoker]    [junit4] IGNOR/A 0.00s J0 | TestIndexWriterWithThreads.testOpenTwoIndexWritersOnDifferentThreads
   [smoker]    [junit4]    > Assumption #1: 'slow' test group is disabled (@Slow())
   [smoker]    [junit4] IGNOR/A 0.00s J0 | TestIndexWriterWithThreads.testIOExceptionDuringAbortWithThreads
   [smoker]    [junit4]    > Assumption #1: 'slow' test group is disabled (@Slow())
   [smoker]    [junit4] IGNOR/A 0.00s J0 | TestIndexWriterWithThreads.testIOExceptionDuringWriteSegment
   [smoker]    [junit4]    > Assumption #1: 'slow' test group is disabled (@Slow())
   [smoker]    [junit4] Completed [95/451] on J0 in 0.05s, 12 tests, 12 skipped
   [smoker]    [junit4] 
   [smoker]    [junit4] Suite: org.apache.lucene.search.TestShardSearching
   [smoker]    [junit4] Completed [96/451] on J2 in 10.94s, 1 test
   [smoker]    [junit4] 
   [smoker]    [junit4] Suite: org.apache.lucene.codecs.TestCodecLoadingDeadlock
   [smoker]    [junit4] Completed [97/451] on J0 in 1.56s, 1 test
   [smoker]    [junit4] 
   [smoker]    [junit4] Suite: org.apache.lucene.codecs.lucene50.TestLucene50StoredFieldsFormat
   [smoker]    [junit4] IGNOR/A 0.01s J1 | TestLucene50StoredFieldsFormat.testRamBytesUsed
   [smoker]    [junit4]    > Assumption #1: 'slow' test group is disabled (@Slow())
   [smoker]    [junit4] IGNOR/A 0.00s J1 | TestLucene50StoredFieldsFormat.testBigDocuments
   [smoker]    [junit4]    > Assumption #1: 'nightly' test group is disabled (@Nightly())
   [smoker]    [junit4] Completed [98/451] on J1 in 6.01s, 17 tests, 2 skipped
   [smoker]    [junit4] 
   [smoker]    [junit4] Suite: org.apache.lucene.util.mutable.TestMutableValues
   [smoker]    [junit4] Completed [99/451] on J1 in 0.20s, 6 tests
   [smoker]    [junit4] 
   [smoker]    [junit4] Suite: org.apache.lucene.store.TestNIOFSDirectory
   [smoker]    [junit4] Completed [100/451] on J2 in 1.84s, 44 tests
   [smoker]    [junit4] 
   [smoker]    [junit4] Suite: org.apache.lucene.index.TestParallelTermEnum
   [smoker]    [junit4] Completed [101/451] on J2 in 0.12s, 1 test
   [smoker]    [junit4] 
   [smoker]    [junit4] Suite: org.apache.lucene.search.TestRegexpRandom
   [smoker]    [junit4] Completed [102/451] on J1 in 0.41s, 1 test
   [smoker]    [junit4] 
   [smoker]    [junit4] Suite: org.apache.lucene.search.TestNGramPhraseQuery
   [smoker]    [junit4] Completed [103/451] on J1 in 0.10s, 1 test
   [smoker]    [junit4] 
   [smoker]    [junit4] Suite: org.apache.lucene.index.TestReaderWrapperDVTypeCheck
   [smoker]    [junit4] Completed [104/451] on J2 in 0.13s, 1 test
   [smoker]    [junit4] 
   [smoker]    [junit4] Suite: org.apache.lucene.search.TestBooleanQuery
   [smoker]    [junit4] Completed [105/451] on J2 in 1.37s, 22 tests
   [smoker]    [junit4] 
   [smoker]    [junit4] Suite: org.apache.lucene.index.TestOrdinalMap
   [smoker]    [junit4] Completed [106/451] on J2 in 0.19s, 1 test
   [smoker]    [junit4] 
   [smoker]    [junit4] Suite: org.apache.lucene.search.TestUsageTrackingFilterCachingPolicy
   [smoker]    [junit4] Completed [107/451] on J2 in 0.08s, 2 tests
   [smoker]    [junit4] 
   [smoker]    [junit4] Suite: org.apache.lucene.search.TestApproximationSearchEquivalence
   [smoker]    [junit4] Completed [108/451] on J2 in 1.37s, 10 tests
   [smoker]    [junit4] 
   [smoker]    [junit4] Suite: org.apache.lucene.store.TestMultiMMap
   [smoker]    [junit4] Completed [109/451] on J1 in 6.11s, 56 tests
   [smoker]    [junit4] 
   [smoker]    [junit4] Suite: org.apache.lucene.index.TestStressIndexing
   [smoker]    [junit4] Completed [110/451] on J2 in 3.32s, 1 test
   [smoker]    [junit4] 
   [smoker]    [junit4] Suite: org.apache.lucene.index.TestIntBlockPool
   [smoker]    [junit4] Completed [111/451] on J1 in 2.00s, 2 tests
   [smoker]    [junit4] 
   [smoker]    [junit4] Suite: org.apache.lucene.index.TestMixedDocValuesUpdates
   [smoker]    [junit4] IGNOR/A 0.00s J1 | TestMixedDocValuesUpdates.testTonsOfUpdates
   [smoker]    [junit4]    > Assumption #1: 'nightly' test group is disabled (@Nightly())
   [smoker]    [junit4] Completed [112/451] on J1 in 6.40s, 4 tests, 1 skipped
   [smoker]    [junit4] 
   [smoker]    [junit4] Suite: org.apache.lucene.index.TestIndexWriterMaxDocs
   [smoker]    [junit4] IGNOR/A 0.00s J2 | TestIndexWriterMaxDocs.testExactlyAtTrueLimit
   [smoker]    [junit4]    > Assumption #1: 'monster' test group is disabled (@Monster(value=takes over two hours))
   [smoker]    [junit4] Completed [113/451] on J2 in 8.46s, 21 tests, 1 skipped
   [smoker]    [junit4] 
   [smoker]    [junit4] Suite: org.apache.lucene.index.TestSumDocFreq
   [smoker]    [junit4] Completed [114/451] on J1 in 0.27s, 1 test
   [smoker]    [junit4] 
   [smoker]    [junit4] Suite: org.apache.lucene.index.TestInfoStream
   [smoker]    [junit4] Completed [115/451] on J1 in 0.06s, 2 tests
   [smoker]    [junit4] 
   [smoker]    [junit4] Suite: org.apache.lucene.search.TestSortRandom
   [smoker]    [junit4] Completed [116/451] on J1 in 1.33s, 2 tests
   [smoker]    [junit4] 
   [smoker]    [junit4] Suite: org.apache.lucene.index.TestReaderClosed
   [smoker]    [junit4] Completed [117/451] on J1 in 0.16s, 2 tests
   [smoker]    [junit4] 
   [smoker]    [junit4] Suite: org.apache.lucene.store.TestSimpleFSDirectory
   [smoker]    [junit4] Completed [118/451] on J2 in 2.38s, 44 tests
   [smoker]    [junit4] 
   [smoker]    [junit4] Suite: org.apache.lucene.search.TestSloppyPhraseQuery2
   [smoker]    [junit4] Completed [119/451] on J2 in 1.59s, 9 tests
   [smoker]    [junit4] 
   [smoker]    [junit4] Suite: org.apache.lucene.index.TestSegmentTermDocs
   [smoker]    [junit4] Completed [120/451] on J2 in 0.58s, 4 tests
   [smoker]    [junit4] 
   [smoker]    [junit4] Suite: org.apache.lucene.index.TestOmitNorms
   [smoker]    [junit4] Completed [121/451] on J1 in 3.13s, 5 tests
   [smoker]    [junit4] 
   [smoker]    [junit4] Suite: org.apache.lucene.index.TestFieldReuse
   [smoker]    [junit4] Completed [122/451] on J1 in 0.10s, 3 tests
   [smoker]    [junit4] 
   [smoker]    [junit4] Suite: org.apache.lucene.index.TestTerms
   [smoker]    [junit4] Completed [123/451] on J2 in 0.67s, 8 tests
   [smoker]    [junit4] 
   [smoker]    [junit4] Suite: org.apache.lucene.search.similarities.TestBooleanSimilarity
   [smoker]    [junit4] Completed [124/451] on J2 in 0.07s, 3 tests
   [smoker]    [junit4] 
   [smoker]    [junit4] Suite: org.apache.lucene.index.TestExceedMaxTermLength
   [smoker]    [junit4] Completed [125/451] on J2 in 0.09s, 1 test
   [smoker]    [junit4] 
   [smoker]    [junit4] Suite: org.apache.lucene.index.TestTermdocPerf
   [smoker]    [junit4] Completed [126/451] on J2 in 0.04s, 1 test
   [smoker]    [junit4] 
   [smoker]    [junit4] Suite: org.apache.lucene.search.similarities.TestSimilarity2
   [smoker]    [junit4] Completed [127/451] on J2 in 0.50s, 8 tests
   [smoker]    [junit4] 
   [smoker]    [junit4] Suite: org.apache.lucene.search.TestControlledRealTimeReopenThread
   [smoker]    [junit4] IGNOR/A 0.00s J0 | TestControlledRealTimeReopenThread.testCRTReopen
   [smoker]    [junit4]    > Assumption #1: 'awaitsfix' test group is disabled (@AwaitsFix(bugUrl=https://issues.apache.org/jira/browse/LUCENE-5737))
   [smoker]    [junit4] Completed [128/451] on J0 in 22.78s, 6 tests, 1 skipped
   [smoker]    [junit4] 
   [smoker]    [junit4] Suite: org.apache.lucene.store.TestRAMDirectory
   [smoker]    [junit4] IGNOR/A 0.01s J1 | TestRAMDirectory.testPendingDeletions
   [smoker]    [junit4]    > Assumption #1: we can only install VirusCheckingFS on an FSDirectory
   [smoker]    [junit4] IGNOR/A 0.00s J1 | TestRAMDirectory.testFsyncDoesntCreateNewFiles
   [smoker]    [junit4]    > Assumption #1: test only works for FSDirectory subclasses
   [smoker]    [junit4] Completed [129/451] on J1 in 2.36s, 48 tests, 2 skipped
   [smoker]    [junit4] 
   [smoker]    [junit4] Suite: org.apache.lucene.search.spans.TestSpanExplanationsOfNonMatches
   [smoker]    [junit4] Completed [130/451] on J0 in 0.42s, 30 tests
   [smoker]    [junit4] 
   [smoker]    [junit4] Suite: org.apache.lucene.search.TestSameScoresWithThreads
   [smoker]    [junit4] Completed [131/451] on J1 in 2.05s, 1 test
   [smoker]    [junit4] 
   [smoker]    [junit4] Suite: org.apache.lucene.index.TestNewestSegment
   [smoker]    [junit4] Completed [132/451] on J1 in 0.07s, 1 test
   [smoker]    [junit4] 
   [smoker]    [junit4] Suite: org.apache.lucene.index.TestParallelLeafReader
   [smoker]    [junit4] Completed [133/451] on J1 in 0.79s, 9 tests
   [smoker]    [junit4] 
   [smoker]    [junit4] Suite: org.apache.lucene.search.TestSubScorerFreqs
   [smoker]    [junit4] Completed [134/451] on J1 in 0.17s, 3 tests
   [smoker]    [junit4] 
   [smoker]    [junit4] Suite: org.apache.lucene.index.TestDirectoryReader
   [smoker]    [junit4] Completed [135/451] on J1 in 3.05s, 24 tests
   [smoker]    [junit4] 
   [smoker]    [junit4] Suite: org.apache.lucene.index.TestOmitTf
   [smoker]    [junit4] Completed [136/451] on J1 in 1.37s, 6 tests
   [smoker]    [junit4] 
   [smoker]    [junit4] Suite: org.apache.lucene.search.TestTermQuery
   [smoker]    [junit4] Completed [137/451] on J1 in 0.09s, 2 tests
   [smoker]    [junit4] 
   [smoker]    [junit4] Suite: org.apache.lucene.codecs.compressing.TestFastDecompressionMode
   [smoker]    [junit4] Completed [138/451] on J1 in 3.61s, 11 tests
   [smoker]    [junit4] 
   [smoker]    [junit4] Suite: org.apache.lucene.search.TestMultiTermConstantScore
   [smoker]    [junit4] Completed [139/451] on J1 in 1.70s, 8 tests
   [smoker]    [junit4] 
   [smoker]    [junit4] Suite: org.apache.lucene.codecs.lucene50.TestLucene50StoredFieldsFormatHighCompression
   [smoker]    [junit4] IGNOR/A 0.00s J2 | TestLucene50StoredFieldsFormatHighCompression.testBigDocuments
   [smoker]    [junit4]    > Assumption #1: 'nightly' test group is disabled (@Nightly())
   [smoker]    [junit4] IGNOR/A 0.00s J2 | TestLucene50StoredFieldsFormatHighCompression.testRamBytesUsed
   [smoker]    [junit4]    > Assumption #1: 'slow' test group is disabled (@Slow())
   [smoker]    [junit4] Completed [140/451] on J2 in 14.99s, 19 tests, 2 skipped
   [smoker]    [junit4] 
   [smoker]    [junit4] Suite: org.apache.lucene.search.TestScorerPerf
   [smoker]    [junit4] Completed [141/451] on J2 in 6.56s, 1 test
   [smoker]    [junit4] 
   [smoker]    [junit4] Suite: org.apache.lucene.util.bkd.Test2BBKDPoints
   [smoker]    [junit4] IGNOR/A 0.00s J2 | Test2BBKDPoints.test1D
   [smoker]    [junit4]    > Assumption #1: 'monster' test group is disabled (@Monster(value=takes at least 4 hours and consumes many GB of temp disk space))
   [smoker]    [junit4] IGNOR/A 0.00s J2 | Test2BBKDPoints.test2D
   [smoker]    [junit4]    > Assumption #1: 'monster' test group is disabled (@Monster(value=takes at least 4 hours and consumes many GB of temp disk space))
   [smoker]    [junit4] Completed [142/451] on J2 in 0.02s, 2 tests, 2 skipped
   [smoker]    [junit4] 
   [smoker]    [junit4] Suite: org.apache.lucene.analysis.TestCachingTokenFilter
   [smoker]    [junit4] Completed [143/451] on J2 in 0.21s, 2 tests
   [smoker]    [junit4] 
   [smoker]    [junit4] Suite: org.apache.lucene.codecs.lucene50.TestLucene50TermVectorsFormat
   [smoker]    [junit4] IGNOR/A 0.00s J0 | TestLucene50TermVectorsFormat.testRamBytesUsed
   [smoker]    [junit4]    > Assumption #1: 'slow' test group is disabled (@Slow())
   [smoker]    [junit4] Completed [144/451] on J0 in 22.59s, 17 tests, 1 skipped
   [smoker]    [junit4] 
   [smoker]    [junit4] Suite: org.apache.lucene.index.TestMultiLevelSkipList
   [smoker]    [junit4] Completed [145/451] on J0 in 0.23s, 1 test
   [smoker]    [junit4] 
   [smoker]    [junit4] Suite: org.apache.lucene.search.TestBlendedTermQuery
   [smoker]    [junit4] Completed [146/451] on J0 in 0.09s, 3 tests
   [smoker]    [junit4] 
   [smoker]    [junit4] Suite: org.apache.lucene.search.TestComplexExplanations
   [smoker]    [junit4] Completed [147/451] on J2 in 2.66s, 21 tests
   [smoker]    [junit4] 
   [smoker]    [junit4] Suite: org.apache.lucene.index.TestSegmentTermEnum
   [smoker]    [junit4] Completed [148/451] on J2 in 0.11s, 2 tests
   [smoker]    [junit4] 
   [smoker]    [junit4] Suite: org.apache.lucene.index.TestFlex
   [smoker]    [junit4] Completed [149/451] on J2 in 0.49s, 2 tests
   [smoker]    [junit4] 
   [smoker]    [junit4] Suite: org.apache.lucene.index.TestIndexFileDeleter
   [smoker]    [junit4] Completed [150/451] on J0 in 2.11s, 10 tests
   [smoker]    [junit4] 
   [smoker]    [junit4] Suite: org.apache.lucene.index.TestIndexingSequenceNumbers
   [smoker]    [junit4] IGNOR/A 0.00s J0 | TestIndexingSequenceNumbers.testStressUpdateSameID
   [smoker]    [junit4]    > Assumption #1: 'slow' test group is disabled (@Slow())
   [smoker]    [junit4] IGNOR/A 0.00s J0 | TestIndexingSequenceNumbers.testStressConcurrentCommit
   [smoker]    [junit4]    > Assumption #1: 'slow' test group is disabled (@Slow())
   [smoker]    [junit4] IGNOR/A 0.00s J0 | TestIndexingSequenceNumbers.testStressConcurrentAddAndDeleteAndCommit
   [smoker]    [junit4]    > Assumption #1: 'slow' test group is disabled (@Slow())
   [smoker]    [junit4] IGNOR/A 0.00s J0 | TestIndexingSequenceNumbers.testStressConcurrentDocValuesUpdatesCommit
   [smoker]    [junit4]    > Assumption #1: 'slow' test group is disabled (@Slow())
   [smoker]    [junit4] Completed [151/451] on J0 in 0.08s, 8 tests, 4 skipped
   [smoker]    [junit4] 
   [smoker]    [junit4] Suite: org.apache.lucene.document.TestFieldType
   [smoker]    [junit4] Completed [152/451] on J0 in 0.06s, 3 tests
   [smoker]    [junit4] 
   [smoker]    [junit4] Suite: org.apache.lucene.search.TestReqExclBulkScorer
   [smoker]    [junit4] Completed [153/451] on J0 in 0.08s, 1 test
   [smoker]    [junit4] 
   [smoker]    [junit4] Suite: org.apache.lucene.index.TestStressDeletes
   [smoker]    [junit4] Completed [154/451] on J2 in 1.58s, 1 test
   [smoker]    [junit4] 
   [smoker]    [junit4] Suite: org.apache.lucene.util.bkd.TestDocIdsWriter
   [smoker]    [junit4] Completed [155/451] on J1 in 14.02s, 2 tests
   [smoker]    [junit4] 
   [smoker]    [junit4] Suite: org.apache.lucene.index.TestIndexWriterMerging
   [smoker]    [junit4] IGNOR/A 0.00s J2 | TestIndexWriterMerging.testNoWaitClose
   [smoker]    [junit4]    > Assumption #1: 'slow' test group is disabled (@Slow())
   [smoker]    [junit4] Completed [156/451] on J2 in 3.45s, 6 tests, 1 skipped
   [smoker]    [junit4] 
   [smoker]    [junit4] Suite: org.apache.lucene.TestMergeSchedulerExternal
   [smoker]    [junit4] Completed [157/451] on J1 in 2.11s, 2 tests
   [smoker]    [junit4] 
   [smoker]    [junit4] Suite: org.apache.lucene.codecs.lucene50.TestForUtil
   [smoker]    [junit4] Completed [158/451] on J2 in 0.25s, 1 test
   [smoker]    [junit4] 
   [smoker]    [junit4] Suite: org.apache.lucene.index.TestTermVectors
   [smoker]    [junit4] Completed [159/451] on J1 in 1.16s, 3 tests
   [smoker]    [junit4] 
   [smoker]    [junit4] Suite: org.apache.lucene.index.TestNoMergePolicy
   [smoker]    [junit4] Completed [160/451] on J1 in 0.40s, 4 tests
   [smoker]    [junit4] 
   [smoker]    [junit4] Suite: org.apache.lucene.index.TestDocIDMerger
   [smoker]    [junit4] Completed [161/451] on J1 in 0.04s, 2 tests
   [smoker]    [junit4] 
   [smoker]    [junit4] Suite: org.apache.lucene.util.bkd.TestMutablePointsReaderUtils
   [smoker]    [junit4] Completed [162/451] on J2 in 6.03s, 3 tests
   [smoker]    [junit4] 
   [smoker]    [junit4] Suite: org.apache.lucene.codecs.lucene50.TestLucene50CompoundFormat
   [smoker]    [junit4] IGNOR/A 0.00s J0 | TestLucene50CompoundFormat.testRamBytesUsed
   [smoker]    [junit4]    > Assumption #1: 'slow' test group is disabled (@Slow())
   [smoker]    [junit4] Completed [163/451] on J0 in 11.95s, 26 tests, 1 skipped
   [smoker]    [junit4] 
   [smoker]    [junit4] Suite: org.apache.lucene.index.TestSnapshotDeletionPolicy
   [smoker]    [junit4] Completed [164/451] on J2 in 1.93s, 7 tests
   [smoker]    [junit4] 
   [smoker]    [junit4] Suite: org.apache.lucene.search.TestScoreCachingWrappingScorer
   [smoker]    [junit4] Completed [165/451] on J2 in 0.08s, 1 test
   [smoker]    [junit4] 
   [smoker]    [junit4] Suite: org.apache.lucene.index.TestNoDeletionPolicy
   [smoker]    [junit4] Completed [166/451] on J0 in 0.24s, 4 tests
   [smoker]    [junit4] 
   [smoker]    [junit4] Suite: org.apache.lucene.index.TestNumericDocValuesUpdates
   [smoker]    [junit4] IGNOR/A 0.00s J1 | TestNumericDocValuesUpdates.testTonsOfUpdates
   [smoker]    [junit4]    > Assumption #1: 'nightly' test group is disabled (@Nightly())
   [smoker]    [junit4] Completed [167/451] on J1 in 7.08s, 31 tests, 1 skipped
   [smoker]    [junit4] 
   [smoker]    [junit4] Suite: org.apache.lucene.index.TestFilterLeafReader
   [smoker]    [junit4] Completed [168/451] on J1 in 0.12s, 3 tests
   [smoker]    [junit4] 
   [smoker]    [junit4] Suite: org.apache.lucene.codecs.TestCodecUtil
   [smoker]    [junit4] Completed [169/451] on J1 in 0.08s, 15 tests
   [smoker]    [junit4] 
   [smoker]    [junit4] Suite: org.apache.lucene.util.fst.TestFSTs
   [smoker]    [junit4] IGNOR/A 0.00s J1 | TestFSTs.testRandomTermLookup
   [smoker]    [junit4]    > Assumption #1: 'slow' test group is disabled (@Slow())
   [smoker]    [junit4] IGNOR/A 0.00s J1 | TestFSTs.testShortestPathsRandom
   [smoker]    [junit4]    > Assumption #1: 'slow' test group is disabled (@Slow())
   [smoker]    [junit4] IGNOR/A 0.00s J1 | TestFSTs.testInternalFinalState
   [smoker]    [junit4]    > Assumption #1: 'slow' test group is disabled (@Slow())
   [smoker]    [junit4] IGNOR/A 0.00s J1 | TestFSTs.testExpandedCloseToRoot
   [smoker]    [junit4]    > Assumption #1: 'slow' test group is disabled (@Slow())
   [smoker]    [junit4] IGNOR/A 0.00s J1 | TestFSTs.testShortestPaths
   [smoker]    [junit4]    > Assumption #1: 'slow' test group is disabled (@Slow())
   [smoker]    [junit4] IGNOR/A 0.00s J1 | TestFSTs.testRealTerms
   [smoker]    [junit4]    > Assumption #1: 'slow' test group is disabled (@Slow())
   [smoker]    [junit4] IGNOR/A 0.00s J1 | TestFSTs.testSingleString
   [smoker]    [junit4]    > Assumption #1: 'slow' test group is disabled (@Slow())
   [smoker]    [junit4] IGNOR/A 0.00s J1 | TestFSTs.testBasicFSA
   [smoker]    [junit4]    > Assumption #1: 'slow' test group is disabled (@Slow())
   [smoker]    [junit4] IGNOR/A 0.00s J1 | TestFSTs.testNonFinalStopNode
   [smoker]    [junit4]    > Assumption #1: 'slow' test group is disabled (@Slow())
   [smoker]    [junit4] IGNOR/A 0.00s J1 | TestFSTs.testSimple
   [smoker]    [junit4]    > Assumption #1: 'slow' test group is disabled (@Slow())
   [smoker]    [junit4] IGNOR/A 0.00s J1 | TestFSTs.testPrimaryKeys
   [smoker]    [junit4]    > Assumption #1: 'slow' test group is disabled (@Slow())
   [smoker]    [junit4] IGNOR/A 0.00s J1 | TestFSTs.testShortestPathsWFST
   [smoker]    [junit4]    > Assumption #1: 'slow' test group is disabled (@Slow())
   [smoker]    [junit4] IGNOR/A 0.00s J1 | TestFSTs.testLargeOutputsOnArrayArcs
   [smoker]    [junit4]    > Assumption #1: 'slow' test group is disabled (@Slow())
   [smoker]    [junit4] IGNOR/A 0.00s J1 | TestFSTs.testDuplicateFSAString
   [smoker]    [junit4]    > Assumption #1: 'slow' test group is disabled (@Slow())
   [smoker]    [junit4] IGNOR/A 0.00s J1 | TestFSTs.testRandomWords
   [smoker]    [junit4]    > Assumption #1: 'slow' test group is disabled (@Slow())
   [smoker]    [junit4] IGNOR/A 0.00s J1 | TestFSTs.testIllegallyModifyRootArc
   [smoker]    [junit4]    > Assumption #1: 'slow' test group is disabled (@Slow())
   [smoker]    [junit4] IGNOR/A 0.00s J1 | TestFSTs.testFinalOutputOnEndState
   [smoker]    [junit4]    > Assumption #1: 'slow' test group is disabled (@Slow())
   [smoker]    [junit4] IGNOR/A 0.00s J1 | TestFSTs.testShortestPathsWFSTRandom
   [smoker]    [junit4]    > Assumption #1: 'slow' test group is disabled (@Slow())
   [smoker]    [junit4] IGNOR/A 0.00s J1 | TestFSTs.testRejectNoLimits
   [smoker]    [junit4]    > Assumption #1: 'slow' test group is disabled (@Slow())
   [smoker]    [junit4] IGNOR/A 0.00s J1 | TestFSTs.testBigSet
   [smoker]    [junit4]    > Assumption #1: 'nightly' test group is disabled (@Nightly())
   [smoker]    [junit4] Completed [170/451] on J1 in 0.18s, 20 tests, 20 skipped
   [smoker]    [junit4] 
   [smoker]    [junit4] Suite: org.apache.lucene.index.TestNorms
   [smoker]    [junit4] IGNOR/A 0.00s J1 | TestNorms.testCustomEncoder
   [smoker]    [junit4]    > Assumption #1: 'slow' test group is disabled (@Slow())
   [smoker]    [junit4] IGNOR/A 0.00s J1 | TestNorms.testMaxByteNorms
   [smoker]    [junit4]    > Assumption #1: 'slow' test group is disabled (@Slow())
   [smoker]    [junit4] Completed [171/451] on J1 in 0.01s, 2 tests, 2 skipped
   [smoker]    [junit4] 
   [smoker]    [junit4] Suite: org.apache.lucene.search.TestMultiPhraseEnum
   [smoker]    [junit4] Completed [172/451] on J1 in 0.07s, 2 tests
   [smoker]    [junit4] 
   [smoker]    [junit4] Suite: org.apache.lucene.index.TestCrash
   [smoker]    [junit4] Completed [173/451] on J2 in 1.41s, 5 tests
   [smoker]    [junit4] 
   [smoker]    [junit4] Suite: org.apache.lucene.index.TestAllFilesHaveChecksumFooter
   [smoker]    [junit4] Completed [174/451] on J1 in 3.00s, 1 test
   [smoker]    [junit4] 
   [smoker]    [junit4] Suite: org.apache.lucene.index.Test2BSortedDocValuesOrds
   [smoker]    [junit4] IGNOR/A 0.00s J1 | Test2BSortedDocValuesOrds.test2BOrds
   [smoker]    [junit4]    > Assumption #1: 'monster' test group is disabled (@Monster(value=Takes ~ 6 hours if the heap is 5gb))
   [smoker]    [junit4] Completed [175/451] on J1 in 0.02s, 1 test, 1 skipped
   [smoker]    [junit4] 
   [smoker]    [junit4] Suite: org.apache.lucene.index.TestAtomicUpdate
   [smoker]    [junit4] Completed [176/451] on J2 in 4.49s, 1 test
   [smoker]    [junit4] 
   [smoker]    [junit4] Suite: org.apache.lucene.search.TestSimpleSearchEquivalence
   [smoker]    [junit4] Completed [177/451] on J1 in 3.64s, 17 tests
   [smoker]    [junit4] 
   [smoker]    [junit4] Suite: org.apache.lucene.index.TestNRTReaderWithThreads
   [smoker]    [junit4] Completed [178/451] on J1 in 1.76s, 1 test
   [smoker]    [junit4] 
   [smoker]    [junit4] Suite: org.apache.lucene.search.TestTopDocsMerge
   [smoker]    [junit4] Completed [179/451] on J2 in 5.25s, 2 tests
   [smoker]    [junit4] 
   [smoker]    [junit4] Suite: org.apache.lucene.index.TestSameTokenSamePosition
   [smoker]    [junit4] Completed [180/451] on J2 in 0.15s, 2 tests
   [smoker]    [junit4] 
   [smoker]    [junit4] Suite: org.apache.lucene.index.TestIndexWriterCommit
   [smoker]    [junit4] Completed [181/451] on J1 in 4.04s, 14 tests
   [smoker]    [junit4] 
   [smoker]    [junit4] Suite: org.apache.lucene.analysis.TestCharFilter
   [smoker]    [junit4] Completed [182/451] on J1 in 0.07s, 4 tests
   [smoker]    [junit4] 
   [smoker]    [junit4] Suite: org.apache.lucene.search.TestBoolean2ScorerSupplier
   [smoker]    [junit4] Completed [183/451] on J1 in 0.19s, 10 tests
   [smoker]    [junit4] 
   [smoker]    [junit4] Suite: org.apache.lucene.search.similarities.TestBM25Similarity
   [smoker]    [junit4] Completed [184/451] on J1 in 0.10s, 3 tests
   [smoker]    [junit4] 
   [smoker]    [junit4] Suite: org.apache.lucene.index.TestDemoParallelLeafReader
   [smoker]    [junit4] Completed [185/451] on J0 in 19.74s, 5 tests
   [smoker]    [junit4] 
   [smoker]    [junit4] Suite: org.apache.lucene.TestSearchForDuplicates
   [smoker]    [junit4] Completed [186/451] on J0 in 0.30s, 1 test
   [smoker]    [junit4] 
   [smoker]    [junit4] Suite: org.apache.lucene.search.spans.TestSpansEnum
   [smoker]    [junit4] Completed [187/451] on J0 in 0.90s, 7 tests
   [smoker]    [junit4] 
   [smoker]    [junit4] Suite: org.apache.lucene.index.TestIndexWriterReader
   [smoker]    [junit4] IGNOR/A 0.00s J2 | TestIndexWriterReader.testDuringAddIndexes
   [smoker]    [junit4]    > Assumption #1: 'nightly' test group is disabled (@Nightly())
   [smoker]    [junit4] IGNOR/A 0.00s J2 | TestIndexWriterReader.testAddIndexesAndDoDeletesThreads
   [smoker]    [junit4]    > Assumption #1: 'slow' test group is disabled (@Slow())
   [smoker]    [junit4] Completed [188/451] on J2 in 9.81s, 23 tests, 2 skipped
   [smoker]    [junit4] 
   [smoker]    [junit4] Suite: org.apache.lucene.analysis.TestStopFilter
   [smoker]    [junit4] Completed [189/451] on J2 in 0.09s, 4 tests
   [smoker]    [junit4] 
   [smoker]    [junit4] Suite: org.apache.lucene.search.TestMatchAllDocsQuery
   [smoker]    [junit4] Completed [190/451] on J2 in 0.15s, 2 tests
   [smoker]    [junit4] 
   [smoker]    [junit4] Suite: org.apache.lucene.search.spans.TestSpanSearchEquivalence
   [smoker]    [junit4] Completed [191/451] on J2 in 5.12s, 33 tests
   [smoker]    [junit4] 
   [smoker]    [junit4] Suite: org.apache.lucene.index.TestIndexWriterOnJRECrash
   [smoker]    [junit4] IGNOR/A 0.00s J2 | TestIndexWriterOnJRECrash.testNRTThreads
   [smoker]    [junit4]    > Assumption #1: 'nightly' test group is disabled (@Nightly())
   [smoker]    [junit4] Completed [192/451] on J2 in 0.00s, 1 test, 1 skipped
   [smoker]    [junit4] 
   [smoker]    [junit4] Suite: org.apache.lucene.index.TestAllFilesCheckIndexHeader
   [smoker]    [junit4] Completed [193/451] on J2 in 1.10s, 1 test
   [smoker]    [junit4] 
   [smoker]    [junit4] Suite: org.apache.lucene.search.spans.TestSpanTermQuery
   [smoker]    [junit4] Completed [194/451] on J2 in 0.09s, 2 tests
   [smoker]    [junit4] 
   [smoker]    [junit4] Suite: org.apache.lucene.index.TestLongPostings
   [smoker]    [junit4] Completed [195/451] on J0 in 9.30s, 2 tests
   [smoker]    [junit4] 
   [smoker]    [junit4] Suite: org.apache.lucene.index.TestTermsEnum2
   [smoker]    [junit4] Completed [196/451] on J0 in 1.77s, 4 tests
   [smoker]    [junit4] 
   [smoker]    [junit4] Suite: org.apache.lucene.search.TestNumericRangeQuery32
   [smoker]    [junit4] Completed [197/451] on J2 in 8.19s, 23 tests
   [smoker]    [junit4] 
   [smoker]    [junit4] Suite: org.apache.lucene.index.TestDeletionPolicy
   [smoker]    [junit4] Completed [198/451] on J0 in 4.16s, 6 tests
   [smoker]    [junit4] 
   [smoker]    [junit4] Suite: org.apache.lucene.util.TestRoaringDocIdSet
   [smoker]    [junit4] Completed [199/451] on J0 in 1.42s, 5 tests
   [smoker]    [junit4] 
   [smoker]    [junit4] Suite: org.apache.lucene.index.TestThreadedForceMerge
   [smoker]    [junit4] Completed [200/451] on J0 in 1.62s, 1 test
   [smoker]    [junit4] 
   [smoker]    [junit4] Suite: org.apache.lucene.util.automaton.FiniteStringsIteratorTest
   [smoker]    [junit4] Completed [201/451] on J0 in 2.37s, 7 tests
   [smoker]    [junit4] 
   [smoker]    [junit4] Suite: org.apache.lucene.index.TestPrefixCodedTerms
   [smoker]    [junit4] Completed [203/451] on J0 in 0.40s, 5 tests
   [smoker]    [junit4] 
   [smoker]    [junit4] Suite: org.apache.lucene.index.TestIndexWriterOnVMError
   [smoker]    [junit4] IGNOR/A 0.00s J0 | TestIndexWriterOnVMError.testCheckpoint
   [smoker]    [junit4]    > Assumption #1: 'nightly' test group is disabled (@Nightly())
   [smoker]    [junit4] Completed [204/451] on J0 in 2.23s, 3 tests, 1 skipped
   [smoker]    [junit4] 
   [smoker]    [junit4] Suite: org.apache.lucene.search.TestComplexExplanationsOfNonMatches
   [smoker]    [junit4] Completed [205/451] on J0 in 0.38s, 21 tests
   [smoker]    [junit4] 
   [smoker]    [junit4] Suite: org.apache.lucene.index.TestIndexSorting
   [smoker]    [junit4] Completed [206/451] on J1 in 30.86s, 48 tests
   [smoker]    [junit4] 
   [smoker]    [junit4] Suite: org.apache.lucene.search.TestSort
   [smoker]    [junit4] Completed [207/451] on J0 in 0.41s, 25 tests
   [smoker]    [junit4] 
   [smoker]    [junit4] Suite: org.apache.lucene.geo.TestGeoEncodingUtils
   [smoker]    [junit4] Completed [208/451] on J1 in 1.47s, 3 tests
   [smoker]    [junit4] 
   [smoker]    [junit4] Suite: org.apache.lucene.search.spans.TestFilterSpans
   [smoker]    [junit4] Completed [209/451] on J1 in 0.18s, 1 test
   [smoker]    [junit4] 
   [smoker]    [junit4] Suite: org.apache.lucene.index.TestIndexWriter
   [smoker]    [junit4] Completed [210/451] on J2 in 10.59s, 72 tests, 1 skipped
   [smoker]    [junit4] 
   [smoker]    [junit4] Suite: org.apache.lucene.search.TestConstantScoreQuery
   [smoker]    [junit4] Completed [211/451] on J1 in 0.14s, 5 tests
   [smoker]    [junit4] 
   [smoker]    [junit4] Suite: org.apache.lucene.store.TestSimpleFSLockFactory
   [smoker]    [junit4] Completed [212/451] on J0 in 12.75s, 7 tests
   [smoker]    [junit4] 
   [smoker]    [junit4] Suite: org.apache.lucene.search.TestNumericRangeQuery64
   [smoker]    [junit4] Completed [213/451] on J1 in 13.44s, 29 tests
   [smoker]    [junit4] 
   [smoker]    [junit4] Suite: org.apache.lucene.util.packed.TestPackedInts
   [smoker]    [junit4] IGNOR/A 0.00s J1 | TestPackedInts.testBlockReaderOverflow
   [smoker]    [junit4]    > Assumption #1: 'nightly' test group is disabled (@Nightly())
   [smoker]    [junit4] Completed [214/451] on J1 in 20.03s, 28 tests, 3 skipped
   [smoker]    [junit4] 
   [smoker]    [junit4] Suite: org.apache.lucene.index.TestAddIndexes
   [smoker]    [junit4] Completed [215/451] on J1 in 4.21s, 25 tests
   [smoker]    [junit4] 
   [smoker]    [junit4] Suite: org.apache.lucene.codecs.perfield.TestPerFieldDocValuesFormat
   [smoker]    [junit4] IGNOR/A 0.00s J2 | TestPerFieldDocValuesFormat.testThreads2
   [smoker]    [junit4]    > Assumption #1: 'slow' test group is disabled (@Slow())
   [smoker]    [junit4] IGNOR/A 0.00s J2 | TestPerFieldDocValuesFormat.testRamBytesUsed
   [smoker]    [junit4]    > Assumption #1: 'slow' test group is disabled (@Slow())
   [smoker]    [junit4] IGNOR/A 0.00s J2 | TestPerFieldDocValuesFormat.testThreads3
   [smoker]    [junit4]    > Assumption #1: 'slow' test group is disabled (@Slow())
   [smoker]    [junit4] Completed [216/451] on J2 in 42.56s, 97 tests, 3 skipped
   [smoker]    [junit4] 
   [smoker]    [junit4] Suite: org.apache.lucene.index.TestBagOfPositions
   [smoker]    [junit4] Completed [217/451] on J0 in 33.45s, 1 test
   [smoker]    [junit4] 
   [smoker]    [junit4] Suite: org.apache.lucene.util.TestFrequencyTrackingRingBuffer
   [smoker]    [junit4] Completed [218/451] on J0 in 0.53s, 2 tests
   [smoker]    [junit4] 
   [smoker]    [junit4] Suite: org.apache.lucene.document.TestDateTools
   [smoker]    [junit4] Completed [219/451] on J0 in 0.10s, 5 tests
   [smoker]    [junit4] 
   [smoker]    [junit4] Suite: org.apache.lucene.search.TestBooleanOr
   [smoker]    [junit4] Completed [220/451] on J2 in 3.63s, 7 tests
   [smoker]    [junit4] 
   [smoker]    [junit4] Suite: org.apache.lucene.index.TestIndexReaderClose
   [smoker]    [junit4] Completed [221/451] on J0 in 1.06s, 2 tests
   [smoker]    [junit4] 
   [smoker]    [junit4] Suite: org.apache.lucene.index.TestDocValues
   [smoker]    [junit4] Completed [222/451] on J0 in 0.20s, 7 tests
   [smoker]    [junit4] 
   [smoker]    [junit4] Suite: org.apache.lucene.search.spans.TestBasics
   [smoker]    [junit4] Completed [223/451] on J2 in 4.66s, 26 tests
   [smoker]    [junit4] 
   [smoker]    [junit4] Suite: org.apache.lucene.util.automaton.TestMinimize
   [smoker]    [junit4] Completed [224/451] on J0 in 6.57s, 3 tests
   [smoker]    [junit4] 
   [smoker]    [junit4] Suite: org.apache.lucene.index.TestMixedCodecs
   [smoker]    [junit4] Completed [225/451] on J0 in 2.31s, 1 test
   [smoker]    [junit4] 
   [smoker]    [junit4] Suite: org.apache.lucene.index.TestFlushByRamOrCountsPolicy
   [smoker]    [junit4] Completed [226/451] on J2 in 4.14s, 5 tests
   [smoker]    [junit4] 
   [smoker]    [junit4] Suite: org.apache.lucene.index.TestStressIndexing2
   [smoker]    [junit4] Completed [227/451] on J0 in 1.03s, 3 tests
   [smoker]    [junit4] 
   [smoker]    [junit4] Suite: org.apache.lucene.index.TestSwappedIndexFiles
   [smoker]    [junit4] Completed [228/451] on J0 in 0.31s, 1 test
   [smoker]    [junit4] 
   [smoker]    [junit4] Suite: org.apache.lucene.search.TestSloppyPhraseQuery
   [smoker]    [junit4] Completed [229/451] on J2 in 2.53s, 9 tests
   [smoker]    [junit4] 
   [smoker]    [junit4] Suite: org.apache.lucene.index.TestIndexWriterMergePolicy
   [smoker]    [junit4] Completed [230/451] on J2 in 3.37s, 7 tests
   [smoker]    [junit4] 
   [smoker]    [junit4] Suite: org.apache.lucene.index.TestDuelingCodecs
   [smoker]    [junit4] IGNOR/A 0.00s J2 | TestDuelingCodecs.testCrazyReaderEquals
   [smoker]    [junit4]    > Assumption #1: 'slow' test group is disabled (@Slow())
   [smoker]    [junit4] IGNOR/A 0.00s J2 | TestDuelingCodecs.testEquals
   [smoker]    [junit4]    > Assumption #1: 'slow' test group is disabled (@Slow())
   [smoker]    [junit4] Completed [231/451] on J2 in 0.02s, 2 tests, 2 skipped
   [smoker]    [junit4] 
   [smoker]    [junit4] Suite: org.apache.lucene.index.TestByteSlices
   [smoker]    [junit4] Completed [232/451] on J0 in 7.71s, 1 test
   [smoker]    [junit4] 
   [smoker]    [junit4] Suite: org.apache.lucene.analysis.TestWordlistLoader
   [smoker]    [junit4] Completed [233/451] on J0 in 0.07s, 3 tests
   [smoker]    [junit4] 
   [smoker]    [junit4] Suite: org.apache.lucene.index.TestIndexWriterExceptions
   [smoker]    [junit4] IGNOR/A 0.00s J1 | TestIndexWriterExceptions.testTooManyTokens
   [smoker]    [junit4]    > Assumption #1: 'nightly' test group is disabled (@Nightly())
   [smoker]    [junit4] Completed [234/451] on J1 in 27.00s, 36 tests, 1 skipped
   [smoker]    [junit4] 
   [smoker]    [junit4] Suite: org.apache.lucene.search.TestBoolean2
   [smoker]    [junit4] Completed [235/451] on J2 in 3.84s, 11 tests
   [smoker]    [junit4] 
   [smoker]    [junit4] Suite: org.apache.lucene.search.TestCustomSearcherSort
   [smoker]    [junit4] Completed [236/451] on J0 in 2.45s, 2 tests
   [smoker]    [junit4] 
   [smoker]    [junit4] Suite: org.apache.lucene.index.TestPersistentSnapshotDeletionPolicy
   [smoker]    [junit4] Completed [237/451] on J1 in 2.49s, 13 tests
   [smoker]    [junit4] 
   [smoker]    [junit4] Suite: org.apache.lucene.index.TestDirectoryReaderReopen
   [smoker]    [junit4] Completed [238/451] on J1 in 2.64s, 14 tests
   [smoker]    [junit4] 
   [smoker]    [junit4] Suite: org.apache.lucene.index.TestStressAdvance
   [smoker]    [junit4] Completed [239/451] on J2 in 5.60s, 1 test
   [smoker]    [junit4] 
   [smoker]    [junit4] Suite: org.apache.lucene.search.TestTimeLimitingCollector
   [smoker]    [junit4] Completed [240/451] on J1 in 4.20s, 7 tests
   [smoker]    [junit4] 
   [smoker]    [junit4] Suite: org.apache.lucene.search.TestSearchAfter
   [smoker]    [junit4] Completed [241/451] on J1 in 0.87s, 1 test
   [smoker]    [junit4] 
   [smoker]    [junit4] Suite: org.apache.lucene.store.TestNativeFSLockFactory
   [smoker]    [junit4] IGNOR/A 0.00s J0 | TestNativeFSLockFactory.testDeleteLockFile
   [smoker]    [junit4]    > Assumption #1: we must be able to delete an open file
   [smoker]    [junit4] IGNOR/A 0.00s J0 | TestNativeFSLockFactory.testStressLocks
   [smoker]    [junit4]    > Assumption #1: cannot handle buggy Files.delete
   [smoker]    [junit4] Completed [242/451] on J0 in 9.31s, 10 tests, 2 skipped
   [smoker]    [junit4] 
   [smoker]    [junit4] Suite: org.apache.lucene.search.TestSearchWithThreads
   [smoker]    [junit4] Completed [243/451] on J2 in 5.60s, 1 test
   [smoker]    [junit4] 
   [smoker]    [junit4] Suite: org.apache.lucene.index.TestIndexableField
   [smoker]    [junit4] Completed [244/451] on J0 in 1.46s, 2 tests
   [smoker]    [junit4] 
   [smoker]    [junit4] Suite: org.apache.lucene.index.TestNRTReaderCleanup
   [smoker]    [junit4] Completed [245/451] on J0 in 0.08s, 1 test
   [smoker]    [junit4] 
   [smoker]    [junit4] Suite: org.apache.lucene.codecs.compressing.TestHighCompressionMode
   [smoker]    [junit4] Completed [246/451] on J1 in 2.09s, 7 tests
   [smoker]    [junit4] 
   [smoker]    [junit4] Suite: org.apache.lucene.store.TestTrackingDirectoryWrapper
   [smoker]    [junit4] IGNOR/A 0.00s J0 | TestTrackingDirectoryWrapper.testFsyncDoesntCreateNewFiles
   [smoker]    [junit4]    > Assumption #1: test only works for FSDirectory subclasses
   [smoker]    [junit4] IGNOR/A 0.04s J0 | TestTrackingDirectoryWrapper.testPendingDeletions
   [smoker]    [junit4]    > Assumption #1: we can only install VirusCheckingFS on an FSDirectory
   [smoker]    [junit4] Completed [247/451] on J0 in 0.85s, 49 tests, 2 skipped
   [smoker]    [junit4] 
   [smoker]    [junit4] Suite: org.apache.lucene.index.TestNeverDelete
   [smoker]    [junit4] Completed [248/451] on J1 in 3.26s, 1 test
   [smoker]    [junit4] 
   [smoker]    [junit4] Suite: org.apache.lucene.index.TestDocumentsWriterStallControl
   [smoker]    [junit4] Completed [249/451] on J2 in 4.18s, 3 tests
   [smoker]    [junit4] 
   [smoker]    [junit4] Suite: org.apache.lucene.index.TestRollingUpdates
   [smoker]    [junit4] Completed [250/451] on J0 in 3.36s, 2 tests
   [smoker]    [junit4] 
   [smoker]    [junit4] Suite: org.apache.lucene.index.TestIndexWriterForceMerge
   [smoker]    [junit4] Completed [251/451] on J2 in 4.08s, 4 tests
   [smoker]    [junit4] 
   [smoker]    [junit4] Suite: org.apache.lucene.index.TestTieredMergePolicy
   [smoker]    [junit4] Completed [252/451] on J1 in 6.47s, 6 tests
   [smoker]    [junit4] 
   [smoker]    [junit4] Suite: org.apache.lucene.store.TestBufferedIndexInput
   [smoker]    [junit4] Completed [253/451] on J1 in 1.24s, 4 tests
   [smoker]    [junit4] 
   [smoker]    [junit4] Suite: org.apache.lucene.util.automaton.TestLevenshteinAutomata
   [smoker]    [junit4] Completed [254/451] on J2 in 5.18s, 4 tests
   [smoker]    [junit4] 
   [smoker]    [junit4] Suite: org.apache.lucene.codecs.perfield.TestPerFieldPostingsFormat
   [smoker]    [junit4] IGNOR/A 0.00s J0 | TestPerFieldPostingsFormat.testPostingsEnumReuse
   [smoker]    [junit4]    > Assumption #1: The MockRandom PF randomizes content on the fly, so we can't check it
   [smoker]    [junit4] IGNOR/A 0.00s J0 | TestPerFieldPostingsFormat.testRamBytesUsed
   [smoker]    [junit4]    > Assumption #1: 'slow' test group is disabled (@Slow())
   [smoker]    [junit4] IGNOR/A 0.00s J0 | TestPerFieldPostingsFormat.testMergeStability
   [smoker]    [junit4]    > Assumption #1: The MockRandom PF randomizes content on the fly, so we can't check it
   [smoker]    [junit4] Completed [255/451] on J0 in 10.24s, 25 tests, 3 skipped
   [smoker]    [junit4] 
   [smoker]    [junit4] Suite: org.apache.lucene.index.TestConsistentFieldNumbers
   [smoker]    [junit4] Completed [256/451] on J2 in 2.21s, 4 tests
   [smoker]    [junit4] 
   [smoker]    [junit4] Suite: org.apache.lucene.search.TestSimpleExplanations
   [smoker]    [junit4] Completed [257/451] on J2 in 1.39s, 70 tests
   [smoker]    [junit4] 
   [smoker]    [junit4] Suite: org.apache.lucene.index.TestSegmentMerger
   [smoker]    [junit4] Completed [258/451] on J2 in 1.79s, 3 tests
   [smoker]    [junit4] 
   [smoker]    [junit4] Suite: org.apache.lucene.index.TestTermsEnum
   [smoker]    [junit4] IGNOR/A 0.00s J1 | TestTermsEnum.testVaryingTermsPerSegment
   [smoker]    [junit4]    > Assumption #1: 'slow' test group is disabled (@Slow())
   [smoker]    [junit4] Completed [259/451] on J1 in 8.77s, 13 tests, 1 skipped
   [smoker]    [junit4] 
   [smoker]    [junit4] Suite: org.apache.lucene.util.TestFixedBitSet
   [smoker]    [junit4] Completed [260/451] on J1 in 4.89s, 19 tests
   [smoker]    [junit4] 
   [smoker]    [junit4] Suite: org.apache.lucene.util.TestWeakIdentityMap
   [smoker]    [junit4] Completed [261/451] on J0 in 14.44s, 2 tests
   [smoker]    [junit4] 
   [smoker]    [junit4] Suite: org.apache.lucene.store.TestNRTCachingDirectory
   [smoker]    [junit4] IGNOR/A 0.00s J0 | TestNRTCachingDirectory.testFsyncDoesntCreateNewFiles
   [smoker]    [junit4]    > Assumption #1: test only works for FSDirectory subclasses
   [smoker]    [junit4] IGNOR/A 0.00s J0 | TestNRTCachingDirectory.testPendingDeletions
   [smoker]    [junit4]    > Assumption #1: we can only install VirusCheckingFS on an FSDirectory
   [smoker]    [junit4] Completed [262/451] on J0 in 2.99s, 46 tests, 2 skipped
   [smoker]    [junit4] 
   [smoker]    [junit4] Suite: org.apache.lucene.search.TestRegexpRandom2
   [smoker]    [junit4] Completed [263/451] on J1 in 7.09s, 1 test
   [smoker]    [junit4] 
   [smoker]    [junit4] Suite: org.apache.lucene.index.TestParallelCompositeReader
   [smoker]    [junit4] Completed [264/451] on J1 in 0.31s, 15 tests
   [smoker]    [junit4] 
   [smoker]    [junit4] Suite: org.apache.lucene.index.TestSegmentReader
   [smoker]    [junit4] Completed [265/451] on J0 in 1.76s, 7 tests
   [smoker]    [junit4] 
   [smoker]    [junit4] Suite: org.apache.lucene.util.TestCollectionUtil
   [smoker]    [junit4] Completed [266/451] on J2 in 19.39s, 4 tests
   [smoker]    [junit4] 
   [smoker]    [junit4] Suite: org.apache.lucene.search.TestFieldCacheRewriteMethod
   [smoker]    [junit4] Completed [267/451] on J0 in 4.87s, 2 tests
   [smoker]    [junit4] 
   [smoker]    [junit4] Suite: org.apache.lucene.index.TestIndexWriterNRTIsCurrent
   [smoker]    [junit4] Completed [268/451] on J1 in 7.28s, 1 test
   [smoker]    [junit4] 
   [smoker]    [junit4] Suite: org.apache.lucene.index.TestTransactions
   [smoker]    [junit4] Completed [269/451] on J0 in 1.15s, 1 test
   [smoker]    [junit4] 
   [smoker]    [junit4] Suite: org.apache.lucene.index.TestMultiDocValues
   [smoker]    [junit4] Completed [270/451] on J0 in 0.95s, 8 tests
   [smoker]    [junit4] 
   [smoker]    [junit4] Suite: org.apache.lucene.util.TestPagedBytes
   [smoker]    [junit4] Completed [271/451] on J2 in 2.90s, 4 tests, 1 skipped
   [smoker]    [junit4] 
   [smoker]    [junit4] Suite: org.apache.lucene.index.TestDocValuesIndexing
   [smoker]    [junit4] Completed [272/451] on J2 in 0.58s, 34 tests
   [smoker]    [junit4] 
   [smoker]    [junit4] Suite: org.apache.lucene.index.TestFieldsReader
   [smoker]    [junit4] Completed [273/451] on J0 in 0.86s, 2 tests
   [smoker]    [junit4] 
   [smoker]    [junit4] Suite: org.apache.lucene.search.TestBooleanMinShouldMatch
   [smoker]    [junit4] Completed [274/451] on J2 in 1.65s, 17 tests
   [smoker]    [junit4] 
   [smoker]    [junit4] Suite: org.apache.lucene.util.TestLegacyNumericUtils
   [smoker]    [junit4] Completed [275/451] on J2 in 3.06s, 12 tests
   [smoker]    [junit4] 
   [smoker]    [junit4] Suite: org.apache.lucene.util.automaton.TestDeterminizeLexicon
   [smoker]    [junit4] Completed [276/451] on J2 in 1.05s, 1 test
   [smoker]    [junit4] 
   [smoker]    [junit4] Suite: org.apache.lucene.store.TestHugeRamFile
   [smoker]    [junit4] Completed [277/451] on J0 in 6.41s, 1 test
   [smoker]    [junit4] 
   [smoker]    [junit4] Suite: org.apache.lucene.index.Test2BDocs
   [smoker]    [junit4] IGNOR/A 0.00s J2 | Test2BDocs.test2BDocs
   [smoker]    [junit4]    > Assumption #1: 'monster' test group is disabled (@Monster(value=Takes ~30min))
   [smoker]    [junit4] Completed [278/451] on J2 in 0.01s, 1 test, 1 skipped
   [smoker]    [junit4] 
   [smoker]    [junit4] Suite: org.apache.lucene.codecs.perfield.TestPerFieldPostingsFormat2
   [smoker]    [junit4] Completed [279/451] on J1 in 9.13s, 6 tests
   [smoker]    [junit4] 
   [smoker]    [junit4] Suite: org.apache.lucene.index.TestIndexWriterOnDiskFull
   [smoker]    [junit4] Completed [280/451] on J0 in 0.72s, 4 tests
   [smoker]    [junit4] 
   [smoker]    [junit4] Suite: org.apache.lucene.search.spans.TestSpans
   [smoker]    [junit4] Completed [281/451] on J2 in 0.67s, 26 tests
   [smoker]    [junit4] 
   [smoker]    [junit4] Suite: org.apache.lucene.search.spans.TestSpanExplanations
   [smoker]    [junit4] Completed [282/451] on J2 in 0.74s, 30 tests
   [smoker]    [junit4] 
   [smoker]    [junit4] Suite: org.apache.lucene.index.TestCustomNorms
   [smoker]    [junit4] Completed [283/451] on J1 in 1.17s, 1 test
   [smoker]    [junit4] 
   [smoker]    [junit4] Suite: org.apache.lucene.codecs.compressing.TestFastCompressionMode
   [smoker]    [junit4] Completed [284/451] on J2 in 0.83s, 11 tests
   [smoker]    [junit4] 
   [smoker]    [junit4] Suite: org.apache.lucene.index.TestTermVectorsWriter
   [smoker]    [junit4] Completed [285/451] on J2 in 0.58s, 15 tests
   [smoker]    [junit4] 
   [smoker]    [junit4] Suite: org.apache.lucene.index.TestPostingsOffsets
   [smoker]    [junit4] Completed [286/451] on J0 in 2.78s, 13 tests
   [smoker]    [junit4] 
   [smoker]    [junit4] Suite: org.apache.lucene.util.automaton.TestDeterminism
   [smoker]    [junit4] Completed [287/451] on J1 in 1.95s, 2 tests
   [smoker]    [junit4] 
   [smoker]    [junit4] Suite: org.apache.lucene.index.TestCodecs
   [smoker]    [junit4] Completed [288/451] on J2 in 0.78s, 3 tests
   [smoker]    [junit4] 
   [smoker]    [junit4] Suite: org.apache.lucene.index.TestOmitPositions
   [smoker]    [junit4] Completed [289/451] on J1 in 0.51s, 4 tests
   [smoker]    [junit4] 
   [smoker]    [junit4] Suite: org.apache.lucene.analysis.tokenattributes.TestCharTermAttributeImpl
   [smoker]    [junit4] Completed [290/451] on J0 in 1.33s, 12 tests
   [smoker]    [junit4] 
   [smoker]    [junit4] Suite: org.apache.lucene.index.TestStressNRT
   [smoker]    [junit4] Completed [291/451] on J2 in 0.71s, 1 test
   [smoker]    [junit4] 
   [smoker]    [junit4] Suite: org.apache.lucene.index.TestForceMergeForever
   [smoker]    [junit4] Completed [292/451] on J2 in 0.97s, 1 test
   [smoker]    [junit4] 
   [smoker]    [junit4] Suite: org.apache.lucene.index.TestIndexInput
   [smoker]    [junit4] Completed [293/451] on J1 in 1.83s, 2 tests
   [smoker]    [junit4] 
   [smoker]    [junit4] Suite: org.apache.lucene.search.TestDisjunctionMaxQuery
   [smoker]    [junit4] Completed [294/451] on J0 in 1.43s, 12 tests
   [smoker]    [junit4] 
   [smoker]    [junit4] Suite: org.apache.lucene.search.TestTermRangeQuery
   [smoker]    [junit4] Completed [295/451] on J1 in 0.15s, 7 tests
   [smoker]    [junit4] 
   [smoker]    [junit4] Suite: org.apache.lucene.index.TestDocumentWriter
   [smoker]    [junit4] Completed [296/451] on J0 in 0.42s, 6 tests
   [smoker]    [junit4] 
   [smoker]    [junit4] Suite: org.apache.lucene.index.TestMultiFields
   [smoker]    [junit4] Completed [297/451] on J2 in 1.08s, 3 tests
   [smoker]    [junit4] 
   [smoker]    [junit4] Suite: org.apache.lucene.index.TestCrashCausesCorruptIndex
   [smoker]    [junit4] Completed [298/451] on J1 in 0.50s, 1 test
   [smoker]    [junit4] 
   [smoker]    [junit4] Suite: org.apache.lucene.index.TestForTooMuchCloning
   [smoker]    [junit4] Completed [299/451] on J2 in 0.25s, 1 test
   [smoker]    [junit4] 
   [smoker]    [junit4] Suite: org.apache.lucene.index.TestPayloads
   [smoker]    [junit4] Completed [300/451] on J1 in 0.33s, 7 tests
   [smoker]    [junit4] 
   [smoker]    [junit4] Suite: org.apache.lucene.index.TestDoc
   [smoker]    [junit4] Completed [301/451] on J2 in 0.42s, 1 test
   [smoker]    [junit4] 
   [smoker]    [junit4] Suite: org.apache.lucene.search.TestWildcard
   [smoker]    [junit4] Completed [302/451] on J1 in 0.39s, 8 tests
   [smoker]    [junit4] 
   [smoker]    [junit4] Suite: org.apache.lucene.search.spans.TestFieldMaskingSpanQuery
   [smoker]    [junit4] IGNOR/A 0.00s J2 | TestFieldMaskingSpanQuery.testSpans2
   [smoker]    [junit4]    > Assumption #1: Broken scoring: LUCENE-3723
   [smoker]    [junit4] IGNOR/A 0.01s J2 | TestFieldMaskingSpanQuery.testSimple2
   [smoker]    [junit4]    > Assumption #1: Broken scoring: LUCENE-3723
   [smoker]    [junit4] Completed [303/451] on J2 in 0.57s, 11 tests, 2 skipped
   [smoker]    [junit4] 
   [smoker]    [junit4] Suite: org.apache.lucene.search.TestRegexpQuery
   [smoker]    [junit4] Completed [304/451] on J1 in 0.33s, 7 tests
   [smoker]    [junit4] 
   [smoker]    [junit4] Suite: org.apache.lucene.search.TestMultiValuedNumericRangeQuery
   [smoker]    [junit4] Completed [305/451] on J2 in 1.02s, 1 test
   [smoker]    [junit4] 
   [smoker]    [junit4] Suite: org.apache.lucene.search.TestTopDocsCollector
   [smoker]    [junit4] Completed [306/451] on J2 in 0.26s, 8 tests
   [smoker]    [junit4] 
   [smoker]    [junit4] Suite: org.apache.lucene.index.TestUniqueTermCount
   [smoker]    [junit4] Completed [307/451] on J2 in 0.15s, 1 test
   [smoker]    [junit4] 
   [smoker]    [junit4] Suite: org.apache.lucene.search.TestPrefixInBooleanQuery
   [smoker]    [junit4] Completed [308/451] on J1 in 2.21s, 4 tests
   [smoker]    [junit4] 
   [smoker]    [junit4] Suite: org.apache.lucene.search.TestLiveFieldValues
   [smoker]    [junit4] Completed [309/451] on J0 in 5.01s, 1 test
   [smoker]    [junit4] 
   [smoker]    [junit4] Suite: org.apache.lucene.index.TestParallelReaderEmptyIndex
   [smoker]    [junit4] Completed [310/451] on J0 in 0.12s, 2 tests
   [smoker]    [junit4] 
   [smoker]    [junit4] Suite: org.apache.lucene.util.TestUnicodeUtil
   [smoker]    [junit4] Completed [311/451] on J2 in 1.27s, 5 tests
   [smoker]    [junit4] 
   [smoker]    [junit4] Suite: org.apache.lucene.document.TestDocument
   [smoker]    [junit4] Completed [312/451] on J0 in 0.24s, 12 tests
   [smoker]    [junit4] 
   [smoker]    [junit4] Suite: org.apache.lucene.index.TestAllFilesHaveCodecHeader
   [smoker]    [junit4] Completed [313/451] on J1 in 1.30s, 1 test
   [smoker]    [junit4] 
   [smoker]    [junit4] Suite: org.apache.lucene.search.TestTopFieldCollector
   [smoker]    [junit4] Completed [314/451] on J2 in 0.33s, 7 tests
   [smoker]    [junit4] 
   [smoker]    [junit4] Suite: org.apache.lucene.search.TestPrefixRandom
   [smoker]    [junit4] Completed [315/451] on J1 in 1.00s, 1 test
   [smoker]    [junit4] 
   [smoker]    [junit4] Suite: org.apache.lucene.search.spans.TestSpanMultiTermQueryWrapper
   [smoker]    [junit4] Completed [316/451] on J1 in 0.36s, 9 tests
   [smoker]    [junit4] 
   [smoker]    [junit4] Suite: org.apache.lucene.index.TestCheckIndex
   [smoker]    [junit4] Completed [317/451] on J2 in 1.90s, 5 tests
   [smoker]    [junit4] 
   [smoker]    [junit4] Suite: org.apache.lucene.index.TestSizeBoundedForceMerge
   [smoker]    [junit4] Completed [318/451] on J1 in 0.29s, 11 tests
   [smoker]    [junit4] 
   [smoker]    [junit4] Su

[...truncated too long message...]

unit4]   2>         at com.carrotsearch.randomizedtesting.ThreadLeakControl.forkTimeoutingTask(ThreadLeakControl.java:817)
   [smoker]    [junit4]   2>         at com.carrotsearch.randomizedtesting.ThreadLeakControl$3.evaluate(ThreadLeakControl.java:468)
   [smoker]    [junit4]   2>         at com.carrotsearch.randomizedtesting.RandomizedRunner.runSingleTest(RandomizedRunner.java:916)
   [smoker]    [junit4]   2>         at com.carrotsearch.randomizedtesting.RandomizedRunner$5.evaluate(RandomizedRunner.java:802)
   [smoker]    [junit4]   2>         at com.carrotsearch.randomizedtesting.RandomizedRunner$6.evaluate(RandomizedRunner.java:852)
   [smoker]    [junit4]   2>         at com.carrotsearch.randomizedtesting.RandomizedRunner$7.evaluate(RandomizedRunner.java:863)
   [smoker]    [junit4]   2>         at org.apache.lucene.util.AbstractBeforeAfterRule$1.evaluate(AbstractBeforeAfterRule.java:45)
   [smoker]    [junit4]   2>         at com.carrotsearch.randomizedtesting.rules.StatementAdapter.evaluate(StatementAdapter.java:36)
   [smoker]    [junit4]   2>         at org.apache.lucene.util.TestRuleStoreClassName$1.evaluate(TestRuleStoreClassName.java:41)
   [smoker]    [junit4]   2>         at com.carrotsearch.randomizedtesting.rules.NoShadowingOrOverridesOnMethodsRule$1.evaluate(NoShadowingOrOverridesOnMethodsRule.java:40)
   [smoker]    [junit4]   2>         at com.carrotsearch.randomizedtesting.rules.NoShadowingOrOverridesOnMethodsRule$1.evaluate(NoShadowingOrOverridesOnMethodsRule.java:40)
   [smoker]    [junit4]   2>         at com.carrotsearch.randomizedtesting.rules.StatementAdapter.evaluate(StatementAdapter.java:36)
   [smoker]    [junit4]   2>         at com.carrotsearch.randomizedtesting.rules.StatementAdapter.evaluate(StatementAdapter.java:36)
   [smoker]    [junit4]   2>         at com.carrotsearch.randomizedtesting.rules.StatementAdapter.evaluate(StatementAdapter.java:36)
   [smoker]    [junit4]   2>         at org.apache.lucene.util.TestRuleAssertionsRequired$1.evaluate(TestRuleAssertionsRequired.java:53)
   [smoker]    [junit4]   2>         at org.apache.lucene.util.TestRuleMarkFailure$1.evaluate(TestRuleMarkFailure.java:47)
   [smoker]    [junit4]   2>         at org.apache.lucene.util.TestRuleIgnoreAfterMaxFailures$1.evaluate(TestRuleIgnoreAfterMaxFailures.java:64)
   [smoker]    [junit4]   2>         at org.apache.lucene.util.TestRuleIgnoreTestSuites$1.evaluate(TestRuleIgnoreTestSuites.java:54)
   [smoker]    [junit4]   2>         at com.carrotsearch.randomizedtesting.rules.StatementAdapter.evaluate(StatementAdapter.java:36)
   [smoker]    [junit4]   2>         at com.carrotsearch.randomizedtesting.ThreadLeakControl$StatementRunner.run(ThreadLeakControl.java:368)
   [smoker]    [junit4]   2>         at java.lang.Thread.run(Thread.java:745)
   [smoker]    [junit4]   2> NOTE: test params are: codec=Asserting(Lucene62): {dummy=BlockTreeOrds(blocksize=128)}, docValues:{}, maxPointsInLeafNode=1873, maxMBSortInHeap=7.861254829170503, sim=RandomSimilarity(queryNorm=false,coord=yes): {}, locale=en-IE, timezone=Pacific/Nauru
   [smoker]    [junit4]   2> NOTE: Linux 3.13.0-85-generic amd64/Oracle Corporation 1.8.0_102 (64-bit)/cpus=4,threads=2,free=288134496,total=353370112
   [smoker]    [junit4]   2> NOTE: All tests run in this JVM: [TestRemoveDuplicatesTokenFilterFactory, TestCharTokenizers, TestSerbianNormalizationFilter, TestPatternReplaceCharFilter, TestArabicStemFilter, TestIndonesianAnalyzer, TestGermanStemFilter, TestCondition2, TestHunspellStemFilterFactory, TestKeepCase, TestSoraniNormalizationFilter, TestPorterStemFilterFactory, TestTypeTokenFilter, TestStrangeOvergeneration, TestSoraniStemFilterFactory, TestRandomChains, HTMLStripCharFilterTest, TestLimitTokenCountFilterFactory, TestNorwegianMinimalStemFilter, ShingleAnalyzerWrapperTest, NumericPayloadTokenFilterTest, EdgeNGramTokenizerTest, TestStopAnalyzer, TestHindiAnalyzer, DateRecognizerFilterTest, TestCJKBigramFilter, TestEnglishMinimalStemFilter, ShingleFilterTest, TestCharArrayIterator, TestFrenchMinimalStemFilter, TestBrazilianStemFilterFactory, TestCzechStemFilterFactory, TestStemmerOverrideFilter, TestSpanishLightStemFilter, TestUAX29URLEmailTokenizer, TestDictionary, TestLimitTokenOffsetFilterFactory, TestStopFilterFactory, TestFlagLong, TestKStemFilterFactory, TestRussianAnalyzer, TestCJKWidthFilterFactory, TestHindiStemmer, TestSynonymFilterFactory, TestWordDelimiterGraphFilter, TestPatternReplaceFilter, TestReversePathHierarchyTokenizer, TestThaiAnalyzer, TestAllAnalyzersHaveFactories, CommonGramsFilterTest, TestTrimFilter]
   [smoker]    [junit4]   2> NOTE: reproduce with: ant test  -Dtestcase=TestTrimFilter -Dtests.seed=60AD495E4D2133CA -Dtests.multiplier=2 -Dtests.locale=en-IE -Dtests.timezone=Pacific/Nauru -Dtests.asserts=true -Dtests.file.encoding=UTF-8
   [smoker]    [junit4] ERROR   0.00s J2 | TestTrimFilter (suite) <<<
   [smoker]    [junit4]    > Throwable #1: java.lang.Exception: Suite timeout exceeded (>= 7200000 msec).
   [smoker]    [junit4]    > 	at __randomizedtesting.SeedInfo.seed([60AD495E4D2133CA]:0)
   [smoker]    [junit4] Completed [276/276 (1!)] on J2 in 7223.14s, 2 tests, 2 errors <<< FAILURES!
   [smoker]    [junit4] 
   [smoker]    [junit4] 
   [smoker]    [junit4] Tests with failures [seed: 60AD495E4D2133CA]:
   [smoker]    [junit4]   - org.apache.lucene.analysis.miscellaneous.TestTrimFilter.testRandomStrings
   [smoker]    [junit4]   - org.apache.lucene.analysis.miscellaneous.TestTrimFilter (suite)
   [smoker]    [junit4] 
   [smoker]    [junit4] 
   [smoker]    [junit4] JVM J0:     0.90 ..   202.78 =   201.88s
   [smoker]    [junit4] JVM J1:     0.93 ..   205.29 =   204.36s
   [smoker]    [junit4] JVM J2:     0.91 ..  7360.96 =  7360.05s
   [smoker]    [junit4] Execution time total: 2 hours 2 minutes 41 seconds
   [smoker]    [junit4] Tests summary: 276 suites (2 ignored), 1471 tests, 1 suite-level error, 1 error, 4 ignored (3 assumptions)
   [smoker] 
   [smoker] BUILD FAILED
   [smoker] /x1/jenkins/jenkins-slave/workspace/Lucene-Solr-SmokeRelease-6.x/lucene/build/smokeTestRelease/tmp/unpack/lucene-6.5.0/build.xml:482: The following error occurred while executing this line:
   [smoker] /x1/jenkins/jenkins-slave/workspace/Lucene-Solr-SmokeRelease-6.x/lucene/build/smokeTestRelease/tmp/unpack/lucene-6.5.0/common-build.xml:2176: The following error occurred while executing this line:
   [smoker] /x1/jenkins/jenkins-slave/workspace/Lucene-Solr-SmokeRelease-6.x/lucene/build/smokeTestRelease/tmp/unpack/lucene-6.5.0/analysis/build.xml:106: The following error occurred while executing this line:
   [smoker] /x1/jenkins/jenkins-slave/workspace/Lucene-Solr-SmokeRelease-6.x/lucene/build/smokeTestRelease/tmp/unpack/lucene-6.5.0/analysis/build.xml:38: The following error occurred while executing this line:
   [smoker] /x1/jenkins/jenkins-slave/workspace/Lucene-Solr-SmokeRelease-6.x/lucene/build/smokeTestRelease/tmp/unpack/lucene-6.5.0/module-build.xml:58: The following error occurred while executing this line:
   [smoker] /x1/jenkins/jenkins-slave/workspace/Lucene-Solr-SmokeRelease-6.x/lucene/build/smokeTestRelease/tmp/unpack/lucene-6.5.0/common-build.xml:1452: The following error occurred while executing this line:
   [smoker] /x1/jenkins/jenkins-slave/workspace/Lucene-Solr-SmokeRelease-6.x/lucene/build/smokeTestRelease/tmp/unpack/lucene-6.5.0/common-build.xml:985: There were test failures: 276 suites (2 ignored), 1471 tests, 1 suite-level error, 1 error, 4 ignored (3 assumptions) [seed: 60AD495E4D2133CA]
   [smoker] 
   [smoker] Total time: 133 minutes 26 seconds
   [smoker] 
   [smoker] 
   [smoker] Traceback (most recent call last):
   [smoker]   File "/x1/jenkins/jenkins-slave/workspace/Lucene-Solr-SmokeRelease-6.x/dev-tools/scripts/smokeTestRelease.py", line 1472, in <module>
   [smoker]     main()
   [smoker]   File "/x1/jenkins/jenkins-slave/workspace/Lucene-Solr-SmokeRelease-6.x/dev-tools/scripts/smokeTestRelease.py", line 1416, in main
   [smoker]     smokeTest(c.java, c.url, c.revision, c.version, c.tmp_dir, c.is_signed, ' '.join(c.test_args))
   [smoker]   File "/x1/jenkins/jenkins-slave/workspace/Lucene-Solr-SmokeRelease-6.x/dev-tools/scripts/smokeTestRelease.py", line 1454, in smokeTest
   [smoker]     unpackAndVerify(java, 'lucene', tmpDir, 'lucene-%s-src.tgz' % version, gitRevision, version, testArgs, baseURL)
   [smoker]   File "/x1/jenkins/jenkins-slave/workspace/Lucene-Solr-SmokeRelease-6.x/dev-tools/scripts/smokeTestRelease.py", line 622, in unpackAndVerify
   [smoker]     verifyUnpacked(java, project, artifact, unpackPath, gitRevision, version, testArgs, tmpDir, baseURL)
   [smoker]   File "/x1/jenkins/jenkins-slave/workspace/Lucene-Solr-SmokeRelease-6.x/dev-tools/scripts/smokeTestRelease.py", line 715, in verifyUnpacked
   [smoker]     java.run_java8('ant clean test %s' % testArgs, '%s/test.log' % unpackPath)
   [smoker]   File "/x1/jenkins/jenkins-slave/workspace/Lucene-Solr-SmokeRelease-6.x/dev-tools/scripts/smokeTestRelease.py", line 1223, in run_java
   [smoker]     run('%s; %s' % (cmd_prefix, cmd), logfile)
   [smoker]   File "/x1/jenkins/jenkins-slave/workspace/Lucene-Solr-SmokeRelease-6.x/dev-tools/scripts/smokeTestRelease.py", line 547, in run
   [smoker]     raise RuntimeError('command "%s" failed; see log file %s' % (command, logPath))
   [smoker] RuntimeError: command "export JAVA_HOME="/home/jenkins/tools/java/latest1.8" PATH="/home/jenkins/tools/java/latest1.8/bin:$PATH" JAVACMD="/home/jenkins/tools/java/latest1.8/bin/java"; ant clean test -Dtests.slow=false" failed; see log file /x1/jenkins/jenkins-slave/workspace/Lucene-Solr-SmokeRelease-6.x/lucene/build/smokeTestRelease/tmp/unpack/lucene-6.5.0/test.log

BUILD FAILED
/x1/jenkins/jenkins-slave/workspace/Lucene-Solr-SmokeRelease-6.x/build.xml:571: exec returned: 1

Total time: 146 minutes 16 seconds
Build step 'Invoke Ant' marked build as failure
Email was triggered for: Failure - Any
Sending email for trigger: Failure - Any




Mime
View raw message