lucene-dev mailing list archives

Site index · List index
Message view « Date » · « Thread »
Top « Date » · « Thread »
From Policeman Jenkins Server <jenk...@thetaphi.de>
Subject [JENKINS-EA] Lucene-Solr-master-Linux (64bit/jdk-9-ea+155) - Build # 18977 - Still Unstable!
Date Thu, 16 Feb 2017 14:48:38 GMT
Build: https://jenkins.thetaphi.de/job/Lucene-Solr-master-Linux/18977/
Java: 64bit/jdk-9-ea+155 -XX:+UseCompressedOops -XX:+UseParallelGC

1 tests failed.
FAILED:  org.apache.solr.handler.admin.TestApiFramework.testFramework

Error Message:


Stack Trace:
java.lang.ExceptionInInitializerError
	at __randomizedtesting.SeedInfo.seed([2239D2D703761B05:354F18F005A2F738]:0)
	at net.sf.cglib.core.KeyFactory$Generator.generateClass(KeyFactory.java:166)
	at net.sf.cglib.core.DefaultGeneratorStrategy.generate(DefaultGeneratorStrategy.java:25)
	at net.sf.cglib.core.AbstractClassGenerator.create(AbstractClassGenerator.java:216)
	at net.sf.cglib.core.KeyFactory$Generator.create(KeyFactory.java:144)
	at net.sf.cglib.core.KeyFactory.create(KeyFactory.java:116)
	at net.sf.cglib.core.KeyFactory.create(KeyFactory.java:108)
	at net.sf.cglib.core.KeyFactory.create(KeyFactory.java:104)
	at net.sf.cglib.proxy.Enhancer.<clinit>(Enhancer.java:69)
	at org.easymock.internal.ClassProxyFactory.createEnhancer(ClassProxyFactory.java:259)
	at org.easymock.internal.ClassProxyFactory.createProxy(ClassProxyFactory.java:174)
	at org.easymock.internal.MocksControl.createMock(MocksControl.java:60)
	at org.easymock.EasyMock.createMock(EasyMock.java:104)
	at org.apache.solr.handler.admin.TestCoreAdminApis.getCoreContainerMock(TestCoreAdminApis.java:83)
	at org.apache.solr.handler.admin.TestApiFramework.testFramework(TestApiFramework.java:59)
	at java.base/jdk.internal.reflect.NativeMethodAccessorImpl.invoke0(Native Method)
	at java.base/jdk.internal.reflect.NativeMethodAccessorImpl.invoke(NativeMethodAccessorImpl.java:62)
	at java.base/jdk.internal.reflect.DelegatingMethodAccessorImpl.invoke(DelegatingMethodAccessorImpl.java:43)
	at java.base/java.lang.reflect.Method.invoke(Method.java:543)
	at com.carrotsearch.randomizedtesting.RandomizedRunner.invoke(RandomizedRunner.java:1713)
	at com.carrotsearch.randomizedtesting.RandomizedRunner$8.evaluate(RandomizedRunner.java:907)
	at com.carrotsearch.randomizedtesting.RandomizedRunner$9.evaluate(RandomizedRunner.java:943)
	at com.carrotsearch.randomizedtesting.RandomizedRunner$10.evaluate(RandomizedRunner.java:957)
	at com.carrotsearch.randomizedtesting.rules.SystemPropertiesRestoreRule$1.evaluate(SystemPropertiesRestoreRule.java:57)
	at org.apache.lucene.util.TestRuleSetupTeardownChained$1.evaluate(TestRuleSetupTeardownChained.java:49)
	at org.apache.lucene.util.AbstractBeforeAfterRule$1.evaluate(AbstractBeforeAfterRule.java:45)
	at org.apache.lucene.util.TestRuleThreadAndTestName$1.evaluate(TestRuleThreadAndTestName.java:48)
	at org.apache.lucene.util.TestRuleIgnoreAfterMaxFailures$1.evaluate(TestRuleIgnoreAfterMaxFailures.java:64)
	at org.apache.lucene.util.TestRuleMarkFailure$1.evaluate(TestRuleMarkFailure.java:47)
	at com.carrotsearch.randomizedtesting.rules.StatementAdapter.evaluate(StatementAdapter.java:36)
	at com.carrotsearch.randomizedtesting.ThreadLeakControl$StatementRunner.run(ThreadLeakControl.java:368)
	at com.carrotsearch.randomizedtesting.ThreadLeakControl.forkTimeoutingTask(ThreadLeakControl.java:817)
	at com.carrotsearch.randomizedtesting.ThreadLeakControl$3.evaluate(ThreadLeakControl.java:468)
	at com.carrotsearch.randomizedtesting.RandomizedRunner.runSingleTest(RandomizedRunner.java:916)
	at com.carrotsearch.randomizedtesting.RandomizedRunner$5.evaluate(RandomizedRunner.java:802)
	at com.carrotsearch.randomizedtesting.RandomizedRunner$6.evaluate(RandomizedRunner.java:852)
	at com.carrotsearch.randomizedtesting.RandomizedRunner$7.evaluate(RandomizedRunner.java:863)
	at com.carrotsearch.randomizedtesting.rules.StatementAdapter.evaluate(StatementAdapter.java:36)
	at com.carrotsearch.randomizedtesting.rules.SystemPropertiesRestoreRule$1.evaluate(SystemPropertiesRestoreRule.java:57)
	at org.apache.lucene.util.AbstractBeforeAfterRule$1.evaluate(AbstractBeforeAfterRule.java:45)
	at com.carrotsearch.randomizedtesting.rules.StatementAdapter.evaluate(StatementAdapter.java:36)
	at org.apache.lucene.util.TestRuleStoreClassName$1.evaluate(TestRuleStoreClassName.java:41)
	at com.carrotsearch.randomizedtesting.rules.NoShadowingOrOverridesOnMethodsRule$1.evaluate(NoShadowingOrOverridesOnMethodsRule.java:40)
	at com.carrotsearch.randomizedtesting.rules.NoShadowingOrOverridesOnMethodsRule$1.evaluate(NoShadowingOrOverridesOnMethodsRule.java:40)
	at com.carrotsearch.randomizedtesting.rules.StatementAdapter.evaluate(StatementAdapter.java:36)
	at com.carrotsearch.randomizedtesting.rules.StatementAdapter.evaluate(StatementAdapter.java:36)
	at org.apache.lucene.util.TestRuleAssertionsRequired$1.evaluate(TestRuleAssertionsRequired.java:53)
	at org.apache.lucene.util.TestRuleMarkFailure$1.evaluate(TestRuleMarkFailure.java:47)
	at org.apache.lucene.util.TestRuleIgnoreAfterMaxFailures$1.evaluate(TestRuleIgnoreAfterMaxFailures.java:64)
	at org.apache.lucene.util.TestRuleIgnoreTestSuites$1.evaluate(TestRuleIgnoreTestSuites.java:54)
	at com.carrotsearch.randomizedtesting.rules.StatementAdapter.evaluate(StatementAdapter.java:36)
	at com.carrotsearch.randomizedtesting.ThreadLeakControl$StatementRunner.run(ThreadLeakControl.java:368)
	at java.base/java.lang.Thread.run(Thread.java:844)
Caused by: java.lang.reflect.InaccessibleObjectException: Unable to make protected final java.lang.Class
java.lang.ClassLoader.defineClass(java.lang.String,byte[],int,int,java.security.ProtectionDomain)
throws java.lang.ClassFormatError accessible: module java.base does not "opens java.lang"
to unnamed module @4fcb10c4
	at java.base/java.lang.reflect.AccessibleObject.checkCanSetAccessible(AccessibleObject.java:207)
	at java.base/java.lang.reflect.Method.checkCanSetAccessible(Method.java:192)
	at java.base/java.lang.reflect.Method.setAccessible(Method.java:186)
	at net.sf.cglib.core.ReflectUtils$2.run(ReflectUtils.java:56)
	at java.base/java.security.AccessController.doPrivileged(Native Method)
	at net.sf.cglib.core.ReflectUtils.<clinit>(ReflectUtils.java:46)
	... 52 more




Build Log:
[...truncated 12600 lines...]
   [junit4] Suite: org.apache.solr.handler.admin.TestApiFramework
   [junit4]   2> Creating dataDir: /home/jenkins/workspace/Lucene-Solr-master-Linux/solr/build/solr-core/test/J1/temp/solr.handler.admin.TestApiFramework_2239D2D703761B05-001/init-core-data-001
   [junit4]   2> 2033187 INFO  (SUITE-TestApiFramework-seed#[2239D2D703761B05]-worker)
[    ] o.a.s.SolrTestCaseJ4 Using TrieFields
   [junit4]   2> 2033188 INFO  (SUITE-TestApiFramework-seed#[2239D2D703761B05]-worker)
[    ] o.a.s.SolrTestCaseJ4 Randomized ssl (true) and clientAuth (true) via: @org.apache.solr.util.RandomizeSSL(reason="",
ssl=0.0/0.0, value=0.0/0.0, clientAuth=0.0/0.0)
   [junit4]   2> 2033190 INFO  (TEST-TestApiFramework.testFramework-seed#[2239D2D703761B05])
[    ] o.a.s.SolrTestCaseJ4 ###Starting testFramework
   [junit4]   2> 2033235 INFO  (TEST-TestApiFramework.testFramework-seed#[2239D2D703761B05])
[    ] o.a.s.SolrTestCaseJ4 ###Ending testFramework
   [junit4]   2> NOTE: reproduce with: ant test  -Dtestcase=TestApiFramework -Dtests.method=testFramework
-Dtests.seed=2239D2D703761B05 -Dtests.multiplier=3 -Dtests.slow=true -Dtests.locale=en-FJ
-Dtests.timezone=America/Miquelon -Dtests.asserts=true -Dtests.file.encoding=US-ASCII
   [junit4] ERROR   0.05s J1 | TestApiFramework.testFramework <<<
   [junit4]    > Throwable #1: java.lang.ExceptionInInitializerError
   [junit4]    > 	at __randomizedtesting.SeedInfo.seed([2239D2D703761B05:354F18F005A2F738]:0)
   [junit4]    > 	at net.sf.cglib.core.KeyFactory$Generator.generateClass(KeyFactory.java:166)
   [junit4]    > 	at net.sf.cglib.core.DefaultGeneratorStrategy.generate(DefaultGeneratorStrategy.java:25)
   [junit4]    > 	at net.sf.cglib.core.AbstractClassGenerator.create(AbstractClassGenerator.java:216)
   [junit4]    > 	at net.sf.cglib.core.KeyFactory$Generator.create(KeyFactory.java:144)
   [junit4]    > 	at net.sf.cglib.core.KeyFactory.create(KeyFactory.java:116)
   [junit4]    > 	at net.sf.cglib.core.KeyFactory.create(KeyFactory.java:108)
   [junit4]    > 	at net.sf.cglib.core.KeyFactory.create(KeyFactory.java:104)
   [junit4]    > 	at net.sf.cglib.proxy.Enhancer.<clinit>(Enhancer.java:69)
   [junit4]    > 	at org.easymock.internal.ClassProxyFactory.createEnhancer(ClassProxyFactory.java:259)
   [junit4]    > 	at org.easymock.internal.ClassProxyFactory.createProxy(ClassProxyFactory.java:174)
   [junit4]    > 	at org.easymock.internal.MocksControl.createMock(MocksControl.java:60)
   [junit4]    > 	at org.easymock.EasyMock.createMock(EasyMock.java:104)
   [junit4]    > 	at org.apache.solr.handler.admin.TestCoreAdminApis.getCoreContainerMock(TestCoreAdminApis.java:83)
   [junit4]    > 	at org.apache.solr.handler.admin.TestApiFramework.testFramework(TestApiFramework.java:59)
   [junit4]    > 	at java.base/jdk.internal.reflect.NativeMethodAccessorImpl.invoke0(Native
Method)
   [junit4]    > 	at java.base/jdk.internal.reflect.NativeMethodAccessorImpl.invoke(NativeMethodAccessorImpl.java:62)
   [junit4]    > 	at java.base/jdk.internal.reflect.DelegatingMethodAccessorImpl.invoke(DelegatingMethodAccessorImpl.java:43)
   [junit4]    > 	at java.base/java.lang.reflect.Method.invoke(Method.java:543)
   [junit4]    > 	at java.base/java.lang.Thread.run(Thread.java:844)
   [junit4]    > Caused by: java.lang.reflect.InaccessibleObjectException: Unable to make
protected final java.lang.Class java.lang.ClassLoader.defineClass(java.lang.String,byte[],int,int,java.security.ProtectionDomain)
throws java.lang.ClassFormatError accessible: module java.base does not "opens java.lang"
to unnamed module @4fcb10c4
   [junit4]    > 	at java.base/java.lang.reflect.AccessibleObject.checkCanSetAccessible(AccessibleObject.java:207)
   [junit4]    > 	at java.base/java.lang.reflect.Method.checkCanSetAccessible(Method.java:192)
   [junit4]    > 	at java.base/java.lang.reflect.Method.setAccessible(Method.java:186)
   [junit4]    > 	at net.sf.cglib.core.ReflectUtils$2.run(ReflectUtils.java:56)
   [junit4]    > 	at java.base/java.security.AccessController.doPrivileged(Native Method)
   [junit4]    > 	at net.sf.cglib.core.ReflectUtils.<clinit>(ReflectUtils.java:46)
   [junit4]    > 	... 52 more
   [junit4]   2> 2033237 INFO  (TEST-TestApiFramework.testTrailingTemplatePaths-seed#[2239D2D703761B05])
[    ] o.a.s.SolrTestCaseJ4 ###Starting testTrailingTemplatePaths
   [junit4]   2> 2033237 INFO  (TEST-TestApiFramework.testTrailingTemplatePaths-seed#[2239D2D703761B05])
[    ] o.a.s.SolrTestCaseJ4 ###Ending testTrailingTemplatePaths
   [junit4]   2> 2033237 INFO  (SUITE-TestApiFramework-seed#[2239D2D703761B05]-worker)
[    ] o.a.s.SolrTestCaseJ4 ###deleteCore
   [junit4]   2> NOTE: leaving temporary files on disk at: /home/jenkins/workspace/Lucene-Solr-master-Linux/solr/build/solr-core/test/J1/temp/solr.handler.admin.TestApiFramework_2239D2D703761B05-001
   [junit4]   2> NOTE: test params are: codec=Asserting(Lucene70): {}, docValues:{}, maxPointsInLeafNode=1132,
maxMBSortInHeap=7.868580414995593, sim=RandomSimilarity(queryNorm=true): {}, locale=en-FJ,
timezone=America/Miquelon
   [junit4]   2> NOTE: Linux 4.4.0-53-generic amd64/Oracle Corporation 9-ea (64-bit)/cpus=12,threads=1,free=166346256,total=534249472
   [junit4]   2> NOTE: All tests run in this JVM: [JSONWriterTest, TestOnReconnectListenerSupport,
TestQueryUtils, ConcurrentDeleteAndCreateCollectionTest, TestBackupRepositoryFactory, StressHdfsTest,
DeleteLastCustomShardedReplicaTest, TestInfoStreamLogging, TestCloudDeleteByQuery, OutOfBoxZkACLAndCredentialsProvidersTest,
TestPostingsSolrHighlighter, AsyncCallRequestStatusResponseTest, TestCollapseQParserPlugin,
MoreLikeThisHandlerTest, TestRecoveryHdfs, TestSurroundQueryParser, SoftAutoCommitTest, DOMUtilTest,
LeaderFailureAfterFreshStartTest, TestCursorMarkWithoutUniqueKey, SolrGangliaReporterTest,
VMParamsZkACLAndCredentialsProvidersTest, CdcrUpdateLogTest, TestLegacyFieldCache, FileUtilsTest,
TestRawResponseWriter, OpenExchangeRatesOrgProviderTest, TestCopyFieldCollectionResource,
TestStressVersions, TestSearchPerf, QueryParsingTest, TolerantUpdateProcessorTest, TimeZoneUtilsTest,
TestHdfsCloudBackupRestore, SharedFSAutoReplicaFailoverUtilsTest, TestCustomDocTransformer,
HdfsRestartWhileUpdatingTest, TestXIncludeConfig, TestSolrCoreParser, ConvertedLegacyTest,
TestSolrDynamicMBean, MigrateRouteKeyTest, TestCustomSort, SolrSlf4jReporterTest, TestElisionMultitermQuery,
TestExactStatsCache, SpatialFilterTest, ShardRoutingCustomTest, TestDistribDocBasedVersion,
CursorMarkTest, SOLR749Test, ZkControllerTest, SolrIndexMetricsTest, UpdateRequestProcessorFactoryTest,
TestCollectionAPI, CachingDirectoryFactoryTest, TestPKIAuthenticationPlugin, HLLUtilTest,
TestPartialUpdateDeduplication, ManagedSchemaRoundRobinCloudTest, TestSchemaResource, RulesTest,
ClusterStateUpdateTest, DocValuesTest, ZkCLITest, AtomicUpdatesTest, SuggesterFSTTest, DistribDocExpirationUpdateProcessorTest,
ExitableDirectoryReaderTest, TestUninvertingReader, TestHashPartitioner, TestEmbeddedSolrServerConstructors,
SolrCloudExampleTest, JavabinLoaderTest, HttpSolrCallGetCoreTest, TestGraphTermsQParserPlugin,
TestSQLHandlerNonCloud, DocumentBuilderTest, TestSolrIndexConfig, DirectSolrConnectionTest,
TestDocumentBuilder, BasicFunctionalityTest, JsonValidatorTest, TestFieldCacheReopen, TestWordDelimiterFilterFactory,
TestSystemCollAutoCreate, TestFreeTextSuggestions, TestSubQueryTransformerDistrib, CloudExitableDirectoryReaderTest,
CollectionsAPIDistributedZkTest, TestLeaderInitiatedRecoveryThread, DistributedExpandComponentTest,
SolrIndexSplitterTest, TestFastLRUCache, TestAnalyzeInfixSuggestions, TestMinMaxOnMultiValuedField,
TestManagedSchemaAPI, TestFiltering, DistributedVersionInfoTest, TestCustomStream, TestConfigSetProperties,
HttpPartitionTest, TestFieldTypeCollectionResource, RemoteQueryErrorTest, TestConfigReload,
SpellCheckComponentTest, SortSpecParsingTest, TestShortCircuitedRequests, TermVectorComponentTest,
RestartWhileUpdatingTest, ChaosMonkeyNothingIsSafeTest, TestStressInPlaceUpdates, LeaderElectionTest,
TestZkChroot, TestDistributedGrouping, TestCoreContainer, SimpleFacetsTest, SolrCoreTest,
SolrCmdDistributorTest, TestSort, TestIndexSearcher, ShowFileRequestHandlerTest, CurrencyFieldXmlFileTest,
TestCoreDiscovery, SolrRequestParserTest, SuggesterTSTTest, TestStressLucene, TestTrie, PolyFieldTest,
SchemaVersionSpecificBehaviorTest, SortByFunctionTest, SolrInfoMBeanTest, DirectSolrSpellCheckerTest,
PrimitiveFieldTypeTest, TermsComponentTest, FastVectorHighlighterTest, LoggingHandlerTest,
TestCollationField, TestAnalyzedSuggestions, CSVRequestHandlerTest, TestQuerySenderNoQuery,
TestStressRecovery, PluginInfoTest, TestSystemIdResolver, SpellingQueryConverterTest, DistributedIntervalFacetingTest,
ActionThrottleTest, AliasIntegrationTest, CollectionTooManyReplicasTest, DeleteNodeTest, DistribCursorPagingTest,
OverseerTaskQueueTest, SaslZkACLProviderTest, ShardSplitTest, CoreAdminCreateDiscoverTest,
CoreAdminRequestStatusTest, InfoHandlerTest, MetricsHandlerTest, SecurityConfHandlerTest,
SegmentsInfoRequestHandlerTest, StatsReloadRaceTest, TestApiFramework]
   [junit4] Completed [555/694 (1!)] on J1 in 0.06s, 2 tests, 1 error <<< FAILURES!

[...truncated 52091 lines...]


Mime
View raw message