lucene-dev mailing list archives

Site index · List index
Message view « Date » · « Thread »
Top « Date » · « Thread »
From Policeman Jenkins Server <jenk...@thetaphi.de>
Subject [JENKINS] Lucene-Solr-6.4-Linux (64bit/jdk1.8.0_121) - Build # 96 - Still Unstable!
Date Fri, 03 Feb 2017 01:59:20 GMT
Build: https://jenkins.thetaphi.de/job/Lucene-Solr-6.4-Linux/96/
Java: 64bit/jdk1.8.0_121 -XX:+UseCompressedOops -XX:+UseConcMarkSweepGC

1 tests failed.
FAILED:  org.apache.solr.handler.admin.MBeansHandlerTest.testDiff

Error Message:
expected:<Was: [1, Now: 2], Delta: 1> but was:<Was: [4, Now: 5], Delta: 1>

Stack Trace:
org.junit.ComparisonFailure: expected:<Was: [1, Now: 2], Delta: 1> but was:<Was:
[4, Now: 5], Delta: 1>
	at __randomizedtesting.SeedInfo.seed([30987E0CFBE8B6CA:F58EBA97EB5E8EAA]:0)
	at org.junit.Assert.assertEquals(Assert.java:125)
	at org.junit.Assert.assertEquals(Assert.java:147)
	at org.apache.solr.handler.admin.MBeansHandlerTest.testDiff(MBeansHandlerTest.java:63)
	at sun.reflect.NativeMethodAccessorImpl.invoke0(Native Method)
	at sun.reflect.NativeMethodAccessorImpl.invoke(NativeMethodAccessorImpl.java:62)
	at sun.reflect.DelegatingMethodAccessorImpl.invoke(DelegatingMethodAccessorImpl.java:43)
	at java.lang.reflect.Method.invoke(Method.java:498)
	at com.carrotsearch.randomizedtesting.RandomizedRunner.invoke(RandomizedRunner.java:1713)
	at com.carrotsearch.randomizedtesting.RandomizedRunner$8.evaluate(RandomizedRunner.java:907)
	at com.carrotsearch.randomizedtesting.RandomizedRunner$9.evaluate(RandomizedRunner.java:943)
	at com.carrotsearch.randomizedtesting.RandomizedRunner$10.evaluate(RandomizedRunner.java:957)
	at com.carrotsearch.randomizedtesting.rules.SystemPropertiesRestoreRule$1.evaluate(SystemPropertiesRestoreRule.java:57)
	at org.apache.lucene.util.TestRuleSetupTeardownChained$1.evaluate(TestRuleSetupTeardownChained.java:49)
	at org.apache.lucene.util.AbstractBeforeAfterRule$1.evaluate(AbstractBeforeAfterRule.java:45)
	at org.apache.lucene.util.TestRuleThreadAndTestName$1.evaluate(TestRuleThreadAndTestName.java:48)
	at org.apache.lucene.util.TestRuleIgnoreAfterMaxFailures$1.evaluate(TestRuleIgnoreAfterMaxFailures.java:64)
	at org.apache.lucene.util.TestRuleMarkFailure$1.evaluate(TestRuleMarkFailure.java:47)
	at com.carrotsearch.randomizedtesting.rules.StatementAdapter.evaluate(StatementAdapter.java:36)
	at com.carrotsearch.randomizedtesting.ThreadLeakControl$StatementRunner.run(ThreadLeakControl.java:367)
	at com.carrotsearch.randomizedtesting.ThreadLeakControl.forkTimeoutingTask(ThreadLeakControl.java:811)
	at com.carrotsearch.randomizedtesting.ThreadLeakControl$3.evaluate(ThreadLeakControl.java:462)
	at com.carrotsearch.randomizedtesting.RandomizedRunner.runSingleTest(RandomizedRunner.java:916)
	at com.carrotsearch.randomizedtesting.RandomizedRunner$5.evaluate(RandomizedRunner.java:802)
	at com.carrotsearch.randomizedtesting.RandomizedRunner$6.evaluate(RandomizedRunner.java:852)
	at com.carrotsearch.randomizedtesting.RandomizedRunner$7.evaluate(RandomizedRunner.java:863)
	at com.carrotsearch.randomizedtesting.rules.StatementAdapter.evaluate(StatementAdapter.java:36)
	at com.carrotsearch.randomizedtesting.rules.SystemPropertiesRestoreRule$1.evaluate(SystemPropertiesRestoreRule.java:57)
	at org.apache.lucene.util.AbstractBeforeAfterRule$1.evaluate(AbstractBeforeAfterRule.java:45)
	at com.carrotsearch.randomizedtesting.rules.StatementAdapter.evaluate(StatementAdapter.java:36)
	at org.apache.lucene.util.TestRuleStoreClassName$1.evaluate(TestRuleStoreClassName.java:41)
	at com.carrotsearch.randomizedtesting.rules.NoShadowingOrOverridesOnMethodsRule$1.evaluate(NoShadowingOrOverridesOnMethodsRule.java:40)
	at com.carrotsearch.randomizedtesting.rules.NoShadowingOrOverridesOnMethodsRule$1.evaluate(NoShadowingOrOverridesOnMethodsRule.java:40)
	at com.carrotsearch.randomizedtesting.rules.StatementAdapter.evaluate(StatementAdapter.java:36)
	at com.carrotsearch.randomizedtesting.rules.StatementAdapter.evaluate(StatementAdapter.java:36)
	at com.carrotsearch.randomizedtesting.rules.StatementAdapter.evaluate(StatementAdapter.java:36)
	at org.apache.lucene.util.TestRuleAssertionsRequired$1.evaluate(TestRuleAssertionsRequired.java:53)
	at org.apache.lucene.util.TestRuleMarkFailure$1.evaluate(TestRuleMarkFailure.java:47)
	at org.apache.lucene.util.TestRuleIgnoreAfterMaxFailures$1.evaluate(TestRuleIgnoreAfterMaxFailures.java:64)
	at org.apache.lucene.util.TestRuleIgnoreTestSuites$1.evaluate(TestRuleIgnoreTestSuites.java:54)
	at com.carrotsearch.randomizedtesting.rules.StatementAdapter.evaluate(StatementAdapter.java:36)
	at com.carrotsearch.randomizedtesting.ThreadLeakControl$StatementRunner.run(ThreadLeakControl.java:367)
	at java.lang.Thread.run(Thread.java:745)




Build Log:
[...truncated 12016 lines...]
   [junit4] Suite: org.apache.solr.handler.admin.MBeansHandlerTest
   [junit4]   2> Creating dataDir: /home/jenkins/workspace/Lucene-Solr-6.4-Linux/solr/build/solr-core/test/J2/temp/solr.handler.admin.MBeansHandlerTest_30987E0CFBE8B6CA-001/init-core-data-001
   [junit4]   2> 1064377 INFO  (SUITE-MBeansHandlerTest-seed#[30987E0CFBE8B6CA]-worker)
[    ] o.a.s.SolrTestCaseJ4 Randomized ssl (true) and clientAuth (true) via: @org.apache.solr.util.RandomizeSSL(reason=,
ssl=NaN, value=NaN, clientAuth=NaN)
   [junit4]   2> 1064377 INFO  (SUITE-MBeansHandlerTest-seed#[30987E0CFBE8B6CA]-worker)
[    ] o.a.s.SolrTestCaseJ4 ####initCore
   [junit4]   2> 1064378 INFO  (SUITE-MBeansHandlerTest-seed#[30987E0CFBE8B6CA]-worker)
[    ] o.a.s.c.SolrResourceLoader [null] Added 2 libs to classloader, from paths: [/home/jenkins/workspace/Lucene-Solr-6.4-Linux/solr/core/src/test-files/solr/collection1/lib,
/home/jenkins/workspace/Lucene-Solr-6.4-Linux/solr/core/src/test-files/solr/collection1/lib/classes]
   [junit4]   2> 1064406 INFO  (SUITE-MBeansHandlerTest-seed#[30987E0CFBE8B6CA]-worker)
[    ] o.a.s.c.SolrConfig Using Lucene MatchVersion: 6.4.1
   [junit4]   2> 1064425 INFO  (SUITE-MBeansHandlerTest-seed#[30987E0CFBE8B6CA]-worker)
[    ] o.a.s.s.IndexSchema [null] Schema name=test
   [junit4]   2> 1064493 WARN  (SUITE-MBeansHandlerTest-seed#[30987E0CFBE8B6CA]-worker)
[    ] o.a.s.s.IndexSchema [null] default search field in schema is text. WARNING: Deprecated,
please use 'df' on request instead.
   [junit4]   2> 1064495 INFO  (SUITE-MBeansHandlerTest-seed#[30987E0CFBE8B6CA]-worker)
[    ] o.a.s.s.IndexSchema Loaded schema test/1.0 with uniqueid field id
   [junit4]   2> 1064500 INFO  (SUITE-MBeansHandlerTest-seed#[30987E0CFBE8B6CA]-worker)
[    ] o.a.s.u.UpdateShardHandler Creating UpdateShardHandler HTTP client with params: socketTimeout=30000&connTimeout=30000&retry=true
   [junit4]   2> 1064501 WARN  (SUITE-MBeansHandlerTest-seed#[30987E0CFBE8B6CA]-worker)
[    ] o.a.s.m.r.SolrJmxReporter No serviceUrl or agentId was configured, using first MBeanServer.
   [junit4]   2> 1064503 INFO  (SUITE-MBeansHandlerTest-seed#[30987E0CFBE8B6CA]-worker)
[    ] o.a.s.m.r.SolrJmxReporter JMX monitoring enabled at server: com.sun.jmx.mbeanserver.JmxMBeanServer@19732352
   [junit4]   2> 1064503 WARN  (SUITE-MBeansHandlerTest-seed#[30987E0CFBE8B6CA]-worker)
[    ] o.a.s.m.r.SolrJmxReporter No serviceUrl or agentId was configured, using first MBeanServer.
   [junit4]   2> 1064506 INFO  (SUITE-MBeansHandlerTest-seed#[30987E0CFBE8B6CA]-worker)
[    ] o.a.s.m.r.SolrJmxReporter JMX monitoring enabled at server: com.sun.jmx.mbeanserver.JmxMBeanServer@19732352
   [junit4]   2> 1064506 WARN  (SUITE-MBeansHandlerTest-seed#[30987E0CFBE8B6CA]-worker)
[    ] o.a.s.m.r.SolrJmxReporter No serviceUrl or agentId was configured, using first MBeanServer.
   [junit4]   2> 1064506 INFO  (SUITE-MBeansHandlerTest-seed#[30987E0CFBE8B6CA]-worker)
[    ] o.a.s.m.r.SolrJmxReporter JMX monitoring enabled at server: com.sun.jmx.mbeanserver.JmxMBeanServer@19732352
   [junit4]   2> 1064507 INFO  (coreLoadExecutor-6222-thread-1) [    x:collection1] o.a.s.c.SolrResourceLoader
[null] Added 2 libs to classloader, from paths: [/home/jenkins/workspace/Lucene-Solr-6.4-Linux/solr/core/src/test-files/solr/collection1/lib,
/home/jenkins/workspace/Lucene-Solr-6.4-Linux/solr/core/src/test-files/solr/collection1/lib/classes]
   [junit4]   2> 1064526 INFO  (coreLoadExecutor-6222-thread-1) [    x:collection1] o.a.s.c.SolrConfig
Using Lucene MatchVersion: 6.4.1
   [junit4]   2> 1064552 INFO  (coreLoadExecutor-6222-thread-1) [    x:collection1] o.a.s.s.IndexSchema
[collection1] Schema name=test
   [junit4]   2> 1064639 WARN  (coreLoadExecutor-6222-thread-1) [    x:collection1] o.a.s.s.IndexSchema
[collection1] default search field in schema is text. WARNING: Deprecated, please use 'df'
on request instead.
   [junit4]   2> 1064641 INFO  (coreLoadExecutor-6222-thread-1) [    x:collection1] o.a.s.s.IndexSchema
Loaded schema test/1.0 with uniqueid field id
   [junit4]   2> 1064646 INFO  (coreLoadExecutor-6222-thread-1) [    x:collection1] o.a.s.c.CoreContainer
Creating SolrCore 'collection1' using configuration from instancedir /home/jenkins/workspace/Lucene-Solr-6.4-Linux/solr/core/src/test-files/solr/collection1
   [junit4]   2> 1064646 WARN  (coreLoadExecutor-6222-thread-1) [    x:collection1] o.a.s.m.r.SolrJmxReporter
No serviceUrl or agentId was configured, using first MBeanServer.
   [junit4]   2> 1064646 INFO  (coreLoadExecutor-6222-thread-1) [    x:collection1] o.a.s.m.r.SolrJmxReporter
JMX monitoring enabled at server: com.sun.jmx.mbeanserver.JmxMBeanServer@19732352
   [junit4]   2> 1064647 INFO  (coreLoadExecutor-6222-thread-1) [    x:collection1] o.a.s.c.SolrCore
[[collection1] ] Opening new SolrCore at [/home/jenkins/workspace/Lucene-Solr-6.4-Linux/solr/core/src/test-files/solr/collection1],
dataDir=[/home/jenkins/workspace/Lucene-Solr-6.4-Linux/solr/build/solr-core/test/J2/temp/solr.handler.admin.MBeansHandlerTest_30987E0CFBE8B6CA-001/init-core-data-001/]
   [junit4]   2> 1064647 INFO  (coreLoadExecutor-6222-thread-1) [    x:collection1] o.a.s.c.JmxMonitoredMap
JMX monitoring is enabled. Adding Solr mbeans to JMX Server: com.sun.jmx.mbeanserver.JmxMBeanServer@19732352
   [junit4]   2> 1064648 INFO  (coreLoadExecutor-6222-thread-1) [    x:collection1] o.a.s.u.RandomMergePolicy
RandomMergePolicy wrapping class org.apache.lucene.index.TieredMergePolicy: [TieredMergePolicy:
maxMergeAtOnce=33, maxMergeAtOnceExplicit=27, maxMergedSegmentMB=48.6845703125, floorSegmentMB=1.359375,
forceMergeDeletesPctAllowed=21.826826815098418, segmentsPerTier=22.0, maxCFSSegmentSizeMB=8.796093022207999E12,
noCFSRatio=0.13611502116633753
   [junit4]   2> 1064669 INFO  (coreLoadExecutor-6222-thread-1) [    x:collection1] o.a.s.u.UpdateHandler
Using UpdateLog implementation: org.apache.solr.update.UpdateLog
   [junit4]   2> 1064669 INFO  (coreLoadExecutor-6222-thread-1) [    x:collection1] o.a.s.u.UpdateLog
Initializing UpdateLog: dataDir= defaultSyncLevel=FLUSH numRecordsToKeep=100 maxNumLogsToKeep=10
numVersionBuckets=65536
   [junit4]   2> 1064670 INFO  (coreLoadExecutor-6222-thread-1) [    x:collection1] o.a.s.u.CommitTracker
Hard AutoCommit: disabled
   [junit4]   2> 1064670 INFO  (coreLoadExecutor-6222-thread-1) [    x:collection1] o.a.s.u.CommitTracker
Soft AutoCommit: disabled
   [junit4]   2> 1064670 INFO  (coreLoadExecutor-6222-thread-1) [    x:collection1] o.a.s.u.RandomMergePolicy
RandomMergePolicy wrapping class org.apache.lucene.index.AlcoholicMergePolicy: [AlcoholicMergePolicy:
minMergeSize=0, mergeFactor=10, maxMergeSize=818996026, maxMergeSizeForForcedMerge=9223372036854775807,
calibrateSizeByDeletes=true, maxMergeDocs=2147483647, maxCFSSegmentSizeMB=8.796093022207999E12,
noCFSRatio=0.1]
   [junit4]   2> 1064671 INFO  (coreLoadExecutor-6222-thread-1) [    x:collection1] o.a.s.s.SolrIndexSearcher
Opening [Searcher@4516d042[collection1] main]
   [junit4]   2> 1064672 INFO  (coreLoadExecutor-6222-thread-1) [    x:collection1] o.a.s.h.c.SpellCheckComponent
Initializing spell checkers
   [junit4]   2> 1064697 INFO  (coreLoadExecutor-6222-thread-1) [    x:collection1] o.a.s.s.DirectSolrSpellChecker
init: {name=direct,classname=DirectSolrSpellChecker,field=lowerfilt,minQueryLength=3}
   [junit4]   2> 1064766 INFO  (coreLoadExecutor-6222-thread-1) [    x:collection1] o.a.s.h.ReplicationHandler
Commits will be reserved for  10000
   [junit4]   2> 1064766 INFO  (searcherExecutor-6223-thread-1-processing-x:collection1)
[    x:collection1] o.a.s.h.c.SpellCheckComponent Loading spell index for spellchecker: default
   [junit4]   2> 1064767 INFO  (searcherExecutor-6223-thread-1-processing-x:collection1)
[    x:collection1] o.a.s.h.c.SpellCheckComponent Loading spell index for spellchecker: direct
   [junit4]   2> 1064767 INFO  (searcherExecutor-6223-thread-1-processing-x:collection1)
[    x:collection1] o.a.s.h.c.SpellCheckComponent Loading spell index for spellchecker: wordbreak
   [junit4]   2> 1064767 INFO  (searcherExecutor-6223-thread-1-processing-x:collection1)
[    x:collection1] o.a.s.h.c.SpellCheckComponent Loading spell index for spellchecker: multipleFields
   [junit4]   2> 1064767 INFO  (searcherExecutor-6223-thread-1-processing-x:collection1)
[    x:collection1] o.a.s.h.c.SpellCheckComponent Loading spell index for spellchecker: jarowinkler
   [junit4]   2> 1064767 INFO  (searcherExecutor-6223-thread-1-processing-x:collection1)
[    x:collection1] o.a.s.h.c.SpellCheckComponent Loading spell index for spellchecker: external
   [junit4]   2> 1064767 INFO  (searcherExecutor-6223-thread-1-processing-x:collection1)
[    x:collection1] o.a.s.h.c.SpellCheckComponent Loading spell index for spellchecker: freq
   [junit4]   2> 1064767 INFO  (searcherExecutor-6223-thread-1-processing-x:collection1)
[    x:collection1] o.a.s.h.c.SpellCheckComponent Loading spell index for spellchecker: fqcn
   [junit4]   2> 1064767 INFO  (coreLoadExecutor-6222-thread-1) [    x:collection1] o.a.s.u.UpdateLog
Could not find max version in index or recent updates, using new clock 1558273658481278976
   [junit4]   2> 1064767 INFO  (searcherExecutor-6223-thread-1-processing-x:collection1)
[    x:collection1] o.a.s.h.c.SpellCheckComponent Loading spell index for spellchecker: perDict
   [junit4]   2> 1064768 INFO  (searcherExecutor-6223-thread-1-processing-x:collection1)
[    x:collection1] o.a.s.c.SolrCore [collection1] Registered new searcher Searcher@4516d042[collection1]
main{ExitableDirectoryReader(UninvertingDirectoryReader())}
   [junit4]   2> 1064770 INFO  (SUITE-MBeansHandlerTest-seed#[30987E0CFBE8B6CA]-worker)
[    ] o.a.s.SolrTestCaseJ4 ####initCore end
   [junit4]   2> 1064771 INFO  (TEST-MBeansHandlerTest.testXMLDiffWithExternalEntity-seed#[30987E0CFBE8B6CA])
[    ] o.a.s.SolrTestCaseJ4 ###Starting testXMLDiffWithExternalEntity
   [junit4]   2> 1064782 INFO  (TEST-MBeansHandlerTest.testXMLDiffWithExternalEntity-seed#[30987E0CFBE8B6CA])
[    ] o.a.s.SolrTestCaseJ4 ###Ending testXMLDiffWithExternalEntity
   [junit4]   2> 1064783 INFO  (TEST-MBeansHandlerTest.testBackCompatNames-seed#[30987E0CFBE8B6CA])
[    ] o.a.s.SolrTestCaseJ4 ###Starting testBackCompatNames
   [junit4]   2> 1064784 INFO  (TEST-MBeansHandlerTest.testBackCompatNames-seed#[30987E0CFBE8B6CA])
[    ] o.a.s.c.S.Request [collection1]  webapp=null path=null params={qt=/admin/mbeans&wt=xml}
status=0 QTime=0
   [junit4]   2> 1064789 INFO  (TEST-MBeansHandlerTest.testBackCompatNames-seed#[30987E0CFBE8B6CA])
[    ] o.a.s.c.S.Request [collection1]  webapp=null path=null params={qt=/admin/mbeans&cat=QUERYHANDLER&wt=xml}
status=0 QTime=0
   [junit4]   2> 1064790 INFO  (TEST-MBeansHandlerTest.testBackCompatNames-seed#[30987E0CFBE8B6CA])
[    ] o.a.s.c.S.Request [collection1]  webapp=null path=null params={qt=/admin/mbeans&cat=UPDATE&wt=xml}
status=0 QTime=0
   [junit4]   2> 1064790 INFO  (TEST-MBeansHandlerTest.testBackCompatNames-seed#[30987E0CFBE8B6CA])
[    ] o.a.s.SolrTestCaseJ4 ###Ending testBackCompatNames
   [junit4]   2> 1064792 INFO  (TEST-MBeansHandlerTest.testDiff-seed#[30987E0CFBE8B6CA])
[    ] o.a.s.SolrTestCaseJ4 ###Starting testDiff
   [junit4]   2> 1064793 INFO  (TEST-MBeansHandlerTest.testDiff-seed#[30987E0CFBE8B6CA])
[    ] o.a.s.c.S.Request [collection1]  webapp=null path=null params={qt=/admin/mbeans&stats=true&wt=xml}
status=0 QTime=1
   [junit4]   2> 1064808 INFO  (TEST-MBeansHandlerTest.testDiff-seed#[30987E0CFBE8B6CA])
[    ] o.a.s.c.S.Request [collection1]  webapp=null path=null params={qt=/admin/mbeans&stats=true&diff=true&wt=xml}
status=0 QTime=13
   [junit4]   2> 1064811 INFO  (TEST-MBeansHandlerTest.testDiff-seed#[30987E0CFBE8B6CA])
[    ] o.a.s.SolrTestCaseJ4 ###Ending testDiff
   [junit4]   2> NOTE: reproduce with: ant test  -Dtestcase=MBeansHandlerTest -Dtests.method=testDiff
-Dtests.seed=30987E0CFBE8B6CA -Dtests.multiplier=3 -Dtests.slow=true -Dtests.locale=ar-TN
-Dtests.timezone=AET -Dtests.asserts=true -Dtests.file.encoding=UTF-8
   [junit4] FAILURE 0.02s J2 | MBeansHandlerTest.testDiff <<<
   [junit4]    > Throwable #1: org.junit.ComparisonFailure: expected:<Was: [1, Now:
2], Delta: 1> but was:<Was: [4, Now: 5], Delta: 1>
   [junit4]    > 	at __randomizedtesting.SeedInfo.seed([30987E0CFBE8B6CA:F58EBA97EB5E8EAA]:0)
   [junit4]    > 	at org.apache.solr.handler.admin.MBeansHandlerTest.testDiff(MBeansHandlerTest.java:63)
   [junit4]    > 	at java.lang.Thread.run(Thread.java:745)
   [junit4]   2> 1064815 INFO  (SUITE-MBeansHandlerTest-seed#[30987E0CFBE8B6CA]-worker)
[    ] o.a.s.SolrTestCaseJ4 ###deleteCore
   [junit4]   2> 1064815 INFO  (SUITE-MBeansHandlerTest-seed#[30987E0CFBE8B6CA]-worker)
[    ] o.a.s.c.CoreContainer Shutting down CoreContainer instance=722158172
   [junit4]   2> 1064815 INFO  (coreCloseExecutor-6228-thread-1) [    x:collection1] o.a.s.c.SolrCore
[collection1]  CLOSING SolrCore org.apache.solr.core.SolrCore@1b0ece09
   [junit4]   2> 1064837 INFO  (coreCloseExecutor-6228-thread-1) [    x:collection1] o.a.s.m.SolrMetricManager
Closing metric reporters for: solr.core.collection1
   [junit4]   2> 1064839 INFO  (SUITE-MBeansHandlerTest-seed#[30987E0CFBE8B6CA]-worker)
[    ] o.a.s.m.SolrMetricManager Closing metric reporters for: solr.node
   [junit4]   2> NOTE: leaving temporary files on disk at: /home/jenkins/workspace/Lucene-Solr-6.4-Linux/solr/build/solr-core/test/J2/temp/solr.handler.admin.MBeansHandlerTest_30987E0CFBE8B6CA-001
   [junit4]   2> NOTE: test params are: codec=Lucene62, sim=RandomSimilarity(queryNorm=false,coord=no):
{}, locale=ar-TN, timezone=AET
   [junit4]   2> NOTE: Linux 4.4.0-53-generic amd64/Oracle Corporation 1.8.0_121 (64-bit)/cpus=12,threads=1,free=171605624,total=518979584
   [junit4]   2> NOTE: All tests run in this JVM: [ChangedSchemaMergeTest, TestStressReorder,
TestTrackingShardHandlerFactory, ResponseHeaderTest, DistributedQueueTest, TestReversedWildcardFilterFactory,
SpatialHeatmapFacetsTest, SolrCoreMetricManagerTest, TestGeoJSONResponseWriter, TestHdfsCloudBackupRestore,
TestIndexingPerformance, SolrCloudExampleTest, TestCloudPseudoReturnFields, TestJmxMonitoredMap,
TestSmileRequest, GraphQueryTest, StatelessScriptUpdateProcessorFactoryTest, TestSort, TestExtendedDismaxParser,
CdcrBootstrapTest, SpellPossibilityIteratorTest, TestNumericTerms32, ConnectionManagerTest,
TestManagedSynonymFilterFactory, TestXIncludeConfig, CloneFieldUpdateProcessorFactoryTest,
BadComponentTest, BinaryUpdateRequestHandlerTest, SaslZkACLProviderTest, MetricUtilsTest,
TestSchemaVersionResource, OverseerTaskQueueTest, TestHdfsBackupRestoreCore, NoCacheHeaderTest,
TestLMJelinekMercerSimilarityFactory, DOMUtilTest, TestRecovery, TestDocBasedVersionConstraints,
LukeRequestHandlerTest, TestCoreDiscovery, TestJsonRequest, TestMaxScoreQueryParser, TestPushWriter,
OverseerTest, DistributedQueryComponentCustomSortTest, RequestLoggingTest, BufferStoreTest,
TestPerFieldSimilarityClassic, BasicDistributedZk2Test, CoreAdminRequestStatusTest, SharedFSAutoReplicaFailoverUtilsTest,
TestClassicSimilarityFactory, TestLFUCache, CheckHdfsIndexTest, BlobRepositoryCloudTest, ShowFileRequestHandlerTest,
TestOrdValues, TestDynamicLoading, SolrCoreCheckLockOnStartupTest, XmlUpdateRequestHandlerTest,
DirectUpdateHandlerTest, TestClusterStateMutator, TestSolrXml, HdfsDirectoryFactoryTest, BlockJoinFacetDistribTest,
EnumFieldTest, PluginInfoTest, TestSolrQueryParserResource, OutOfBoxZkACLAndCredentialsProvidersTest,
FullSolrCloudDistribCmdsTest, TestSolrFieldCacheMBean, SpatialRPTFieldTypeTest, PingRequestHandlerTest,
TlogReplayBufferedWhileIndexingTest, TimeZoneUtilsTest, TestDynamicFieldCollectionResource,
TestReload, TestSolrCloudWithKerberosAlt, DataDrivenBlockJoinTest, AddBlockUpdateTest, BadIndexSchemaTest,
TestSolrJ, RestartWhileUpdatingTest, HdfsUnloadDistributedZkTest, LeaderFailoverAfterPartitionTest,
TestCollectionAPI, TestConfigOverlay, UUIDUpdateProcessorFallbackTest, CircularListTest, BitVectorTest,
PreAnalyzedFieldTest, CleanupOldIndexTest, ClassificationUpdateProcessorFactoryTest, TestDistribDocBasedVersion,
UnloadDistributedZkTest, TestStressLiveNodes, DocValuesMultiTest, TestSolrConfigHandlerCloud,
TestJsonFacetRefinement, TestCollapseQParserPlugin, TestFieldCacheSanityChecker, CdcrRequestHandlerTest,
TestInitParams, TestMergePolicyConfig, TestCustomSort, MetricsHandlerTest, PKIAuthenticationIntegrationTest,
ForceLeaderTest, TestZkChroot, AutoCommitTest, TestFaceting, DistributedSpellCheckComponentTest,
HardAutoCommitTest, TestRangeQuery, SimpleFacetsTest, TestGroupingSearch, ConvertedLegacyTest,
TestLazyCores, TestIndexSearcher, SoftAutoCommitTest, CurrencyFieldOpenExchangeTest, DistributedQueryElevationComponentTest,
SuggesterFSTTest, DocValuesTest, DistanceFunctionTest, SolrInfoMBeanTest, CacheHeaderTest,
DisMaxRequestHandlerTest, TestQueryUtils, DirectSolrSpellCheckerTest, TestQueryTypes, PathHierarchyTokenizerFactoryTest,
FieldAnalysisRequestHandlerTest, IndexSchemaRuntimeFieldTest, IndexSchemaTest, JSONWriterTest,
MBeansHandlerTest]
   [junit4] Completed [383/680 (1!)] on J2 in 0.51s, 3 tests, 1 failure <<< FAILURES!

[...truncated 63375 lines...]


Mime
View raw message