lucene-dev mailing list archives

Site index · List index
Message view « Date » · « Thread »
Top « Date » · « Thread »
From Policeman Jenkins Server <jenk...@thetaphi.de>
Subject [JENKINS-EA] Lucene-Solr-master-Linux (32bit/jdk-9-ea+155) - Build # 18971 - Still Unstable!
Date Wed, 15 Feb 2017 20:58:27 GMT
Build: https://jenkins.thetaphi.de/job/Lucene-Solr-master-Linux/18971/
Java: 32bit/jdk-9-ea+155 -server -XX:+UseG1GC

1 tests failed.
FAILED:  org.apache.solr.handler.admin.TestApiFramework.testFramework

Error Message:


Stack Trace:
java.lang.ExceptionInInitializerError
	at __randomizedtesting.SeedInfo.seed([491E127B263004D9:5E68D85C20E4E8E4]:0)
	at net.sf.cglib.core.KeyFactory$Generator.generateClass(KeyFactory.java:166)
	at net.sf.cglib.core.DefaultGeneratorStrategy.generate(DefaultGeneratorStrategy.java:25)
	at net.sf.cglib.core.AbstractClassGenerator.create(AbstractClassGenerator.java:216)
	at net.sf.cglib.core.KeyFactory$Generator.create(KeyFactory.java:144)
	at net.sf.cglib.core.KeyFactory.create(KeyFactory.java:116)
	at net.sf.cglib.core.KeyFactory.create(KeyFactory.java:108)
	at net.sf.cglib.core.KeyFactory.create(KeyFactory.java:104)
	at net.sf.cglib.proxy.Enhancer.<clinit>(Enhancer.java:69)
	at org.easymock.internal.ClassProxyFactory.createEnhancer(ClassProxyFactory.java:259)
	at org.easymock.internal.ClassProxyFactory.createProxy(ClassProxyFactory.java:174)
	at org.easymock.internal.MocksControl.createMock(MocksControl.java:60)
	at org.easymock.EasyMock.createMock(EasyMock.java:104)
	at org.apache.solr.handler.admin.TestCoreAdminApis.getCoreContainerMock(TestCoreAdminApis.java:83)
	at org.apache.solr.handler.admin.TestApiFramework.testFramework(TestApiFramework.java:59)
	at java.base/jdk.internal.reflect.NativeMethodAccessorImpl.invoke0(Native Method)
	at java.base/jdk.internal.reflect.NativeMethodAccessorImpl.invoke(NativeMethodAccessorImpl.java:62)
	at java.base/jdk.internal.reflect.DelegatingMethodAccessorImpl.invoke(DelegatingMethodAccessorImpl.java:43)
	at java.base/java.lang.reflect.Method.invoke(Method.java:543)
	at com.carrotsearch.randomizedtesting.RandomizedRunner.invoke(RandomizedRunner.java:1713)
	at com.carrotsearch.randomizedtesting.RandomizedRunner$8.evaluate(RandomizedRunner.java:907)
	at com.carrotsearch.randomizedtesting.RandomizedRunner$9.evaluate(RandomizedRunner.java:943)
	at com.carrotsearch.randomizedtesting.RandomizedRunner$10.evaluate(RandomizedRunner.java:957)
	at com.carrotsearch.randomizedtesting.rules.SystemPropertiesRestoreRule$1.evaluate(SystemPropertiesRestoreRule.java:57)
	at org.apache.lucene.util.TestRuleSetupTeardownChained$1.evaluate(TestRuleSetupTeardownChained.java:49)
	at org.apache.lucene.util.AbstractBeforeAfterRule$1.evaluate(AbstractBeforeAfterRule.java:45)
	at org.apache.lucene.util.TestRuleThreadAndTestName$1.evaluate(TestRuleThreadAndTestName.java:48)
	at org.apache.lucene.util.TestRuleIgnoreAfterMaxFailures$1.evaluate(TestRuleIgnoreAfterMaxFailures.java:64)
	at org.apache.lucene.util.TestRuleMarkFailure$1.evaluate(TestRuleMarkFailure.java:47)
	at com.carrotsearch.randomizedtesting.rules.StatementAdapter.evaluate(StatementAdapter.java:36)
	at com.carrotsearch.randomizedtesting.ThreadLeakControl$StatementRunner.run(ThreadLeakControl.java:368)
	at com.carrotsearch.randomizedtesting.ThreadLeakControl.forkTimeoutingTask(ThreadLeakControl.java:817)
	at com.carrotsearch.randomizedtesting.ThreadLeakControl$3.evaluate(ThreadLeakControl.java:468)
	at com.carrotsearch.randomizedtesting.RandomizedRunner.runSingleTest(RandomizedRunner.java:916)
	at com.carrotsearch.randomizedtesting.RandomizedRunner$5.evaluate(RandomizedRunner.java:802)
	at com.carrotsearch.randomizedtesting.RandomizedRunner$6.evaluate(RandomizedRunner.java:852)
	at com.carrotsearch.randomizedtesting.RandomizedRunner$7.evaluate(RandomizedRunner.java:863)
	at com.carrotsearch.randomizedtesting.rules.StatementAdapter.evaluate(StatementAdapter.java:36)
	at com.carrotsearch.randomizedtesting.rules.SystemPropertiesRestoreRule$1.evaluate(SystemPropertiesRestoreRule.java:57)
	at org.apache.lucene.util.AbstractBeforeAfterRule$1.evaluate(AbstractBeforeAfterRule.java:45)
	at com.carrotsearch.randomizedtesting.rules.StatementAdapter.evaluate(StatementAdapter.java:36)
	at org.apache.lucene.util.TestRuleStoreClassName$1.evaluate(TestRuleStoreClassName.java:41)
	at com.carrotsearch.randomizedtesting.rules.NoShadowingOrOverridesOnMethodsRule$1.evaluate(NoShadowingOrOverridesOnMethodsRule.java:40)
	at com.carrotsearch.randomizedtesting.rules.NoShadowingOrOverridesOnMethodsRule$1.evaluate(NoShadowingOrOverridesOnMethodsRule.java:40)
	at com.carrotsearch.randomizedtesting.rules.StatementAdapter.evaluate(StatementAdapter.java:36)
	at com.carrotsearch.randomizedtesting.rules.StatementAdapter.evaluate(StatementAdapter.java:36)
	at org.apache.lucene.util.TestRuleAssertionsRequired$1.evaluate(TestRuleAssertionsRequired.java:53)
	at org.apache.lucene.util.TestRuleMarkFailure$1.evaluate(TestRuleMarkFailure.java:47)
	at org.apache.lucene.util.TestRuleIgnoreAfterMaxFailures$1.evaluate(TestRuleIgnoreAfterMaxFailures.java:64)
	at org.apache.lucene.util.TestRuleIgnoreTestSuites$1.evaluate(TestRuleIgnoreTestSuites.java:54)
	at com.carrotsearch.randomizedtesting.rules.StatementAdapter.evaluate(StatementAdapter.java:36)
	at com.carrotsearch.randomizedtesting.ThreadLeakControl$StatementRunner.run(ThreadLeakControl.java:368)
	at java.base/java.lang.Thread.run(Thread.java:844)
Caused by: java.lang.reflect.InaccessibleObjectException: Unable to make protected final java.lang.Class
java.lang.ClassLoader.defineClass(java.lang.String,byte[],int,int,java.security.ProtectionDomain)
throws java.lang.ClassFormatError accessible: module java.base does not "opens java.lang"
to unnamed module @1cddad2
	at java.base/java.lang.reflect.AccessibleObject.checkCanSetAccessible(AccessibleObject.java:207)
	at java.base/java.lang.reflect.Method.checkCanSetAccessible(Method.java:192)
	at java.base/java.lang.reflect.Method.setAccessible(Method.java:186)
	at net.sf.cglib.core.ReflectUtils$2.run(ReflectUtils.java:56)
	at java.base/java.security.AccessController.doPrivileged(Native Method)
	at net.sf.cglib.core.ReflectUtils.<clinit>(ReflectUtils.java:46)
	... 52 more




Build Log:
[...truncated 12611 lines...]
   [junit4] Suite: org.apache.solr.handler.admin.TestApiFramework
   [junit4]   2> Creating dataDir: /home/jenkins/workspace/Lucene-Solr-master-Linux/solr/build/solr-core/test/J2/temp/solr.handler.admin.TestApiFramework_491E127B263004D9-001/init-core-data-001
   [junit4]   2> 2245077 INFO  (SUITE-TestApiFramework-seed#[491E127B263004D9]-worker)
[    ] o.a.s.SolrTestCaseJ4 Using TrieFields
   [junit4]   2> 2245080 INFO  (SUITE-TestApiFramework-seed#[491E127B263004D9]-worker)
[    ] o.a.s.SolrTestCaseJ4 Randomized ssl (true) and clientAuth (true) via: @org.apache.solr.util.RandomizeSSL(reason="",
ssl=0.0/0.0, value=0.0/0.0, clientAuth=0.0/0.0)
   [junit4]   2> 2245089 INFO  (TEST-TestApiFramework.testTrailingTemplatePaths-seed#[491E127B263004D9])
[    ] o.a.s.SolrTestCaseJ4 ###Starting testTrailingTemplatePaths
   [junit4]   2> 2245089 INFO  (TEST-TestApiFramework.testTrailingTemplatePaths-seed#[491E127B263004D9])
[    ] o.a.s.SolrTestCaseJ4 ###Ending testTrailingTemplatePaths
   [junit4]   2> 2245090 INFO  (TEST-TestApiFramework.testFramework-seed#[491E127B263004D9])
[    ] o.a.s.SolrTestCaseJ4 ###Starting testFramework
   [junit4]   2> 2245160 INFO  (TEST-TestApiFramework.testFramework-seed#[491E127B263004D9])
[    ] o.a.s.SolrTestCaseJ4 ###Ending testFramework
   [junit4]   2> NOTE: reproduce with: ant test  -Dtestcase=TestApiFramework -Dtests.method=testFramework
-Dtests.seed=491E127B263004D9 -Dtests.multiplier=3 -Dtests.slow=true -Dtests.locale=ps-AF
-Dtests.timezone=Asia/Omsk -Dtests.asserts=true -Dtests.file.encoding=UTF-8
   [junit4] ERROR   0.07s J2 | TestApiFramework.testFramework <<<
   [junit4]    > Throwable #1: java.lang.ExceptionInInitializerError
   [junit4]    > 	at __randomizedtesting.SeedInfo.seed([491E127B263004D9:5E68D85C20E4E8E4]:0)
   [junit4]    > 	at net.sf.cglib.core.KeyFactory$Generator.generateClass(KeyFactory.java:166)
   [junit4]    > 	at net.sf.cglib.core.DefaultGeneratorStrategy.generate(DefaultGeneratorStrategy.java:25)
   [junit4]    > 	at net.sf.cglib.core.AbstractClassGenerator.create(AbstractClassGenerator.java:216)
   [junit4]    > 	at net.sf.cglib.core.KeyFactory$Generator.create(KeyFactory.java:144)
   [junit4]    > 	at net.sf.cglib.core.KeyFactory.create(KeyFactory.java:116)
   [junit4]    > 	at net.sf.cglib.core.KeyFactory.create(KeyFactory.java:108)
   [junit4]    > 	at net.sf.cglib.core.KeyFactory.create(KeyFactory.java:104)
   [junit4]    > 	at net.sf.cglib.proxy.Enhancer.<clinit>(Enhancer.java:69)
   [junit4]    > 	at org.easymock.internal.ClassProxyFactory.createEnhancer(ClassProxyFactory.java:259)
   [junit4]    > 	at org.easymock.internal.ClassProxyFactory.createProxy(ClassProxyFactory.java:174)
   [junit4]    > 	at org.easymock.internal.MocksControl.createMock(MocksControl.java:60)
   [junit4]    > 	at org.easymock.EasyMock.createMock(EasyMock.java:104)
   [junit4]    > 	at org.apache.solr.handler.admin.TestCoreAdminApis.getCoreContainerMock(TestCoreAdminApis.java:83)
   [junit4]    > 	at org.apache.solr.handler.admin.TestApiFramework.testFramework(TestApiFramework.java:59)
   [junit4]    > 	at java.base/jdk.internal.reflect.NativeMethodAccessorImpl.invoke0(Native
Method)
   [junit4]    > 	at java.base/jdk.internal.reflect.NativeMethodAccessorImpl.invoke(NativeMethodAccessorImpl.java:62)
   [junit4]    > 	at java.base/jdk.internal.reflect.DelegatingMethodAccessorImpl.invoke(DelegatingMethodAccessorImpl.java:43)
   [junit4]    > 	at java.base/java.lang.reflect.Method.invoke(Method.java:543)
   [junit4]    > 	at java.base/java.lang.Thread.run(Thread.java:844)
   [junit4]    > Caused by: java.lang.reflect.InaccessibleObjectException: Unable to make
protected final java.lang.Class java.lang.ClassLoader.defineClass(java.lang.String,byte[],int,int,java.security.ProtectionDomain)
throws java.lang.ClassFormatError accessible: module java.base does not "opens java.lang"
to unnamed module @1cddad2
   [junit4]    > 	at java.base/java.lang.reflect.AccessibleObject.checkCanSetAccessible(AccessibleObject.java:207)
   [junit4]    > 	at java.base/java.lang.reflect.Method.checkCanSetAccessible(Method.java:192)
   [junit4]    > 	at java.base/java.lang.reflect.Method.setAccessible(Method.java:186)
   [junit4]    > 	at net.sf.cglib.core.ReflectUtils$2.run(ReflectUtils.java:56)
   [junit4]    > 	at java.base/java.security.AccessController.doPrivileged(Native Method)
   [junit4]    > 	at net.sf.cglib.core.ReflectUtils.<clinit>(ReflectUtils.java:46)
   [junit4]    > 	... 52 more
   [junit4]   2> 2245163 INFO  (SUITE-TestApiFramework-seed#[491E127B263004D9]-worker)
[    ] o.a.s.SolrTestCaseJ4 ###deleteCore
   [junit4]   2> NOTE: leaving temporary files on disk at: /home/jenkins/workspace/Lucene-Solr-master-Linux/solr/build/solr-core/test/J2/temp/solr.handler.admin.TestApiFramework_491E127B263004D9-001
   [junit4]   2> NOTE: test params are: codec=Asserting(Lucene70): {}, docValues:{}, maxPointsInLeafNode=95,
maxMBSortInHeap=5.9051235213351445, sim=RandomSimilarity(queryNorm=true): {}, locale=ps-AF,
timezone=Asia/Omsk
   [junit4]   2> NOTE: Linux 4.4.0-53-generic i386/Oracle Corporation 9-ea (32-bit)/cpus=12,threads=1,free=392368304,total=536870912
   [junit4]   2> NOTE: All tests run in this JVM: [ParsingFieldUpdateProcessorsTest, CoreAdminHandlerTest,
TestReload, TestImpersonationWithHadoopAuth, TestPhraseSuggestions, SecurityConfHandlerTest,
TestSolrDeletionPolicy1, TestLRUStatsCache, ConfigSetsAPITest, TestIndexingPerformance, TestComplexPhraseLeadingWildcard,
SolrCoreCheckLockOnStartupTest, PrimitiveFieldTypeTest, DebugComponentTest, TlogReplayBufferedWhileIndexingTest,
AnalyticsMergeStrategyTest, HighlighterConfigTest, PeerSyncReplicationTest, TestSolrQueryParser,
TestFieldCacheVsDocValues, RequestHandlersTest, ShowFileRequestHandlerTest, OverriddenZkACLAndCredentialsProvidersTest,
SimpleCollectionCreateDeleteTest, LukeRequestHandlerTest, TestJsonFacetRefinement, TestSolrQueryParserDefaultOperatorResource,
TestNumericTerms32, BooleanFieldTest, TestSolrXml, TestLeaderElectionWithEmptyReplica, VersionInfoTest,
UUIDUpdateProcessorFallbackTest, TestClassicSimilarityFactory, TestRecovery, TestCSVResponseWriter,
TestPivotHelperCode, TestConfig, SuggesterWFSTTest, TestDynamicLoading, TestDownShardTolerantSearch,
TestDocBasedVersionConstraints, SmileWriterTest, FieldMutatingUpdateProcessorTest, SuggesterTest,
DocValuesMultiTest, SolrIndexConfigTest, TestSort, TestIndexSearcher, TestPerFieldSimilarityWithDefaultOverride,
TestDistribIDF, LeaderElectionTest, TestCollationFieldDocValues, OverseerRolesTest, DistribJoinFromCollectionTest,
TestHdfsBackupRestoreCore, TestRestoreCore, HighlighterMaxOffsetTest, TestSizeLimitedDistributedMap,
SolrGraphiteReporterTest, BadIndexSchemaTest, TestSubQueryTransformer, TestFieldTypeResource,
DocValuesMissingTest, TestConfigSets, PreAnalyzedFieldManagedSchemaCloudTest, TestJettySolrRunner,
TestShardHandlerFactory, CoreSorterTest, TestOrdValues, DocValuesNotIndexedTest, ResourceLoaderTest,
TestCoreAdminApis, RequestLoggingTest, SubstringBytesRefFilterTest, SolrMetricReporterTest,
TestOverriddenPrefixQueryForCustomFieldType, TestAddFieldRealTimeGet, TestManagedSchemaThreadSafety,
PrimUtilsTest, MissingSegmentRecoveryTest, DateFieldTest, TestCryptoKeys, CoreMergeIndexesAdminHandlerTest,
ReplaceNodeTest, XmlUpdateRequestHandlerTest, SuggesterTSTTest, SparseHLLTest, TestSmileRequest,
CurrencyFieldXmlFileTest, TestClusterStateMutator, CustomCollectionTest, MBeansHandlerTest,
ClassificationUpdateProcessorFactoryTest, DistributedFacetPivotSmallAdvancedTest, TestBlendedInfixSuggestions,
TermVectorComponentDistributedTest, AliasIntegrationTest, TestMacroExpander, OutputWriterTest,
GraphQueryTest, NoCacheHeaderTest, BinaryUpdateRequestHandlerTest, TestRandomFlRTGCloud, TestBinaryField,
TestComponentsName, TestSolrFieldCacheMBean, BasicDistributedZk2Test, TestStressLiveNodes,
TestDistributedMissingSort, FullHLLTest, TestQuerySenderNoQuery, TemplateUpdateProcessorTest,
ChaosMonkeySafeLeaderTest, UnloadDistributedZkTest, CollectionsAPIDistributedZkTest, LeaderElectionIntegrationTest,
BasicZkTest, RecoveryZkTest, FullSolrCloudDistribCmdsTest, ZkCLITest, TestFaceting, DistributedSpellCheckComponentTest,
DistributedTermsComponentTest, PeerSyncTest, DirectUpdateHandlerTest, SimplePostToolTest,
TestCoreDiscovery, SignatureUpdateProcessorFactoryTest, TestFoldingMultitermQuery, WordBreakSolrSpellCheckerTest,
DirectUpdateHandlerOptimizeTest, SortByFunctionTest, DisMaxRequestHandlerTest, TestReversedWildcardFilterFactory,
DocumentBuilderTest, FastVectorHighlighterTest, SolrPluginUtilsTest, JsonLoaderTest, UpdateParamsTest,
TestMergePolicyConfig, ExternalFileFieldSortTest, TestPostingsSolrHighlighter, TestLuceneMatchVersion,
TestCodecSupport, URLClassifyProcessorTest, DistributedIntervalFacetingTest, BaseCdcrDistributedZkTest,
CdcrBootstrapTest, DistribCursorPagingTest, LeaderInitiatedRecoveryOnCommitTest, MigrateRouteKeyTest,
OverseerCollectionConfigSetProcessorTest, OverseerModifyCollectionTest, OverseerStatusTest,
RecoveryAfterSoftCommitTest, SharedFSAutoReplicaFailoverUtilsTest, SolrXmlInZkTest, TestCloudInspectUtil,
TestCloudPivotFacet, TestCollectionAPI, TestConfigSetsAPI, TestConfigSetsAPIExclusivity, TestDeleteCollectionOnDownNodes,
TestExclusionRuleCollectionAccess, TestHdfsCloudBackupRestore, TestLeaderElectionZkExpiry,
TestLockTree, TestMiniSolrCloudCluster, TestReplicaProperties, TestShortCircuitedRequests,
TestStressInPlaceUpdates, TriLevelCompositeIdRoutingTest, RuleEngineTest, BlobRepositoryCloudTest,
DirectoryFactoryTest, HdfsDirectoryFactoryTest, TestBackupRepositoryFactory, TestConfigOverlay,
TestConfigSetProperties, TestInitParams, TestSolrConfigHandler, V2ApiIntegrationTest, CoreAdminCreateDiscoverTest,
InfoHandlerTest, StatsReloadRaceTest, TestApiFramework]
   [junit4] Completed [565/694 (1!)] on J2 in 0.11s, 2 tests, 1 error <<< FAILURES!

[...truncated 52074 lines...]


Mime
View raw message