lucene-dev mailing list archives

Site index · List index
Message view « Date » · « Thread »
Top « Date » · « Thread »
From Policeman Jenkins Server <jenk...@thetaphi.de>
Subject [JENKINS] Lucene-Solr-6.x-MacOSX (64bit/jdk1.8.0) - Build # 680 - Still Unstable!
Date Sat, 04 Feb 2017 20:35:52 GMT
Build: https://jenkins.thetaphi.de/job/Lucene-Solr-6.x-MacOSX/680/
Java: 64bit/jdk1.8.0 -XX:+UseCompressedOops -XX:+UseParallelGC

1 tests failed.
FAILED:  org.apache.solr.handler.admin.MBeansHandlerTest.testDiff

Error Message:
expected:<Was: [1, Now: 2], Delta: 1> but was:<Was: [4, Now: 5], Delta: 1>

Stack Trace:
org.junit.ComparisonFailure: expected:<Was: [1, Now: 2], Delta: 1> but was:<Was:
[4, Now: 5], Delta: 1>
	at __randomizedtesting.SeedInfo.seed([B2131EF6F5BB464F:7705DA6DE50D7E2F]:0)
	at org.junit.Assert.assertEquals(Assert.java:125)
	at org.junit.Assert.assertEquals(Assert.java:147)
	at org.apache.solr.handler.admin.MBeansHandlerTest.testDiff(MBeansHandlerTest.java:63)
	at sun.reflect.NativeMethodAccessorImpl.invoke0(Native Method)
	at sun.reflect.NativeMethodAccessorImpl.invoke(NativeMethodAccessorImpl.java:62)
	at sun.reflect.DelegatingMethodAccessorImpl.invoke(DelegatingMethodAccessorImpl.java:43)
	at java.lang.reflect.Method.invoke(Method.java:498)
	at com.carrotsearch.randomizedtesting.RandomizedRunner.invoke(RandomizedRunner.java:1713)
	at com.carrotsearch.randomizedtesting.RandomizedRunner$8.evaluate(RandomizedRunner.java:907)
	at com.carrotsearch.randomizedtesting.RandomizedRunner$9.evaluate(RandomizedRunner.java:943)
	at com.carrotsearch.randomizedtesting.RandomizedRunner$10.evaluate(RandomizedRunner.java:957)
	at com.carrotsearch.randomizedtesting.rules.SystemPropertiesRestoreRule$1.evaluate(SystemPropertiesRestoreRule.java:57)
	at org.apache.lucene.util.TestRuleSetupTeardownChained$1.evaluate(TestRuleSetupTeardownChained.java:49)
	at org.apache.lucene.util.AbstractBeforeAfterRule$1.evaluate(AbstractBeforeAfterRule.java:45)
	at org.apache.lucene.util.TestRuleThreadAndTestName$1.evaluate(TestRuleThreadAndTestName.java:48)
	at org.apache.lucene.util.TestRuleIgnoreAfterMaxFailures$1.evaluate(TestRuleIgnoreAfterMaxFailures.java:64)
	at org.apache.lucene.util.TestRuleMarkFailure$1.evaluate(TestRuleMarkFailure.java:47)
	at com.carrotsearch.randomizedtesting.rules.StatementAdapter.evaluate(StatementAdapter.java:36)
	at com.carrotsearch.randomizedtesting.ThreadLeakControl$StatementRunner.run(ThreadLeakControl.java:368)
	at com.carrotsearch.randomizedtesting.ThreadLeakControl.forkTimeoutingTask(ThreadLeakControl.java:817)
	at com.carrotsearch.randomizedtesting.ThreadLeakControl$3.evaluate(ThreadLeakControl.java:468)
	at com.carrotsearch.randomizedtesting.RandomizedRunner.runSingleTest(RandomizedRunner.java:916)
	at com.carrotsearch.randomizedtesting.RandomizedRunner$5.evaluate(RandomizedRunner.java:802)
	at com.carrotsearch.randomizedtesting.RandomizedRunner$6.evaluate(RandomizedRunner.java:852)
	at com.carrotsearch.randomizedtesting.RandomizedRunner$7.evaluate(RandomizedRunner.java:863)
	at com.carrotsearch.randomizedtesting.rules.StatementAdapter.evaluate(StatementAdapter.java:36)
	at com.carrotsearch.randomizedtesting.rules.SystemPropertiesRestoreRule$1.evaluate(SystemPropertiesRestoreRule.java:57)
	at org.apache.lucene.util.AbstractBeforeAfterRule$1.evaluate(AbstractBeforeAfterRule.java:45)
	at com.carrotsearch.randomizedtesting.rules.StatementAdapter.evaluate(StatementAdapter.java:36)
	at org.apache.lucene.util.TestRuleStoreClassName$1.evaluate(TestRuleStoreClassName.java:41)
	at com.carrotsearch.randomizedtesting.rules.NoShadowingOrOverridesOnMethodsRule$1.evaluate(NoShadowingOrOverridesOnMethodsRule.java:40)
	at com.carrotsearch.randomizedtesting.rules.NoShadowingOrOverridesOnMethodsRule$1.evaluate(NoShadowingOrOverridesOnMethodsRule.java:40)
	at com.carrotsearch.randomizedtesting.rules.StatementAdapter.evaluate(StatementAdapter.java:36)
	at com.carrotsearch.randomizedtesting.rules.StatementAdapter.evaluate(StatementAdapter.java:36)
	at com.carrotsearch.randomizedtesting.rules.StatementAdapter.evaluate(StatementAdapter.java:36)
	at org.apache.lucene.util.TestRuleAssertionsRequired$1.evaluate(TestRuleAssertionsRequired.java:53)
	at org.apache.lucene.util.TestRuleMarkFailure$1.evaluate(TestRuleMarkFailure.java:47)
	at org.apache.lucene.util.TestRuleIgnoreAfterMaxFailures$1.evaluate(TestRuleIgnoreAfterMaxFailures.java:64)
	at org.apache.lucene.util.TestRuleIgnoreTestSuites$1.evaluate(TestRuleIgnoreTestSuites.java:54)
	at com.carrotsearch.randomizedtesting.rules.StatementAdapter.evaluate(StatementAdapter.java:36)
	at com.carrotsearch.randomizedtesting.ThreadLeakControl$StatementRunner.run(ThreadLeakControl.java:368)
	at java.lang.Thread.run(Thread.java:745)




Build Log:
[...truncated 11458 lines...]
   [junit4] Suite: org.apache.solr.handler.admin.MBeansHandlerTest
   [junit4]   2> Creating dataDir: /Users/jenkins/workspace/Lucene-Solr-6.x-MacOSX/solr/build/solr-core/test/J1/temp/solr.handler.admin.MBeansHandlerTest_B2131EF6F5BB464F-001/init-core-data-001
   [junit4]   2> 1215457 INFO  (SUITE-MBeansHandlerTest-seed#[B2131EF6F5BB464F]-worker)
[    ] o.a.s.SolrTestCaseJ4 Randomized ssl (false) and clientAuth (false) via: @org.apache.solr.util.RandomizeSSL(reason=,
value=NaN, ssl=NaN, clientAuth=NaN) w/ MAC_OS_X supressed clientAuth
   [junit4]   2> 1215457 INFO  (SUITE-MBeansHandlerTest-seed#[B2131EF6F5BB464F]-worker)
[    ] o.a.s.SolrTestCaseJ4 ####initCore
   [junit4]   2> 1215458 INFO  (SUITE-MBeansHandlerTest-seed#[B2131EF6F5BB464F]-worker)
[    ] o.a.s.c.SolrResourceLoader [null] Added 2 libs to classloader, from paths: [/Users/jenkins/workspace/Lucene-Solr-6.x-MacOSX/solr/core/src/test-files/solr/collection1/lib,
/Users/jenkins/workspace/Lucene-Solr-6.x-MacOSX/solr/core/src/test-files/solr/collection1/lib/classes]
   [junit4]   2> 1215549 INFO  (SUITE-MBeansHandlerTest-seed#[B2131EF6F5BB464F]-worker)
[    ] o.a.s.c.SolrConfig Using Lucene MatchVersion: 6.5.0
   [junit4]   2> 1215624 INFO  (SUITE-MBeansHandlerTest-seed#[B2131EF6F5BB464F]-worker)
[    ] o.a.s.s.IndexSchema [null] Schema name=test
   [junit4]   2> 1215709 WARN  (SUITE-MBeansHandlerTest-seed#[B2131EF6F5BB464F]-worker)
[    ] o.a.s.s.IndexSchema [null] default search field in schema is text. WARNING: Deprecated,
please use 'df' on request instead.
   [junit4]   2> 1215711 INFO  (SUITE-MBeansHandlerTest-seed#[B2131EF6F5BB464F]-worker)
[    ] o.a.s.s.IndexSchema Loaded schema test/1.0 with uniqueid field id
   [junit4]   2> 1215735 INFO  (SUITE-MBeansHandlerTest-seed#[B2131EF6F5BB464F]-worker)
[    ] o.a.s.u.UpdateShardHandler Creating UpdateShardHandler HTTP client with params: socketTimeout=30000&connTimeout=30000&retry=true
   [junit4]   2> 1215741 WARN  (SUITE-MBeansHandlerTest-seed#[B2131EF6F5BB464F]-worker)
[    ] o.a.s.m.r.SolrJmxReporter No serviceUrl or agentId was configured, using first MBeanServer.
   [junit4]   2> 1215743 INFO  (SUITE-MBeansHandlerTest-seed#[B2131EF6F5BB464F]-worker)
[    ] o.a.s.m.r.SolrJmxReporter JMX monitoring enabled at server: com.sun.jmx.mbeanserver.JmxMBeanServer@5d8bc415
   [junit4]   2> 1215744 WARN  (SUITE-MBeansHandlerTest-seed#[B2131EF6F5BB464F]-worker)
[    ] o.a.s.m.r.SolrJmxReporter No serviceUrl or agentId was configured, using first MBeanServer.
   [junit4]   2> 1215747 INFO  (SUITE-MBeansHandlerTest-seed#[B2131EF6F5BB464F]-worker)
[    ] o.a.s.m.r.SolrJmxReporter JMX monitoring enabled at server: com.sun.jmx.mbeanserver.JmxMBeanServer@5d8bc415
   [junit4]   2> 1215747 WARN  (SUITE-MBeansHandlerTest-seed#[B2131EF6F5BB464F]-worker)
[    ] o.a.s.m.r.SolrJmxReporter No serviceUrl or agentId was configured, using first MBeanServer.
   [junit4]   2> 1215747 INFO  (SUITE-MBeansHandlerTest-seed#[B2131EF6F5BB464F]-worker)
[    ] o.a.s.m.r.SolrJmxReporter JMX monitoring enabled at server: com.sun.jmx.mbeanserver.JmxMBeanServer@5d8bc415
   [junit4]   2> 1215749 INFO  (coreLoadExecutor-4326-thread-1) [    x:collection1] o.a.s.c.SolrResourceLoader
[null] Added 2 libs to classloader, from paths: [/Users/jenkins/workspace/Lucene-Solr-6.x-MacOSX/solr/core/src/test-files/solr/collection1/lib,
/Users/jenkins/workspace/Lucene-Solr-6.x-MacOSX/solr/core/src/test-files/solr/collection1/lib/classes]
   [junit4]   2> 1216589 INFO  (coreLoadExecutor-4326-thread-1) [    x:collection1] o.a.s.c.SolrConfig
Using Lucene MatchVersion: 6.5.0
   [junit4]   2> 1216616 INFO  (coreLoadExecutor-4326-thread-1) [    x:collection1] o.a.s.s.IndexSchema
[collection1] Schema name=test
   [junit4]   2> 1216689 WARN  (coreLoadExecutor-4326-thread-1) [    x:collection1] o.a.s.s.IndexSchema
[collection1] default search field in schema is text. WARNING: Deprecated, please use 'df'
on request instead.
   [junit4]   2> 1216691 INFO  (coreLoadExecutor-4326-thread-1) [    x:collection1] o.a.s.s.IndexSchema
Loaded schema test/1.0 with uniqueid field id
   [junit4]   2> 1216700 INFO  (coreLoadExecutor-4326-thread-1) [    x:collection1] o.a.s.c.CoreContainer
Creating SolrCore 'collection1' using configuration from instancedir /Users/jenkins/workspace/Lucene-Solr-6.x-MacOSX/solr/core/src/test-files/solr/collection1
   [junit4]   2> 1216700 WARN  (coreLoadExecutor-4326-thread-1) [    x:collection1] o.a.s.m.r.SolrJmxReporter
No serviceUrl or agentId was configured, using first MBeanServer.
   [junit4]   2> 1216700 INFO  (coreLoadExecutor-4326-thread-1) [    x:collection1] o.a.s.m.r.SolrJmxReporter
JMX monitoring enabled at server: com.sun.jmx.mbeanserver.JmxMBeanServer@5d8bc415
   [junit4]   2> 1216700 INFO  (coreLoadExecutor-4326-thread-1) [    x:collection1] o.a.s.c.SolrCore
[[collection1] ] Opening new SolrCore at [/Users/jenkins/workspace/Lucene-Solr-6.x-MacOSX/solr/core/src/test-files/solr/collection1],
dataDir=[/Users/jenkins/workspace/Lucene-Solr-6.x-MacOSX/solr/build/solr-core/test/J1/temp/solr.handler.admin.MBeansHandlerTest_B2131EF6F5BB464F-001/init-core-data-001/]
   [junit4]   2> 1216701 INFO  (coreLoadExecutor-4326-thread-1) [    x:collection1] o.a.s.c.JmxMonitoredMap
JMX monitoring is enabled. Adding Solr mbeans to JMX Server: com.sun.jmx.mbeanserver.JmxMBeanServer@5d8bc415
   [junit4]   2> 1216702 INFO  (coreLoadExecutor-4326-thread-1) [    x:collection1] o.a.s.u.RandomMergePolicy
RandomMergePolicy wrapping class org.apache.lucene.index.LogDocMergePolicy: [LogDocMergePolicy:
minMergeSize=1000, mergeFactor=41, maxMergeSize=9223372036854775807, maxMergeSizeForForcedMerge=9223372036854775807,
calibrateSizeByDeletes=false, maxMergeDocs=2147483647, maxCFSSegmentSizeMB=8.796093022207999E12,
noCFSRatio=0.1288424740372479]
   [junit4]   2> 1216737 INFO  (coreLoadExecutor-4326-thread-1) [    x:collection1] o.a.s.u.UpdateHandler
Using UpdateLog implementation: org.apache.solr.update.UpdateLog
   [junit4]   2> 1216737 INFO  (coreLoadExecutor-4326-thread-1) [    x:collection1] o.a.s.u.UpdateLog
Initializing UpdateLog: dataDir= defaultSyncLevel=FLUSH numRecordsToKeep=100 maxNumLogsToKeep=10
numVersionBuckets=65536
   [junit4]   2> 1216738 INFO  (coreLoadExecutor-4326-thread-1) [    x:collection1] o.a.s.u.CommitTracker
Hard AutoCommit: disabled
   [junit4]   2> 1216738 INFO  (coreLoadExecutor-4326-thread-1) [    x:collection1] o.a.s.u.CommitTracker
Soft AutoCommit: disabled
   [junit4]   2> 1216738 INFO  (coreLoadExecutor-4326-thread-1) [    x:collection1] o.a.s.u.RandomMergePolicy
RandomMergePolicy wrapping class org.apache.lucene.index.LogByteSizeMergePolicy: [LogByteSizeMergePolicy:
minMergeSize=1677721, mergeFactor=13, maxMergeSize=2147483648, maxMergeSizeForForcedMerge=9223372036854775807,
calibrateSizeByDeletes=false, maxMergeDocs=2147483647, maxCFSSegmentSizeMB=8.796093022207999E12,
noCFSRatio=0.0]
   [junit4]   2> 1216739 INFO  (coreLoadExecutor-4326-thread-1) [    x:collection1] o.a.s.s.SolrIndexSearcher
Opening [Searcher@6a43e5e1[collection1] main]
   [junit4]   2> 1216739 INFO  (coreLoadExecutor-4326-thread-1) [    x:collection1] o.a.s.h.c.SpellCheckComponent
Initializing spell checkers
   [junit4]   2> 1216764 INFO  (coreLoadExecutor-4326-thread-1) [    x:collection1] o.a.s.s.DirectSolrSpellChecker
init: {name=direct,classname=DirectSolrSpellChecker,field=lowerfilt,minQueryLength=3}
   [junit4]   2> 1216844 INFO  (coreLoadExecutor-4326-thread-1) [    x:collection1] o.a.s.h.ReplicationHandler
Commits will be reserved for  10000
   [junit4]   2> 1216844 INFO  (searcherExecutor-4327-thread-1-processing-x:collection1)
[    x:collection1] o.a.s.h.c.SpellCheckComponent Loading spell index for spellchecker: default
   [junit4]   2> 1216845 INFO  (searcherExecutor-4327-thread-1-processing-x:collection1)
[    x:collection1] o.a.s.h.c.SpellCheckComponent Loading spell index for spellchecker: direct
   [junit4]   2> 1216845 INFO  (searcherExecutor-4327-thread-1-processing-x:collection1)
[    x:collection1] o.a.s.h.c.SpellCheckComponent Loading spell index for spellchecker: wordbreak
   [junit4]   2> 1216845 INFO  (searcherExecutor-4327-thread-1-processing-x:collection1)
[    x:collection1] o.a.s.h.c.SpellCheckComponent Loading spell index for spellchecker: multipleFields
   [junit4]   2> 1216846 INFO  (searcherExecutor-4327-thread-1-processing-x:collection1)
[    x:collection1] o.a.s.h.c.SpellCheckComponent Loading spell index for spellchecker: jarowinkler
   [junit4]   2> 1216846 INFO  (searcherExecutor-4327-thread-1-processing-x:collection1)
[    x:collection1] o.a.s.h.c.SpellCheckComponent Loading spell index for spellchecker: external
   [junit4]   2> 1216846 INFO  (searcherExecutor-4327-thread-1-processing-x:collection1)
[    x:collection1] o.a.s.h.c.SpellCheckComponent Loading spell index for spellchecker: freq
   [junit4]   2> 1216846 INFO  (coreLoadExecutor-4326-thread-1) [    x:collection1] o.a.s.u.UpdateLog
Could not find max version in index or recent updates, using new clock 1558431639132962816
   [junit4]   2> 1216846 INFO  (searcherExecutor-4327-thread-1-processing-x:collection1)
[    x:collection1] o.a.s.h.c.SpellCheckComponent Loading spell index for spellchecker: fqcn
   [junit4]   2> 1216847 INFO  (searcherExecutor-4327-thread-1-processing-x:collection1)
[    x:collection1] o.a.s.h.c.SpellCheckComponent Loading spell index for spellchecker: perDict
   [junit4]   2> 1216848 INFO  (searcherExecutor-4327-thread-1-processing-x:collection1)
[    x:collection1] o.a.s.c.SolrCore [collection1] Registered new searcher Searcher@6a43e5e1[collection1]
main{ExitableDirectoryReader(UninvertingDirectoryReader())}
   [junit4]   2> 1216849 INFO  (SUITE-MBeansHandlerTest-seed#[B2131EF6F5BB464F]-worker)
[    ] o.a.s.SolrTestCaseJ4 ####initCore end
   [junit4]   2> 1216851 INFO  (TEST-MBeansHandlerTest.testBackCompatNames-seed#[B2131EF6F5BB464F])
[    ] o.a.s.SolrTestCaseJ4 ###Starting testBackCompatNames
   [junit4]   2> 1216853 INFO  (TEST-MBeansHandlerTest.testBackCompatNames-seed#[B2131EF6F5BB464F])
[    ] o.a.s.c.S.Request [collection1]  webapp=null path=null params={qt=/admin/mbeans&wt=xml}
status=0 QTime=1
   [junit4]   2> 1216857 INFO  (TEST-MBeansHandlerTest.testBackCompatNames-seed#[B2131EF6F5BB464F])
[    ] o.a.s.c.S.Request [collection1]  webapp=null path=null params={qt=/admin/mbeans&cat=QUERYHANDLER&wt=xml}
status=0 QTime=0
   [junit4]   2> 1216858 INFO  (TEST-MBeansHandlerTest.testBackCompatNames-seed#[B2131EF6F5BB464F])
[    ] o.a.s.c.S.Request [collection1]  webapp=null path=null params={qt=/admin/mbeans&cat=UPDATE&wt=xml}
status=0 QTime=0
   [junit4]   2> 1216858 INFO  (TEST-MBeansHandlerTest.testBackCompatNames-seed#[B2131EF6F5BB464F])
[    ] o.a.s.SolrTestCaseJ4 ###Ending testBackCompatNames
   [junit4]   2> 1216861 INFO  (TEST-MBeansHandlerTest.testXMLDiffWithExternalEntity-seed#[B2131EF6F5BB464F])
[    ] o.a.s.SolrTestCaseJ4 ###Starting testXMLDiffWithExternalEntity
   [junit4]   2> 1217091 INFO  (TEST-MBeansHandlerTest.testXMLDiffWithExternalEntity-seed#[B2131EF6F5BB464F])
[    ] o.a.s.SolrTestCaseJ4 ###Ending testXMLDiffWithExternalEntity
   [junit4]   2> 1217096 INFO  (TEST-MBeansHandlerTest.testDiff-seed#[B2131EF6F5BB464F])
[    ] o.a.s.SolrTestCaseJ4 ###Starting testDiff
   [junit4]   2> 1217102 INFO  (TEST-MBeansHandlerTest.testDiff-seed#[B2131EF6F5BB464F])
[    ] o.a.s.c.S.Request [collection1]  webapp=null path=null params={qt=/admin/mbeans&stats=true&wt=xml}
status=0 QTime=6
   [junit4]   2> 1217139 INFO  (TEST-MBeansHandlerTest.testDiff-seed#[B2131EF6F5BB464F])
[    ] o.a.s.c.S.Request [collection1]  webapp=null path=null params={qt=/admin/mbeans&stats=true&diff=true&wt=xml}
status=0 QTime=35
   [junit4]   2> 1217148 INFO  (TEST-MBeansHandlerTest.testDiff-seed#[B2131EF6F5BB464F])
[    ] o.a.s.SolrTestCaseJ4 ###Ending testDiff
   [junit4]   2> NOTE: reproduce with: ant test  -Dtestcase=MBeansHandlerTest -Dtests.method=testDiff
-Dtests.seed=B2131EF6F5BB464F -Dtests.slow=true -Dtests.locale=hi-IN -Dtests.timezone=Europe/Ljubljana
-Dtests.asserts=true -Dtests.file.encoding=ISO-8859-1
   [junit4] FAILURE 0.07s J1 | MBeansHandlerTest.testDiff <<<
   [junit4]    > Throwable #1: org.junit.ComparisonFailure: expected:<Was: [1, Now:
2], Delta: 1> but was:<Was: [4, Now: 5], Delta: 1>
   [junit4]    > 	at __randomizedtesting.SeedInfo.seed([B2131EF6F5BB464F:7705DA6DE50D7E2F]:0)
   [junit4]    > 	at org.apache.solr.handler.admin.MBeansHandlerTest.testDiff(MBeansHandlerTest.java:63)
   [junit4]    > 	at java.lang.Thread.run(Thread.java:745)
   [junit4]   2> 1217157 INFO  (SUITE-MBeansHandlerTest-seed#[B2131EF6F5BB464F]-worker)
[    ] o.a.s.SolrTestCaseJ4 ###deleteCore
   [junit4]   2> 1217157 INFO  (SUITE-MBeansHandlerTest-seed#[B2131EF6F5BB464F]-worker)
[    ] o.a.s.c.CoreContainer Shutting down CoreContainer instance=247555359
   [junit4]   2> 1217158 INFO  (coreCloseExecutor-4332-thread-1) [    x:collection1] o.a.s.c.SolrCore
[collection1]  CLOSING SolrCore org.apache.solr.core.SolrCore@2fe614bd
   [junit4]   2> 1217183 INFO  (coreCloseExecutor-4332-thread-1) [    x:collection1] o.a.s.m.SolrMetricManager
Closing metric reporters for: solr.core.collection1
   [junit4]   2> 1217186 INFO  (SUITE-MBeansHandlerTest-seed#[B2131EF6F5BB464F]-worker)
[    ] o.a.s.m.SolrMetricManager Closing metric reporters for: solr.node
   [junit4]   2> NOTE: leaving temporary files on disk at: /Users/jenkins/workspace/Lucene-Solr-6.x-MacOSX/solr/build/solr-core/test/J1/temp/solr.handler.admin.MBeansHandlerTest_B2131EF6F5BB464F-001
   [junit4]   2> NOTE: test params are: codec=Asserting(Lucene62): {}, docValues:{}, maxPointsInLeafNode=61,
maxMBSortInHeap=7.4288505597422745, sim=RandomSimilarity(queryNorm=true,coord=no): {}, locale=hi-IN,
timezone=Europe/Ljubljana
   [junit4]   2> NOTE: Mac OS X 10.11.6 x86_64/Oracle Corporation 1.8.0_121 (64-bit)/cpus=3,threads=1,free=222697920,total=384303104
   [junit4]   2> NOTE: All tests run in this JVM: [TestLMDirichletSimilarityFactory, OverseerCollectionConfigSetProcessorTest,
ConnectionReuseTest, UUIDUpdateProcessorFallbackTest, ClassificationUpdateProcessorTest, AnalyticsMergeStrategyTest,
HdfsSyncSliceTest, TestComplexPhraseQParserPlugin, TestDocSet, ExternalFileFieldSortTest,
IndexSchemaTest, ReplicaListTransformerTest, TestDistributedGrouping, TestBlobHandler, TestPHPSerializedResponseWriter,
TestExpandComponent, TestSolrCloudWithHadoopAuthPlugin, FacetPivotSmallTest, DistributedIntervalFacetingTest,
SpellingQueryConverterTest, DistributedQueryComponentOptimizationTest, ChaosMonkeySafeLeaderTest,
TestReload, TestSystemCollAutoCreate, TestSolrCoreProperties, TestOnReconnectListenerSupport,
TestCloudDeleteByQuery, TestGraphTermsQParserPlugin, TestBackupRepositoryFactory, TestSubQueryTransformerCrossCore,
DistributedFacetPivotSmallAdvancedTest, TestUniqueKeyFieldResource, TestSolrDeletionPolicy2,
TestXmlQParser, TestZkChroot, BlockJoinFacetDistribTest, TestScoreJoinQPNoScore, TestStressUserVersions,
TestOverriddenPrefixQueryForCustomFieldType, AddSchemaFieldsUpdateProcessorFactoryTest, TestFiltering,
TestExactStatsCache, TestJmxMonitoredMap, SolrCLIZkUtilsTest, TestAuthorizationFramework,
CoreAdminHandlerTest, TestFoldingMultitermQuery, ResponseHeaderTest, LukeRequestHandlerTest,
CachingDirectoryFactoryTest, TestSolrConfigHandlerCloud, FieldAnalysisRequestHandlerTest,
DocExpirationUpdateProcessorFactoryTest, SecurityConfHandlerTest, TestRandomRequestDistribution,
DistributedVersionInfoTest, PreAnalyzedFieldManagedSchemaCloudTest, RuleEngineTest, UpdateParamsTest,
TestDistribIDF, HighlighterMaxOffsetTest, TestTrie, TestObjectReleaseTracker, ExplicitHLLTest,
BinaryUpdateRequestHandlerTest, FieldMutatingUpdateProcessorTest, TestRuleBasedAuthorizationPlugin,
DeleteInactiveReplicaTest, SSLMigrationTest, RecoveryAfterSoftCommitTest, TestSolrFieldCacheMBean,
LeaderElectionIntegrationTest, TestFastWriter, BlobRepositoryCloudTest, TestHdfsUpdateLog,
OutOfBoxZkACLAndCredentialsProvidersTest, HdfsDirectoryTest, TestBinaryResponseWriter, CircularListTest,
NotRequiredUniqueKeyTest, TestSolrCLIRunExample, TestAddFieldRealTimeGet, SpellPossibilityIteratorTest,
TestRequestStatusCollectionAPI, TestInitParams, RegexBoostProcessorTest, TestAtomicUpdateErrorCases,
LeaderInitiatedRecoveryOnShardRestartTest, TermVectorComponentDistributedTest, TestCoreDiscovery,
TestLegacyFieldCache, PeerSyncWithIndexFingerprintCachingTest, TestBadConfig, CoreAdminRequestStatusTest,
TestSolr4Spatial2, TestReloadDeadlock, TestTolerantUpdateProcessorCloud, TestRandomFaceting,
TestQuerySenderNoQuery, TlogReplayBufferedWhileIndexingTest, SuggesterTSTTest, SuggesterWFSTTest,
TestCloudRecovery, UtilsToolTest, TestConfig, TestSolrCloudWithKerberosAlt, StatsComponentTest,
BigEndianAscendingWordSerializerTest, TestDynamicFieldResource, TestSolrXml, InfoHandlerTest,
TestManagedResource, HdfsDirectoryFactoryTest, HighlighterConfigTest, AliasIntegrationTest,
MBeansHandlerTest]
   [junit4] Completed [216/683 (1!)] on J1 in 1.75s, 3 tests, 1 failure <<< FAILURES!

[...truncated 63980 lines...]


Mime
View raw message