lucene-dev mailing list archives

Site index · List index
Message view « Date » · « Thread »
Top « Date » · « Thread »
From Policeman Jenkins Server <jenk...@thetaphi.de>
Subject [JENKINS] Lucene-Solr-master-Windows (32bit/jdk1.8.0_121) - Build # 6401 - Still Unstable!
Date Fri, 17 Feb 2017 09:50:52 GMT
Build: https://jenkins.thetaphi.de/job/Lucene-Solr-master-Windows/6401/
Java: 32bit/jdk1.8.0_121 -server -XX:+UseParallelGC

1 tests failed.
FAILED:  org.apache.solr.cloud.MissingSegmentRecoveryTest.testLeaderRecovery

Error Message:
Expected a collection with one shard and two replicas null Last available state: DocCollection(MissingSegmentRecoveryTest//collections/MissingSegmentRecoveryTest/state.json/7)={   "replicationFactor":"2",   "shards":{"shard1":{       "range":"80000000-7fffffff",       "state":"active",       "replicas":{         "core_node1":{           "core":"MissingSegmentRecoveryTest_shard1_replica1",           "base_url":"https://127.0.0.1:57160/solr",           "node_name":"127.0.0.1:57160_solr",           "state":"down"},         "core_node2":{           "core":"MissingSegmentRecoveryTest_shard1_replica2",           "base_url":"https://127.0.0.1:57165/solr",           "node_name":"127.0.0.1:57165_solr",           "state":"active",           "leader":"true"}}}},   "router":{"name":"compositeId"},   "maxShardsPerNode":"1",   "autoAddReplicas":"false"}

Stack Trace:
java.lang.AssertionError: Expected a collection with one shard and two replicas
null
Last available state: DocCollection(MissingSegmentRecoveryTest//collections/MissingSegmentRecoveryTest/state.json/7)={
  "replicationFactor":"2",
  "shards":{"shard1":{
      "range":"80000000-7fffffff",
      "state":"active",
      "replicas":{
        "core_node1":{
          "core":"MissingSegmentRecoveryTest_shard1_replica1",
          "base_url":"https://127.0.0.1:57160/solr",
          "node_name":"127.0.0.1:57160_solr",
          "state":"down"},
        "core_node2":{
          "core":"MissingSegmentRecoveryTest_shard1_replica2",
          "base_url":"https://127.0.0.1:57165/solr",
          "node_name":"127.0.0.1:57165_solr",
          "state":"active",
          "leader":"true"}}}},
  "router":{"name":"compositeId"},
  "maxShardsPerNode":"1",
  "autoAddReplicas":"false"}
	at __randomizedtesting.SeedInfo.seed([A3AC04D7F106F40E:F3F99CD4A8274213]:0)
	at org.junit.Assert.fail(Assert.java:93)
	at org.apache.solr.cloud.SolrCloudTestCase.waitForState(SolrCloudTestCase.java:265)
	at org.apache.solr.cloud.MissingSegmentRecoveryTest.testLeaderRecovery(MissingSegmentRecoveryTest.java:105)
	at sun.reflect.NativeMethodAccessorImpl.invoke0(Native Method)
	at sun.reflect.NativeMethodAccessorImpl.invoke(NativeMethodAccessorImpl.java:62)
	at sun.reflect.DelegatingMethodAccessorImpl.invoke(DelegatingMethodAccessorImpl.java:43)
	at java.lang.reflect.Method.invoke(Method.java:498)
	at com.carrotsearch.randomizedtesting.RandomizedRunner.invoke(RandomizedRunner.java:1713)
	at com.carrotsearch.randomizedtesting.RandomizedRunner$8.evaluate(RandomizedRunner.java:907)
	at com.carrotsearch.randomizedtesting.RandomizedRunner$9.evaluate(RandomizedRunner.java:943)
	at com.carrotsearch.randomizedtesting.RandomizedRunner$10.evaluate(RandomizedRunner.java:957)
	at com.carrotsearch.randomizedtesting.rules.SystemPropertiesRestoreRule$1.evaluate(SystemPropertiesRestoreRule.java:57)
	at org.apache.lucene.util.TestRuleSetupTeardownChained$1.evaluate(TestRuleSetupTeardownChained.java:49)
	at org.apache.lucene.util.AbstractBeforeAfterRule$1.evaluate(AbstractBeforeAfterRule.java:45)
	at org.apache.lucene.util.TestRuleThreadAndTestName$1.evaluate(TestRuleThreadAndTestName.java:48)
	at org.apache.lucene.util.TestRuleIgnoreAfterMaxFailures$1.evaluate(TestRuleIgnoreAfterMaxFailures.java:64)
	at org.apache.lucene.util.TestRuleMarkFailure$1.evaluate(TestRuleMarkFailure.java:47)
	at com.carrotsearch.randomizedtesting.rules.StatementAdapter.evaluate(StatementAdapter.java:36)
	at com.carrotsearch.randomizedtesting.ThreadLeakControl$StatementRunner.run(ThreadLeakControl.java:368)
	at com.carrotsearch.randomizedtesting.ThreadLeakControl.forkTimeoutingTask(ThreadLeakControl.java:817)
	at com.carrotsearch.randomizedtesting.ThreadLeakControl$3.evaluate(ThreadLeakControl.java:468)
	at com.carrotsearch.randomizedtesting.RandomizedRunner.runSingleTest(RandomizedRunner.java:916)
	at com.carrotsearch.randomizedtesting.RandomizedRunner$5.evaluate(RandomizedRunner.java:802)
	at com.carrotsearch.randomizedtesting.RandomizedRunner$6.evaluate(RandomizedRunner.java:852)
	at com.carrotsearch.randomizedtesting.RandomizedRunner$7.evaluate(RandomizedRunner.java:863)
	at com.carrotsearch.randomizedtesting.rules.StatementAdapter.evaluate(StatementAdapter.java:36)
	at com.carrotsearch.randomizedtesting.rules.SystemPropertiesRestoreRule$1.evaluate(SystemPropertiesRestoreRule.java:57)
	at org.apache.lucene.util.AbstractBeforeAfterRule$1.evaluate(AbstractBeforeAfterRule.java:45)
	at com.carrotsearch.randomizedtesting.rules.StatementAdapter.evaluate(StatementAdapter.java:36)
	at org.apache.lucene.util.TestRuleStoreClassName$1.evaluate(TestRuleStoreClassName.java:41)
	at com.carrotsearch.randomizedtesting.rules.NoShadowingOrOverridesOnMethodsRule$1.evaluate(NoShadowingOrOverridesOnMethodsRule.java:40)
	at com.carrotsearch.randomizedtesting.rules.NoShadowingOrOverridesOnMethodsRule$1.evaluate(NoShadowingOrOverridesOnMethodsRule.java:40)
	at com.carrotsearch.randomizedtesting.rules.StatementAdapter.evaluate(StatementAdapter.java:36)
	at com.carrotsearch.randomizedtesting.rules.StatementAdapter.evaluate(StatementAdapter.java:36)
	at com.carrotsearch.randomizedtesting.rules.StatementAdapter.evaluate(StatementAdapter.java:36)
	at org.apache.lucene.util.TestRuleAssertionsRequired$1.evaluate(TestRuleAssertionsRequired.java:53)
	at org.apache.lucene.util.TestRuleMarkFailure$1.evaluate(TestRuleMarkFailure.java:47)
	at org.apache.lucene.util.TestRuleIgnoreAfterMaxFailures$1.evaluate(TestRuleIgnoreAfterMaxFailures.java:64)
	at org.apache.lucene.util.TestRuleIgnoreTestSuites$1.evaluate(TestRuleIgnoreTestSuites.java:54)
	at com.carrotsearch.randomizedtesting.rules.StatementAdapter.evaluate(StatementAdapter.java:36)
	at com.carrotsearch.randomizedtesting.ThreadLeakControl$StatementRunner.run(ThreadLeakControl.java:368)
	at java.lang.Thread.run(Thread.java:745)




Build Log:
[...truncated 11087 lines...]
   [junit4] Suite: org.apache.solr.cloud.MissingSegmentRecoveryTest
   [junit4]   2> Creating dataDir: C:\Users\jenkins\workspace\Lucene-Solr-master-Windows\solr\build\solr-core\test\J0\temp\solr.cloud.MissingSegmentRecoveryTest_A3AC04D7F106F40E-001\init-core-data-001
   [junit4]   2> 252993 INFO  (SUITE-MissingSegmentRecoveryTest-seed#[A3AC04D7F106F40E]-worker) [    ] o.a.s.SolrTestCaseJ4 Using TrieFields
   [junit4]   2> 252996 INFO  (SUITE-MissingSegmentRecoveryTest-seed#[A3AC04D7F106F40E]-worker) [    ] o.a.s.SolrTestCaseJ4 Randomized ssl (true) and clientAuth (false) via: @org.apache.solr.util.RandomizeSSL(reason=, value=NaN, ssl=NaN, clientAuth=NaN)
   [junit4]   2> 253001 INFO  (SUITE-MissingSegmentRecoveryTest-seed#[A3AC04D7F106F40E]-worker) [    ] o.a.s.c.MiniSolrCloudCluster Starting cluster of 2 servers in C:\Users\jenkins\workspace\Lucene-Solr-master-Windows\solr\build\solr-core\test\J0\temp\solr.cloud.MissingSegmentRecoveryTest_A3AC04D7F106F40E-001\tempDir-001
   [junit4]   2> 253001 INFO  (SUITE-MissingSegmentRecoveryTest-seed#[A3AC04D7F106F40E]-worker) [    ] o.a.s.c.ZkTestServer STARTING ZK TEST SERVER
   [junit4]   2> 253002 INFO  (Thread-358) [    ] o.a.s.c.ZkTestServer client port:0.0.0.0/0.0.0.0:0
   [junit4]   2> 253002 INFO  (Thread-358) [    ] o.a.s.c.ZkTestServer Starting server
   [junit4]   2> 253102 INFO  (SUITE-MissingSegmentRecoveryTest-seed#[A3AC04D7F106F40E]-worker) [    ] o.a.s.c.ZkTestServer start zk server on port:57156
   [junit4]   2> 253119 WARN  (NIOServerCxn.Factory:0.0.0.0/0.0.0.0:0) [    ] o.a.z.s.NIOServerCnxn caught end of stream exception
   [junit4]   2> EndOfStreamException: Unable to read additional data from client sessionid 0x15a4b38e6f10000, likely client has closed socket
   [junit4]   2> 	at org.apache.zookeeper.server.NIOServerCnxn.doIO(NIOServerCnxn.java:228)
   [junit4]   2> 	at org.apache.zookeeper.server.NIOServerCnxnFactory.run(NIOServerCnxnFactory.java:208)
   [junit4]   2> 	at java.lang.Thread.run(Thread.java:745)
   [junit4]   2> 253129 INFO  (jetty-launcher-241-thread-1) [    ] o.e.j.s.Server jetty-9.3.14.v20161028
   [junit4]   2> 253139 INFO  (jetty-launcher-241-thread-2) [    ] o.e.j.s.Server jetty-9.3.14.v20161028
   [junit4]   2> 253140 INFO  (jetty-launcher-241-thread-2) [    ] o.e.j.s.h.ContextHandler Started o.e.j.s.ServletContextHandler@a76e7a{/solr,null,AVAILABLE}
   [junit4]   2> 253145 INFO  (jetty-launcher-241-thread-2) [    ] o.e.j.s.AbstractConnector Started ServerConnector@13a2de7{SSL,[ssl, http/1.1]}{127.0.0.1:57160}
   [junit4]   2> 253145 INFO  (jetty-launcher-241-thread-2) [    ] o.e.j.s.Server Started @258116ms
   [junit4]   2> 253145 INFO  (jetty-launcher-241-thread-2) [    ] o.a.s.c.s.e.JettySolrRunner Jetty properties: {hostContext=/solr, hostPort=57160}
   [junit4]   2> 253145 ERROR (jetty-launcher-241-thread-2) [    ] o.a.s.s.StartupLoggingUtils Missing Java Option solr.log.dir. Logging may be missing or incomplete.
   [junit4]   2> 253146 INFO  (jetty-launcher-241-thread-2) [    ] o.a.s.s.SolrDispatchFilter  ___      _       Welcome to Apache Solr™ version 7.0.0
   [junit4]   2> 253146 INFO  (jetty-launcher-241-thread-2) [    ] o.a.s.s.SolrDispatchFilter / __| ___| |_ _   Starting in cloud mode on port null
   [junit4]   2> 253146 INFO  (jetty-launcher-241-thread-2) [    ] o.a.s.s.SolrDispatchFilter \__ \/ _ \ | '_|  Install dir: null
   [junit4]   2> 253146 INFO  (jetty-launcher-241-thread-2) [    ] o.a.s.s.SolrDispatchFilter |___/\___/_|_|    Start time: 2017-02-17T08:38:24.893Z
   [junit4]   2> 253148 INFO  (jetty-launcher-241-thread-1) [    ] o.e.j.s.h.ContextHandler Started o.e.j.s.ServletContextHandler@a7d8ad{/solr,null,AVAILABLE}
   [junit4]   2> 253151 INFO  (jetty-launcher-241-thread-1) [    ] o.e.j.s.AbstractConnector Started ServerConnector@9daf3f{SSL,[ssl, http/1.1]}{127.0.0.1:57165}
   [junit4]   2> 253151 INFO  (jetty-launcher-241-thread-1) [    ] o.e.j.s.Server Started @258122ms
   [junit4]   2> 253151 INFO  (jetty-launcher-241-thread-1) [    ] o.a.s.c.s.e.JettySolrRunner Jetty properties: {hostContext=/solr, hostPort=57165}
   [junit4]   2> 253151 ERROR (jetty-launcher-241-thread-1) [    ] o.a.s.s.StartupLoggingUtils Missing Java Option solr.log.dir. Logging may be missing or incomplete.
   [junit4]   2> 253152 INFO  (jetty-launcher-241-thread-1) [    ] o.a.s.s.SolrDispatchFilter  ___      _       Welcome to Apache Solr™ version 7.0.0
   [junit4]   2> 253152 INFO  (jetty-launcher-241-thread-1) [    ] o.a.s.s.SolrDispatchFilter / __| ___| |_ _   Starting in cloud mode on port null
   [junit4]   2> 253152 INFO  (jetty-launcher-241-thread-1) [    ] o.a.s.s.SolrDispatchFilter \__ \/ _ \ | '_|  Install dir: null
   [junit4]   2> 253152 INFO  (jetty-launcher-241-thread-1) [    ] o.a.s.s.SolrDispatchFilter |___/\___/_|_|    Start time: 2017-02-17T08:38:24.899Z
   [junit4]   2> 253160 INFO  (jetty-launcher-241-thread-2) [    ] o.a.s.s.SolrDispatchFilter solr.xml found in ZooKeeper. Loading...
   [junit4]   2> 253160 INFO  (jetty-launcher-241-thread-1) [    ] o.a.s.s.SolrDispatchFilter solr.xml found in ZooKeeper. Loading...
   [junit4]   2> 253186 INFO  (jetty-launcher-241-thread-2) [    ] o.a.s.c.ZkContainer Zookeeper client=127.0.0.1:57156/solr
   [junit4]   2> 253191 INFO  (jetty-launcher-241-thread-1) [    ] o.a.s.c.ZkContainer Zookeeper client=127.0.0.1:57156/solr
   [junit4]   2> 253270 INFO  (jetty-launcher-241-thread-2) [n:127.0.0.1:57160_solr    ] o.a.s.c.Overseer Overseer (id=null) closing
   [junit4]   2> 253272 INFO  (jetty-launcher-241-thread-2) [n:127.0.0.1:57160_solr    ] o.a.s.c.OverseerElectionContext I am going to be the leader 127.0.0.1:57160_solr
   [junit4]   2> 253274 INFO  (jetty-launcher-241-thread-2) [n:127.0.0.1:57160_solr    ] o.a.s.c.Overseer Overseer (id=97473049706692613-127.0.0.1:57160_solr-n_0000000000) starting
   [junit4]   2> 253277 INFO  (jetty-launcher-241-thread-1) [n:127.0.0.1:57165_solr    ] o.a.s.c.Overseer Overseer (id=null) closing
   [junit4]   2> 253279 INFO  (jetty-launcher-241-thread-1) [n:127.0.0.1:57165_solr    ] o.a.s.c.ZkController Register node as live in ZooKeeper:/live_nodes/127.0.0.1:57165_solr
   [junit4]   2> 253282 INFO  (zkCallback-252-thread-1-processing-n:127.0.0.1:57165_solr) [n:127.0.0.1:57165_solr    ] o.a.s.c.c.ZkStateReader Updated live nodes from ZooKeeper... (0) -> (1)
   [junit4]   2> 253283 INFO  (zkCallback-251-thread-1-processing-n:127.0.0.1:57160_solr) [n:127.0.0.1:57160_solr    ] o.a.s.c.c.ZkStateReader Updated live nodes from ZooKeeper... (0) -> (1)
   [junit4]   2> 253287 INFO  (jetty-launcher-241-thread-2) [n:127.0.0.1:57160_solr    ] o.a.s.c.ZkController Register node as live in ZooKeeper:/live_nodes/127.0.0.1:57160_solr
   [junit4]   2> 253289 INFO  (zkCallback-252-thread-1-processing-n:127.0.0.1:57165_solr) [n:127.0.0.1:57165_solr    ] o.a.s.c.c.ZkStateReader Updated live nodes from ZooKeeper... (1) -> (2)
   [junit4]   2> 253289 INFO  (zkCallback-251-thread-1-processing-n:127.0.0.1:57160_solr) [n:127.0.0.1:57160_solr    ] o.a.s.c.c.ZkStateReader Updated live nodes from ZooKeeper... (1) -> (2)
   [junit4]   2> 253463 INFO  (jetty-launcher-241-thread-2) [n:127.0.0.1:57160_solr    ] o.a.s.c.CorePropertiesLocator Found 0 core definitions underneath C:\Users\jenkins\workspace\Lucene-Solr-master-Windows\solr\build\solr-core\test\J0\temp\solr.cloud.MissingSegmentRecoveryTest_A3AC04D7F106F40E-001\tempDir-001\node2\.
   [junit4]   2> 253464 INFO  (jetty-launcher-241-thread-1) [n:127.0.0.1:57165_solr    ] o.a.s.c.CorePropertiesLocator Found 0 core definitions underneath C:\Users\jenkins\workspace\Lucene-Solr-master-Windows\solr\build\solr-core\test\J0\temp\solr.cloud.MissingSegmentRecoveryTest_A3AC04D7F106F40E-001\tempDir-001\node1\.
   [junit4]   2> 253593 WARN  (NIOServerCxn.Factory:0.0.0.0/0.0.0.0:0) [    ] o.a.z.s.NIOServerCnxn caught end of stream exception
   [junit4]   2> EndOfStreamException: Unable to read additional data from client sessionid 0x15a4b38e6f10007, likely client has closed socket
   [junit4]   2> 	at org.apache.zookeeper.server.NIOServerCnxn.doIO(NIOServerCnxn.java:228)
   [junit4]   2> 	at org.apache.zookeeper.server.NIOServerCnxnFactory.run(NIOServerCnxnFactory.java:208)
   [junit4]   2> 	at java.lang.Thread.run(Thread.java:745)
   [junit4]   2> 253603 INFO  (SUITE-MissingSegmentRecoveryTest-seed#[A3AC04D7F106F40E]-worker) [    ] o.a.s.c.c.ZkStateReader Updated live nodes from ZooKeeper... (0) -> (2)
   [junit4]   2> 253605 INFO  (SUITE-MissingSegmentRecoveryTest-seed#[A3AC04D7F106F40E]-worker) [    ] o.a.s.c.s.i.ZkClientClusterStateProvider Cluster at 127.0.0.1:57156/solr ready
   [junit4]   2> 253626 INFO  (TEST-MissingSegmentRecoveryTest.testLeaderRecovery-seed#[A3AC04D7F106F40E]) [    ] o.a.s.SolrTestCaseJ4 ###Starting testLeaderRecovery
   [junit4]   2> 253673 INFO  (qtp18874049-1595) [n:127.0.0.1:57160_solr    ] o.a.s.h.a.CollectionsHandler Invoked Collection Action :create with params replicationFactor=2&collection.configName=conf&maxShardsPerNode=1&name=MissingSegmentRecoveryTest&action=CREATE&numShards=1&wt=javabin&version=2 and sendToOCPQueue=true
   [junit4]   2> 253676 INFO  (OverseerThreadFactory-699-thread-1-processing-n:127.0.0.1:57160_solr) [n:127.0.0.1:57160_solr    ] o.a.s.c.CreateCollectionCmd Create collection MissingSegmentRecoveryTest
   [junit4]   2> 253828 INFO  (qtp18874049-1593) [n:127.0.0.1:57160_solr    ] o.a.s.h.a.CoreAdminOperation core create command qt=/admin/cores&collection.configName=conf&newCollection=true&name=MissingSegmentRecoveryTest_shard1_replica1&action=CREATE&numShards=1&collection=MissingSegmentRecoveryTest&shard=shard1&wt=javabin&version=2
   [junit4]   2> 253880 INFO  (qtp10804685-1603) [n:127.0.0.1:57165_solr    ] o.a.s.h.a.CoreAdminOperation core create command qt=/admin/cores&collection.configName=conf&newCollection=true&name=MissingSegmentRecoveryTest_shard1_replica2&action=CREATE&numShards=1&collection=MissingSegmentRecoveryTest&shard=shard1&wt=javabin&version=2
   [junit4]   2> 253990 INFO  (zkCallback-252-thread-1-processing-n:127.0.0.1:57165_solr) [n:127.0.0.1:57165_solr    ] o.a.s.c.c.ZkStateReader A cluster state change: [WatchedEvent state:SyncConnected type:NodeDataChanged path:/collections/MissingSegmentRecoveryTest/state.json] for collection [MissingSegmentRecoveryTest] has occurred - updating... (live nodes size: [2])
   [junit4]   2> 253990 INFO  (zkCallback-251-thread-2-processing-n:127.0.0.1:57160_solr) [n:127.0.0.1:57160_solr    ] o.a.s.c.c.ZkStateReader A cluster state change: [WatchedEvent state:SyncConnected type:NodeDataChanged path:/collections/MissingSegmentRecoveryTest/state.json] for collection [MissingSegmentRecoveryTest] has occurred - updating... (live nodes size: [2])
   [junit4]   2> 254861 INFO  (qtp18874049-1593) [n:127.0.0.1:57160_solr c:MissingSegmentRecoveryTest s:shard1  x:MissingSegmentRecoveryTest_shard1_replica1] o.a.s.c.SolrConfig Using Lucene MatchVersion: 7.0.0
   [junit4]   2> 254869 INFO  (qtp18874049-1593) [n:127.0.0.1:57160_solr c:MissingSegmentRecoveryTest s:shard1  x:MissingSegmentRecoveryTest_shard1_replica1] o.a.s.s.IndexSchema [MissingSegmentRecoveryTest_shard1_replica1] Schema name=minimal
   [junit4]   2> 254876 INFO  (qtp18874049-1593) [n:127.0.0.1:57160_solr c:MissingSegmentRecoveryTest s:shard1  x:MissingSegmentRecoveryTest_shard1_replica1] o.a.s.s.IndexSchema Loaded schema minimal/1.1 with uniqueid field id
   [junit4]   2> 254880 INFO  (qtp18874049-1593) [n:127.0.0.1:57160_solr c:MissingSegmentRecoveryTest s:shard1  x:MissingSegmentRecoveryTest_shard1_replica1] o.a.s.c.CoreContainer Creating SolrCore 'MissingSegmentRecoveryTest_shard1_replica1' using configuration from collection MissingSegmentRecoveryTest
   [junit4]   2> 254880 INFO  (qtp18874049-1593) [n:127.0.0.1:57160_solr c:MissingSegmentRecoveryTest s:shard1  x:MissingSegmentRecoveryTest_shard1_replica1] o.a.s.c.SolrCore [[MissingSegmentRecoveryTest_shard1_replica1] ] Opening new SolrCore at [C:\Users\jenkins\workspace\Lucene-Solr-master-Windows\solr\build\solr-core\test\J0\temp\solr.cloud.MissingSegmentRecoveryTest_A3AC04D7F106F40E-001\tempDir-001\node2\MissingSegmentRecoveryTest_shard1_replica1], dataDir=[C:\Users\jenkins\workspace\Lucene-Solr-master-Windows\solr\build\solr-core\test\J0\temp\solr.cloud.MissingSegmentRecoveryTest_A3AC04D7F106F40E-001\tempDir-001\node2\.\MissingSegmentRecoveryTest_shard1_replica1\data\]
   [junit4]   2> 254895 INFO  (qtp10804685-1603) [n:127.0.0.1:57165_solr c:MissingSegmentRecoveryTest s:shard1  x:MissingSegmentRecoveryTest_shard1_replica2] o.a.s.c.SolrConfig Using Lucene MatchVersion: 7.0.0
   [junit4]   2> 254903 INFO  (qtp10804685-1603) [n:127.0.0.1:57165_solr c:MissingSegmentRecoveryTest s:shard1  x:MissingSegmentRecoveryTest_shard1_replica2] o.a.s.s.IndexSchema [MissingSegmentRecoveryTest_shard1_replica2] Schema name=minimal
   [junit4]   2> 254905 INFO  (qtp10804685-1603) [n:127.0.0.1:57165_solr c:MissingSegmentRecoveryTest s:shard1  x:MissingSegmentRecoveryTest_shard1_replica2] o.a.s.s.IndexSchema Loaded schema minimal/1.1 with uniqueid field id
   [junit4]   2> 254906 INFO  (qtp10804685-1603) [n:127.0.0.1:57165_solr c:MissingSegmentRecoveryTest s:shard1  x:MissingSegmentRecoveryTest_shard1_replica2] o.a.s.c.CoreContainer Creating SolrCore 'MissingSegmentRecoveryTest_shard1_replica2' using configuration from collection MissingSegmentRecoveryTest
   [junit4]   2> 254907 INFO  (qtp10804685-1603) [n:127.0.0.1:57165_solr c:MissingSegmentRecoveryTest s:shard1  x:MissingSegmentRecoveryTest_shard1_replica2] o.a.s.c.SolrCore [[MissingSegmentRecoveryTest_shard1_replica2] ] Opening new SolrCore at [C:\Users\jenkins\workspace\Lucene-Solr-master-Windows\solr\build\solr-core\test\J0\temp\solr.cloud.MissingSegmentRecoveryTest_A3AC04D7F106F40E-001\tempDir-001\node1\MissingSegmentRecoveryTest_shard1_replica2], dataDir=[C:\Users\jenkins\workspace\Lucene-Solr-master-Windows\solr\build\solr-core\test\J0\temp\solr.cloud.MissingSegmentRecoveryTest_A3AC04D7F106F40E-001\tempDir-001\node1\.\MissingSegmentRecoveryTest_shard1_replica2\data\]
   [junit4]   2> 255028 INFO  (qtp18874049-1593) [n:127.0.0.1:57160_solr c:MissingSegmentRecoveryTest s:shard1  x:MissingSegmentRecoveryTest_shard1_replica1] o.a.s.u.UpdateHandler Using UpdateLog implementation: org.apache.solr.update.UpdateLog
   [junit4]   2> 255028 INFO  (qtp18874049-1593) [n:127.0.0.1:57160_solr c:MissingSegmentRecoveryTest s:shard1  x:MissingSegmentRecoveryTest_shard1_replica1] o.a.s.u.UpdateLog Initializing UpdateLog: dataDir=null defaultSyncLevel=FLUSH numRecordsToKeep=100 maxNumLogsToKeep=10 numVersionBuckets=65536
   [junit4]   2> 255028 INFO  (qtp10804685-1603) [n:127.0.0.1:57165_solr c:MissingSegmentRecoveryTest s:shard1  x:MissingSegmentRecoveryTest_shard1_replica2] o.a.s.u.UpdateHandler Using UpdateLog implementation: org.apache.solr.update.UpdateLog
   [junit4]   2> 255028 INFO  (qtp10804685-1603) [n:127.0.0.1:57165_solr c:MissingSegmentRecoveryTest s:shard1  x:MissingSegmentRecoveryTest_shard1_replica2] o.a.s.u.UpdateLog Initializing UpdateLog: dataDir=null defaultSyncLevel=FLUSH numRecordsToKeep=100 maxNumLogsToKeep=10 numVersionBuckets=65536
   [junit4]   2> 255029 INFO  (qtp18874049-1593) [n:127.0.0.1:57160_solr c:MissingSegmentRecoveryTest s:shard1  x:MissingSegmentRecoveryTest_shard1_replica1] o.a.s.u.CommitTracker Hard AutoCommit: disabled
   [junit4]   2> 255029 INFO  (qtp18874049-1593) [n:127.0.0.1:57160_solr c:MissingSegmentRecoveryTest s:shard1  x:MissingSegmentRecoveryTest_shard1_replica1] o.a.s.u.CommitTracker Soft AutoCommit: disabled
   [junit4]   2> 255029 INFO  (qtp10804685-1603) [n:127.0.0.1:57165_solr c:MissingSegmentRecoveryTest s:shard1  x:MissingSegmentRecoveryTest_shard1_replica2] o.a.s.u.CommitTracker Hard AutoCommit: disabled
   [junit4]   2> 255029 INFO  (qtp10804685-1603) [n:127.0.0.1:57165_solr c:MissingSegmentRecoveryTest s:shard1  x:MissingSegmentRecoveryTest_shard1_replica2] o.a.s.u.CommitTracker Soft AutoCommit: disabled
   [junit4]   2> 255032 INFO  (qtp18874049-1593) [n:127.0.0.1:57160_solr c:MissingSegmentRecoveryTest s:shard1  x:MissingSegmentRecoveryTest_shard1_replica1] o.a.s.s.SolrIndexSearcher Opening [Searcher@749e74[MissingSegmentRecoveryTest_shard1_replica1] main]
   [junit4]   2> 255032 INFO  (qtp10804685-1603) [n:127.0.0.1:57165_solr c:MissingSegmentRecoveryTest s:shard1  x:MissingSegmentRecoveryTest_shard1_replica2] o.a.s.s.SolrIndexSearcher Opening [Searcher@4d519d[MissingSegmentRecoveryTest_shard1_replica2] main]
   [junit4]   2> 255034 INFO  (qtp18874049-1593) [n:127.0.0.1:57160_solr c:MissingSegmentRecoveryTest s:shard1  x:MissingSegmentRecoveryTest_shard1_replica1] o.a.s.r.ManagedResourceStorage Configured ZooKeeperStorageIO with znodeBase: /configs/conf
   [junit4]   2> 255034 INFO  (qtp10804685-1603) [n:127.0.0.1:57165_solr c:MissingSegmentRecoveryTest s:shard1  x:MissingSegmentRecoveryTest_shard1_replica2] o.a.s.r.ManagedResourceStorage Configured ZooKeeperStorageIO with znodeBase: /configs/conf
   [junit4]   2> 255034 INFO  (qtp18874049-1593) [n:127.0.0.1:57160_solr c:MissingSegmentRecoveryTest s:shard1  x:MissingSegmentRecoveryTest_shard1_replica1] o.a.s.r.ManagedResourceStorage Loaded null at path _rest_managed.json using ZooKeeperStorageIO:path=/configs/conf
   [junit4]   2> 255034 INFO  (qtp18874049-1593) [n:127.0.0.1:57160_solr c:MissingSegmentRecoveryTest s:shard1  x:MissingSegmentRecoveryTest_shard1_replica1] o.a.s.h.ReplicationHandler Commits will be reserved for  10000
   [junit4]   2> 255034 INFO  (qtp10804685-1603) [n:127.0.0.1:57165_solr c:MissingSegmentRecoveryTest s:shard1  x:MissingSegmentRecoveryTest_shard1_replica2] o.a.s.r.ManagedResourceStorage Loaded null at path _rest_managed.json using ZooKeeperStorageIO:path=/configs/conf
   [junit4]   2> 255035 INFO  (qtp10804685-1603) [n:127.0.0.1:57165_solr c:MissingSegmentRecoveryTest s:shard1  x:MissingSegmentRecoveryTest_shard1_replica2] o.a.s.h.ReplicationHandler Commits will be reserved for  10000
   [junit4]   2> 255035 INFO  (qtp18874049-1593) [n:127.0.0.1:57160_solr c:MissingSegmentRecoveryTest s:shard1  x:MissingSegmentRecoveryTest_shard1_replica1] o.a.s.u.UpdateLog Could not find max version in index or recent updates, using new clock 1559568797434642432
   [junit4]   2> 255035 INFO  (qtp10804685-1603) [n:127.0.0.1:57165_solr c:MissingSegmentRecoveryTest s:shard1  x:MissingSegmentRecoveryTest_shard1_replica2] o.a.s.u.UpdateLog Could not find max version in index or recent updates, using new clock 1559568797434642432
   [junit4]   2> 255037 INFO  (searcherExecutor-704-thread-1-processing-n:127.0.0.1:57160_solr x:MissingSegmentRecoveryTest_shard1_replica1 s:shard1 c:MissingSegmentRecoveryTest) [n:127.0.0.1:57160_solr c:MissingSegmentRecoveryTest s:shard1  x:MissingSegmentRecoveryTest_shard1_replica1] o.a.s.c.SolrCore [MissingSegmentRecoveryTest_shard1_replica1] Registered new searcher Searcher@749e74[MissingSegmentRecoveryTest_shard1_replica1] main{ExitableDirectoryReader(UninvertingDirectoryReader())}
   [junit4]   2> 255037 INFO  (searcherExecutor-705-thread-1-processing-n:127.0.0.1:57165_solr x:MissingSegmentRecoveryTest_shard1_replica2 s:shard1 c:MissingSegmentRecoveryTest) [n:127.0.0.1:57165_solr c:MissingSegmentRecoveryTest s:shard1  x:MissingSegmentRecoveryTest_shard1_replica2] o.a.s.c.SolrCore [MissingSegmentRecoveryTest_shard1_replica2] Registered new searcher Searcher@4d519d[MissingSegmentRecoveryTest_shard1_replica2] main{ExitableDirectoryReader(UninvertingDirectoryReader())}
   [junit4]   2> 255044 INFO  (qtp10804685-1603) [n:127.0.0.1:57165_solr c:MissingSegmentRecoveryTest s:shard1  x:MissingSegmentRecoveryTest_shard1_replica2] o.a.s.c.ShardLeaderElectionContext Enough replicas found to continue.
   [junit4]   2> 255044 INFO  (qtp10804685-1603) [n:127.0.0.1:57165_solr c:MissingSegmentRecoveryTest s:shard1  x:MissingSegmentRecoveryTest_shard1_replica2] o.a.s.c.ShardLeaderElectionContext I may be the new leader - try and sync
   [junit4]   2> 255044 INFO  (qtp10804685-1603) [n:127.0.0.1:57165_solr c:MissingSegmentRecoveryTest s:shard1  x:MissingSegmentRecoveryTest_shard1_replica2] o.a.s.c.SyncStrategy Sync replicas to https://127.0.0.1:57165/solr/MissingSegmentRecoveryTest_shard1_replica2/
   [junit4]   2> 255044 INFO  (qtp10804685-1603) [n:127.0.0.1:57165_solr c:MissingSegmentRecoveryTest s:shard1  x:MissingSegmentRecoveryTest_shard1_replica2] o.a.s.u.PeerSync PeerSync: core=MissingSegmentRecoveryTest_shard1_replica2 url=https://127.0.0.1:57165/solr START replicas=[https://127.0.0.1:57160/solr/MissingSegmentRecoveryTest_shard1_replica1/] nUpdates=100
   [junit4]   2> 255045 INFO  (qtp10804685-1603) [n:127.0.0.1:57165_solr c:MissingSegmentRecoveryTest s:shard1  x:MissingSegmentRecoveryTest_shard1_replica2] o.a.s.u.PeerSync PeerSync: core=MissingSegmentRecoveryTest_shard1_replica2 url=https://127.0.0.1:57165/solr DONE.  We have no versions.  sync failed.
   [junit4]   2> 255053 INFO  (qtp18874049-1588) [n:127.0.0.1:57160_solr c:MissingSegmentRecoveryTest s:shard1 r:core_node1 x:MissingSegmentRecoveryTest_shard1_replica1] o.a.s.c.S.Request [MissingSegmentRecoveryTest_shard1_replica1]  webapp=/solr path=/get params={distrib=false&qt=/get&fingerprint=false&getVersions=100&wt=javabin&version=2} status=0 QTime=0
   [junit4]   2> 255054 INFO  (qtp10804685-1603) [n:127.0.0.1:57165_solr c:MissingSegmentRecoveryTest s:shard1  x:MissingSegmentRecoveryTest_shard1_replica2] o.a.s.c.SyncStrategy Leader's attempt to sync with shard failed, moving to the next candidate
   [junit4]   2> 255054 INFO  (qtp10804685-1603) [n:127.0.0.1:57165_solr c:MissingSegmentRecoveryTest s:shard1  x:MissingSegmentRecoveryTest_shard1_replica2] o.a.s.c.ShardLeaderElectionContext We failed sync, but we have no versions - we can't sync in that case - we were active before, so become leader anyway
   [junit4]   2> 255061 INFO  (qtp10804685-1603) [n:127.0.0.1:57165_solr c:MissingSegmentRecoveryTest s:shard1  x:MissingSegmentRecoveryTest_shard1_replica2] o.a.s.c.ShardLeaderElectionContext I am the new leader: https://127.0.0.1:57165/solr/MissingSegmentRecoveryTest_shard1_replica2/ shard1
   [junit4]   2> 255168 INFO  (zkCallback-252-thread-1-processing-n:127.0.0.1:57165_solr) [n:127.0.0.1:57165_solr    ] o.a.s.c.c.ZkStateReader A cluster state change: [WatchedEvent state:SyncConnected type:NodeDataChanged path:/collections/MissingSegmentRecoveryTest/state.json] for collection [MissingSegmentRecoveryTest] has occurred - updating... (live nodes size: [2])
   [junit4]   2> 255168 INFO  (zkCallback-251-thread-1-processing-n:127.0.0.1:57160_solr) [n:127.0.0.1:57160_solr    ] o.a.s.c.c.ZkStateReader A cluster state change: [WatchedEvent state:SyncConnected type:NodeDataChanged path:/collections/MissingSegmentRecoveryTest/state.json] for collection [MissingSegmentRecoveryTest] has occurred - updating... (live nodes size: [2])
   [junit4]   2> 255218 INFO  (qtp10804685-1603) [n:127.0.0.1:57165_solr c:MissingSegmentRecoveryTest s:shard1  x:MissingSegmentRecoveryTest_shard1_replica2] o.a.s.c.ZkController I am the leader, no recovery necessary
   [junit4]   2> 255236 INFO  (qtp10804685-1603) [n:127.0.0.1:57165_solr c:MissingSegmentRecoveryTest s:shard1  x:MissingSegmentRecoveryTest_shard1_replica2] o.a.s.s.HttpSolrCall [admin] webapp=null path=/admin/cores params={qt=/admin/cores&collection.configName=conf&newCollection=true&name=MissingSegmentRecoveryTest_shard1_replica2&action=CREATE&numShards=1&collection=MissingSegmentRecoveryTest&shard=shard1&wt=javabin&version=2} status=0 QTime=1355
   [junit4]   2> 255335 INFO  (zkCallback-252-thread-1-processing-n:127.0.0.1:57165_solr) [n:127.0.0.1:57165_solr    ] o.a.s.c.c.ZkStateReader A cluster state change: [WatchedEvent state:SyncConnected type:NodeDataChanged path:/collections/MissingSegmentRecoveryTest/state.json] for collection [MissingSegmentRecoveryTest] has occurred - updating... (live nodes size: [2])
   [junit4]   2> 255335 INFO  (zkCallback-251-thread-2-processing-n:127.0.0.1:57160_solr) [n:127.0.0.1:57160_solr    ] o.a.s.c.c.ZkStateReader A cluster state change: [WatchedEvent state:SyncConnected type:NodeDataChanged path:/collections/MissingSegmentRecoveryTest/state.json] for collection [MissingSegmentRecoveryTest] has occurred - updating... (live nodes size: [2])
   [junit4]   2> 256051 INFO  (qtp18874049-1593) [n:127.0.0.1:57160_solr c:MissingSegmentRecoveryTest s:shard1  x:MissingSegmentRecoveryTest_shard1_replica1] o.a.s.s.HttpSolrCall [admin] webapp=null path=/admin/cores params={qt=/admin/cores&collection.configName=conf&newCollection=true&name=MissingSegmentRecoveryTest_shard1_replica1&action=CREATE&numShards=1&collection=MissingSegmentRecoveryTest&shard=shard1&wt=javabin&version=2} status=0 QTime=2223
   [junit4]   2> 256055 INFO  (qtp18874049-1595) [n:127.0.0.1:57160_solr    ] o.a.s.h.a.CollectionsHandler Wait for new collection to be active for at most 30 seconds. Check all shard replicas
   [junit4]   2> 256152 INFO  (zkCallback-251-thread-1-processing-n:127.0.0.1:57160_solr) [n:127.0.0.1:57160_solr    ] o.a.s.c.c.ZkStateReader A cluster state change: [WatchedEvent state:SyncConnected type:NodeDataChanged path:/collections/MissingSegmentRecoveryTest/state.json] for collection [MissingSegmentRecoveryTest] has occurred - updating... (live nodes size: [2])
   [junit4]   2> 256152 INFO  (zkCallback-252-thread-1-processing-n:127.0.0.1:57165_solr) [n:127.0.0.1:57165_solr    ] o.a.s.c.c.ZkStateReader A cluster state change: [WatchedEvent state:SyncConnected type:NodeDataChanged path:/collections/MissingSegmentRecoveryTest/state.json] for collection [MissingSegmentRecoveryTest] has occurred - updating... (live nodes size: [2])
   [junit4]   2> 257055 INFO  (qtp18874049-1595) [n:127.0.0.1:57160_solr    ] o.a.s.s.HttpSolrCall [admin] webapp=null path=/admin/collections params={replicationFactor=2&collection.configName=conf&maxShardsPerNode=1&name=MissingSegmentRecoveryTest&action=CREATE&numShards=1&wt=javabin&version=2} status=0 QTime=3382
   [junit4]   2> 257095 INFO  (qtp18874049-1606) [n:127.0.0.1:57160_solr c:MissingSegmentRecoveryTest s:shard1 r:core_node1 x:MissingSegmentRecoveryTest_shard1_replica1] o.a.s.u.p.LogUpdateProcessorFactory [MissingSegmentRecoveryTest_shard1_replica1]  webapp=/solr path=/update params={update.distrib=FROMLEADER&distrib.from=https://127.0.0.1:57165/solr/MissingSegmentRecoveryTest_shard1_replica2/&wt=javabin&version=2}{add=[0 (1559568799577931776), 1 (1559568799584223232), 2 (1559568799584223233), 3 (1559568799584223234), 4 (1559568799584223235), 5 (1559568799584223236), 6 (1559568799584223237), 7 (1559568799584223238), 8 (1559568799584223239), 9 (1559568799584223240)]} 0 7
   [junit4]   2> 257096 INFO  (qtp10804685-1598) [n:127.0.0.1:57165_solr c:MissingSegmentRecoveryTest s:shard1 r:core_node2 x:MissingSegmentRecoveryTest_shard1_replica2] o.a.s.u.p.LogUpdateProcessorFactory [MissingSegmentRecoveryTest_shard1_replica2]  webapp=/solr path=/update params={wt=javabin&version=2}{add=[0 (1559568799577931776), 1 (1559568799584223232), 2 (1559568799584223233), 3 (1559568799584223234), 4 (1559568799584223235), 5 (1559568799584223236), 6 (1559568799584223237), 7 (1559568799584223238), 8 (1559568799584223239), 9 (1559568799584223240)]} 0 16
   [junit4]   2> 257102 INFO  (qtp18874049-1607) [n:127.0.0.1:57160_solr c:MissingSegmentRecoveryTest s:shard1 r:core_node1 x:MissingSegmentRecoveryTest_shard1_replica1] o.a.s.u.DirectUpdateHandler2 start commit{,optimize=false,openSearcher=true,waitSearcher=true,expungeDeletes=false,softCommit=false,prepareCommit=false}
   [junit4]   2> 257102 INFO  (qtp18874049-1607) [n:127.0.0.1:57160_solr c:MissingSegmentRecoveryTest s:shard1 r:core_node1 x:MissingSegmentRecoveryTest_shard1_replica1] o.a.s.u.SolrIndexWriter Calling setCommitData with IW:org.apache.solr.update.SolrIndexWriter@e5c8bc
   [junit4]   2> 257128 INFO  (qtp10804685-1601) [n:127.0.0.1:57165_solr c:MissingSegmentRecoveryTest s:shard1 r:core_node2 x:MissingSegmentRecoveryTest_shard1_replica2] o.a.s.u.DirectUpdateHandler2 start commit{,optimize=false,openSearcher=true,waitSearcher=true,expungeDeletes=false,softCommit=false,prepareCommit=false}
   [junit4]   2> 257128 INFO  (qtp10804685-1601) [n:127.0.0.1:57165_solr c:MissingSegmentRecoveryTest s:shard1 r:core_node2 x:MissingSegmentRecoveryTest_shard1_replica2] o.a.s.u.SolrIndexWriter Calling setCommitData with IW:org.apache.solr.update.SolrIndexWriter@82e945
   [junit4]   2> 257130 INFO  (qtp18874049-1607) [n:127.0.0.1:57160_solr c:MissingSegmentRecoveryTest s:shard1 r:core_node1 x:MissingSegmentRecoveryTest_shard1_replica1] o.a.s.s.SolrIndexSearcher Opening [Searcher@fa5e34[MissingSegmentRecoveryTest_shard1_replica1] main]
   [junit4]   2> 257130 INFO  (qtp18874049-1607) [n:127.0.0.1:57160_solr c:MissingSegmentRecoveryTest s:shard1 r:core_node1 x:MissingSegmentRecoveryTest_shard1_replica1] o.a.s.u.DirectUpdateHandler2 end_commit_flush
   [junit4]   2> 257130 INFO  (searcherExecutor-704-thread-1-processing-n:127.0.0.1:57160_solr x:MissingSegmentRecoveryTest_shard1_replica1 s:shard1 c:MissingSegmentRecoveryTest r:core_node1) [n:127.0.0.1:57160_solr c:MissingSegmentRecoveryTest s:shard1 r:core_node1 x:MissingSegmentRecoveryTest_shard1_replica1] o.a.s.c.SolrCore [MissingSegmentRecoveryTest_shard1_replica1] Registered new searcher Searcher@fa5e34[MissingSegmentRecoveryTest_shard1_replica1] main{ExitableDirectoryReader(UninvertingDirectoryReader(Uninverting(_0(7.0.0):C10)))}
   [junit4]   2> 257130 INFO  (qtp18874049-1607) [n:127.0.0.1:57160_solr c:MissingSegmentRecoveryTest s:shard1 r:core_node1 x:MissingSegmentRecoveryTest_shard1_replica1] o.a.s.u.p.LogUpdateProcessorFactory [MissingSegmentRecoveryTest_shard1_replica1]  webapp=/solr path=/update params={update.distrib=FROMLEADER&waitSearcher=true&openSearcher=true&commit=true&softCommit=false&distrib.from=https://127.0.0.1:57165/solr/MissingSegmentRecoveryTest_shard1_replica2/&commit_end_point=true&wt=javabin&version=2&expungeDeletes=false}{commit=} 0 28
   [junit4]   2> 257153 INFO  (qtp10804685-1601) [n:127.0.0.1:57165_solr c:MissingSegmentRecoveryTest s:shard1 r:core_node2 x:MissingSegmentRecoveryTest_shard1_replica2] o.a.s.s.SolrIndexSearcher Opening [Searcher@1fd84f2[MissingSegmentRecoveryTest_shard1_replica2] main]
   [junit4]   2> 257153 INFO  (qtp10804685-1601) [n:127.0.0.1:57165_solr c:MissingSegmentRecoveryTest s:shard1 r:core_node2 x:MissingSegmentRecoveryTest_shard1_replica2] o.a.s.u.DirectUpdateHandler2 end_commit_flush
   [junit4]   2> 257153 INFO  (searcherExecutor-705-thread-1-processing-n:127.0.0.1:57165_solr x:MissingSegmentRecoveryTest_shard1_replica2 s:shard1 c:MissingSegmentRecoveryTest r:core_node2) [n:127.0.0.1:57165_solr c:MissingSegmentRecoveryTest s:shard1 r:core_node2 x:MissingSegmentRecoveryTest_shard1_replica2] o.a.s.c.SolrCore [MissingSegmentRecoveryTest_shard1_replica2] Registered new searcher Searcher@1fd84f2[MissingSegmentRecoveryTest_shard1_replica2] main{ExitableDirectoryReader(UninvertingDirectoryReader(Uninverting(_0(7.0.0):C10)))}
   [junit4]   2> 257153 INFO  (qtp10804685-1601) [n:127.0.0.1:57165_solr c:MissingSegmentRecoveryTest s:shard1 r:core_node2 x:MissingSegmentRecoveryTest_shard1_replica2] o.a.s.u.p.LogUpdateProcessorFactory [MissingSegmentRecoveryTest_shard1_replica2]  webapp=/solr path=/update params={update.distrib=FROMLEADER&waitSearcher=true&openSearcher=true&commit=true&softCommit=false&distrib.from=https://127.0.0.1:57165/solr/MissingSegmentRecoveryTest_shard1_replica2/&commit_end_point=true&wt=javabin&version=2&expungeDeletes=false}{commit=} 0 25
   [junit4]   2> 257154 INFO  (qtp10804685-1597) [n:127.0.0.1:57165_solr c:MissingSegmentRecoveryTest s:shard1 r:core_node2 x:MissingSegmentRecoveryTest_shard1_replica2] o.a.s.u.p.LogUpdateProcessorFactory [MissingSegmentRecoveryTest_shard1_replica2]  webapp=/solr path=/update params={_stateVer_=MissingSegmentRecoveryTest:4&waitSearcher=true&commit=true&softCommit=false&wt=javabin&version=2}{commit=} 0 55
   [junit4]   2> 257163 INFO  (TEST-MissingSegmentRecoveryTest.testLeaderRecovery-seed#[A3AC04D7F106F40E]) [    ] o.e.j.s.AbstractConnector Stopped ServerConnector@13a2de7{SSL,[ssl, http/1.1]}{127.0.0.1:0}
   [junit4]   2> 257164 INFO  (TEST-MissingSegmentRecoveryTest.testLeaderRecovery-seed#[A3AC04D7F106F40E]) [    ] o.a.s.c.CoreContainer Shutting down CoreContainer instance=22939648
   [junit4]   2> 257166 INFO  (coreCloseExecutor-714-thread-1) [n:127.0.0.1:57160_solr c:MissingSegmentRecoveryTest s:shard1 r:core_node1 x:MissingSegmentRecoveryTest_shard1_replica1] o.a.s.c.SolrCore [MissingSegmentRecoveryTest_shard1_replica1]  CLOSING SolrCore org.apache.solr.core.SolrCore@14f7d13
   [junit4]   2> 257170 INFO  (coreCloseExecutor-714-thread-1) [n:127.0.0.1:57160_solr c:MissingSegmentRecoveryTest s:shard1 r:core_node1 x:MissingSegmentRecoveryTest_shard1_replica1] o.a.s.m.SolrMetricManager Closing metric reporters for: solr.core.MissingSegmentRecoveryTest.shard1.replica1
   [junit4]   2> 257173 INFO  (TEST-MissingSegmentRecoveryTest.testLeaderRecovery-seed#[A3AC04D7F106F40E]) [    ] o.a.s.c.Overseer Overseer (id=97473049706692613-127.0.0.1:57160_solr-n_0000000000) closing
   [junit4]   2> 257173 INFO  (OverseerStateUpdate-97473049706692613-127.0.0.1:57160_solr-n_0000000000) [n:127.0.0.1:57160_solr    ] o.a.s.c.Overseer Overseer Loop exiting : 127.0.0.1:57160_solr
   [junit4]   2> 257177 WARN  (NIOServerCxn.Factory:0.0.0.0/0.0.0.0:0) [    ] o.a.z.s.NIOServerCnxn caught end of stream exception
   [junit4]   2> EndOfStreamException: Unable to read additional data from client sessionid 0x15a4b38e6f10005, likely client has closed socket
   [junit4]   2> 	at org.apache.zookeeper.server.NIOServerCnxn.doIO(NIOServerCnxn.java:228)
   [junit4]   2> 	at org.apache.zookeeper.server.NIOServerCnxnFactory.run(NIOServerCnxnFactory.java:208)
   [junit4]   2> 	at java.lang.Thread.run(Thread.java:745)
   [junit4]   2> 257177 WARN  (zkCallback-251-thread-2-processing-n:127.0.0.1:57160_solr) [n:127.0.0.1:57160_solr    ] o.a.s.c.c.ZkStateReader ZooKeeper watch triggered, but Solr cannot talk to ZK: [KeeperErrorCode = Session expired for /live_nodes]
   [junit4]   2> 257178 INFO  (TEST-MissingSegmentRecoveryTest.testLeaderRecovery-seed#[A3AC04D7F106F40E]) [    ] o.a.s.m.SolrMetricManager Closing metric reporters for: solr.node
   [junit4]   2> 257179 INFO  (TEST-MissingSegmentRecoveryTest.testLeaderRecovery-seed#[A3AC04D7F106F40E]) [    ] o.e.j.s.h.ContextHandler Stopped o.e.j.s.ServletContextHandler@a76e7a{/solr,null,UNAVAILABLE}
   [junit4]   2> 257180 INFO  (zkCallback-252-thread-1-processing-n:127.0.0.1:57165_solr) [n:127.0.0.1:57165_solr    ] o.a.s.c.c.ZkStateReader Updated live nodes from ZooKeeper... (2) -> (1)
   [junit4]   2> 257180 INFO  (zkCallback-252-thread-2-processing-n:127.0.0.1:57165_solr) [n:127.0.0.1:57165_solr    ] o.a.s.c.OverseerElectionContext I am going to be the leader 127.0.0.1:57165_solr
   [junit4]   2> 257180 INFO  (zkCallback-258-thread-1) [    ] o.a.s.c.c.ZkStateReader Updated live nodes from ZooKeeper... (2) -> (1)
   [junit4]   2> 257183 INFO  (zkCallback-252-thread-2-processing-n:127.0.0.1:57165_solr) [n:127.0.0.1:57165_solr    ] o.a.s.c.Overseer Overseer (id=97473049706692614-127.0.0.1:57165_solr-n_0000000001) starting
   [junit4]   2> 257186 INFO  (TEST-MissingSegmentRecoveryTest.testLeaderRecovery-seed#[A3AC04D7F106F40E]) [    ] o.e.j.s.Server jetty-9.3.14.v20161028
   [junit4]   2> 257188 INFO  (TEST-MissingSegmentRecoveryTest.testLeaderRecovery-seed#[A3AC04D7F106F40E]) [    ] o.e.j.s.h.ContextHandler Started o.e.j.s.ServletContextHandler@15d6e43{/solr,null,AVAILABLE}
   [junit4]   2> 257189 INFO  (TEST-MissingSegmentRecoveryTest.testLeaderRecovery-seed#[A3AC04D7F106F40E]) [    ] o.e.j.s.AbstractConnector Started ServerConnector@1d9ff03{SSL,[ssl, http/1.1]}{127.0.0.1:57160}
   [junit4]   2> 257190 INFO  (TEST-MissingSegmentRecoveryTest.testLeaderRecovery-seed#[A3AC04D7F106F40E]) [    ] o.e.j.s.Server Started @262160ms
   [junit4]   2> 257190 INFO  (TEST-MissingSegmentRecoveryTest.testLeaderRecovery-seed#[A3AC04D7F106F40E]) [    ] o.a.s.c.s.e.JettySolrRunner Jetty properties: {hostContext=/solr, hostPort=57160}
   [junit4]   2> 257190 ERROR (TEST-MissingSegmentRecoveryTest.testLeaderRecovery-seed#[A3AC04D7F106F40E]) [    ] o.a.s.s.StartupLoggingUtils Missing Java Option solr.log.dir. Logging may be missing or incomplete.
   [junit4]   2> 257191 INFO  (TEST-MissingSegmentRecoveryTest.testLeaderRecovery-seed#[A3AC04D7F106F40E]) [    ] o.a.s.s.SolrDispatchFilter  ___      _       Welcome to Apache Solr™ version 7.0.0
   [junit4]   2> 257191 INFO  (TEST-MissingSegmentRecoveryTest.testLeaderRecovery-seed#[A3AC04D7F106F40E]) [    ] o.a.s.s.SolrDispatchFilter / __| ___| |_ _   Starting in cloud mode on port null
   [junit4]   2> 257191 INFO  (TEST-MissingSegmentRecoveryTest.testLeaderRecovery-seed#[A3AC04D7F106F40E]) [    ] o.a.s.s.SolrDispatchFilter \__ \/ _ \ | '_|  Install dir: null
   [junit4]   2> 257191 INFO  (TEST-MissingSegmentRecoveryTest.testLeaderRecovery-seed#[A3AC04D7F106F40E]) [    ] o.a.s.s.SolrDispatchFilter |___/\___/_|_|    Start time: 2017-02-17T08:38:28.938Z
   [junit4]   2> 257198 INFO  (TEST-MissingSegmentRecoveryTest.testLeaderRecovery-seed#[A3AC04D7F106F40E]) [    ] o.a.s.s.SolrDispatchFilter solr.xml found in ZooKeeper. Loading...
   [junit4]   2> 257209 INFO  (zkCallback-252-thread-2-processing-n:127.0.0.1:57165_solr) [n:127.0.0.1:57165_solr    ] o.a.s.c.c.ZkStateReader A cluster state change: [WatchedEvent state:SyncConnected type:NodeDataChanged path:/collections/MissingSegmentRecoveryTest/state.json] for collection [MissingSegmentRecoveryTest] has occurred - updating... (live nodes size: [1])
   [junit4]   2> 257226 INFO  (TEST-MissingSegmentRecoveryTest.testLeaderRecovery-seed#[A3AC04D7F106F40E]) [    ] o.a.s.c.ZkContainer Zookeeper client=127.0.0.1:57156/solr
   [junit4]   2> 257247 INFO  (TEST-MissingSegmentRecoveryTest.testLeaderRecovery-seed#[A3AC04D7F106F40E]) [n:127.0.0.1:57160_solr    ] o.a.s.c.c.ZkStateReader Updated live nodes from ZooKeeper... (0) -> (1)
   [junit4]   2> 257251 INFO  (TEST-MissingSegmentRecoveryTest.testLeaderRecovery-seed#[A3AC04D7F106F40E]) [n:127.0.0.1:57160_solr    ] o.a.s.c.Overseer Overseer (id=null) closing
   [junit4]   2> 257254 INFO  (TEST-MissingSegmentRecoveryTest.testLeaderRecovery-seed#[A3AC04D7F106F40E]) [n:127.0.0.1:57160_solr    ] o.a.s.c.ZkController Register node as live in ZooKeeper:/live_nodes/127.0.0.1:57160_solr
   [junit4]   2> 257256 INFO  (zkCallback-252-thread-2-processing-n:127.0.0.1:57165_solr) [n:127.0.0.1:57165_solr    ] o.a.s.c.c.ZkStateReader Updated live nodes from ZooKeeper... (1) -> (2)
   [junit4]   2> 257257 INFO  (zkCallback-258-thread-1) [    ] o.a.s.c.c.ZkStateReader Updated live nodes from ZooKeeper... (1) -> (2)
   [junit4]   2> 257258 INFO  (zkCallback-263-thread-1-processing-n:127.0.0.1:57160_solr) [n:127.0.0.1:57160_solr    ] o.a.s.c.c.ZkStateReader Updated live nodes from ZooKeeper... (1) -> (2)
   [junit4]   2> 257363 INFO  (zkCallback-252-thread-2-processing-n:127.0.0.1:57165_solr) [n:127.0.0.1:57165_solr    ] o.a.s.c.c.ZkStateReader A cluster state change: [WatchedEvent state:SyncConnected type:NodeDataChanged path:/collections/MissingSegmentRecoveryTest/state.json] for collection [MissingSegmentRecoveryTest] has occurred - updating... (live nodes size: [2])
   [junit4]   2> 257474 INFO  (TEST-MissingSegmentRecoveryTest.testLeaderRecovery-seed#[A3AC04D7F106F40E]) [n:127.0.0.1:57160_solr    ] o.a.s.c.CorePropertiesLocator Found 1 core definitions underneath C:\Users\jenkins\workspace\Lucene-Solr-master-Windows\solr\build\solr-core\test\J0\temp\solr.cloud.MissingSegmentRecoveryTest_A3AC04D7F106F40E-001\tempDir-001\node2\.
   [junit4]   2> 257474 INFO  (TEST-MissingSegmentRecoveryTest.testLeaderRecovery-seed#[A3AC04D7F106F40E]) [n:127.0.0.1:57160_solr    ] o.a.s.c.CorePropertiesLocator Cores are: [MissingSegmentRecoveryTest_shard1_replica1]
   [junit4]   2> 257614 INFO  (coreLoadExecutor-723-thread-1-processing-n:127.0.0.1:57160_solr) [n:127.0.0.1:57160_solr c:MissingSegmentRecoveryTest s:shard1 r:core_node1 x:MissingSegmentRecoveryTest_shard1_replica1] o.a.s.c.SolrConfig Using Lucene MatchVersion: 7.0.0
   [junit4]   2> 257622 INFO  (coreLoadExecutor-723-thread-1-processing-n:127.0.0.1:57160_solr) [n:127.0.0.1:57160_solr c:MissingSegmentRecoveryTest s:shard1 r:core_node1 x:MissingSegmentRecoveryTest_shard1_replica1] o.a.s.s.IndexSchema [MissingSegmentRecoveryTest_shard1_replica1] Schema name=minimal
   [junit4]   2> 257629 INFO  (coreLoadExecutor-723-thread-1-processing-n:127.0.0.1:57160_solr) [n:127.0.0.1:57160_solr c:MissingSegmentRecoveryTest s:shard1 r:core_node1 x:MissingSegmentRecoveryTest_shard1_replica1] o.a.s.s.IndexSchema Loaded schema minimal/1.1 with uniqueid field id
   [junit4]   2> 257635 INFO  (coreLoadExecutor-723-thread-1-processing-n:127.0.0.1:57160_solr) [n:127.0.0.1:57160_solr c:MissingSegmentRecoveryTest s:shard1 r:core_node1 x:MissingSegmentRecoveryTest_shard1_replica1] o.a.s.c.CoreContainer Creating SolrCore 'MissingSegmentRecoveryTest_shard1_replica1' using configuration from collection MissingSegmentRecoveryTest
   [junit4]   2> 257640 INFO  (coreLoadExecutor-723-thread-1-processing-n:127.0.0.1:57160_solr) [n:127.0.0.1:57160_solr c:MissingSegmentRecoveryTest s:shard1 r:core_node1 x:MissingSegmentRecoveryTest_shard1_replica1] o.a.s.c.SolrCore [[MissingSegmentRecoveryTest_shard1_replica1] ] Opening new SolrCore at [C:\Users\jenkins\workspace\Lucene-Solr-master-Windows\solr\build\solr-core\test\J0\temp\solr.cloud.MissingSegmentRecoveryTest_A3AC04D7F106F40E-001\tempDir-001\node2\MissingSegmentRecoveryTest_shard1_replica1], dataDir=[C:\Users\jenkins\workspace\Lucene-Solr-master-Windows\solr\build\solr-core\test\J0\temp\solr.cloud.MissingSegmentRecoveryTest_A3AC04D7F106F40E-001\tempDir-001\node2\.\MissingSegmentRecoveryTest_shard1_replica1\data\]
   [junit4]   2> 257695 INFO  (zkCallback-252-thread-3-processing-n:127.0.0.1:57165_solr) [n:127.0.0.1:57165_solr    ] o.a.s.c.c.ZkStateReader A cluster state change: [WatchedEvent state:SyncConnected type:NodeDataChanged path:/collections/MissingSegmentRecoveryTest/state.json] for collection [MissingSegmentRecoveryTest] has occurred - updating... (live nodes size: [2])
   [junit4]   2> 257697 INFO  (zkCallback-263-thread-1-processing-n:127.0.0.1:57160_solr) [n:127.0.0.1:57160_solr    ] o.a.s.c.c.ZkStateReader A cluster state change: [WatchedEvent state:SyncConnected type:NodeDataChanged path:/collections/MissingSegmentRecoveryTest/state.json] for collection [MissingSegmentRecoveryTest] has occurred - updating... (live nodes size: [2])
   [junit4]   2> 257799 INFO  (coreLoadExecutor-723-thread-1-processing-n:127.0.0.1:57160_solr) [n:127.0.0.1:57160_solr c:MissingSegmentRecoveryTest s:shard1 r:core_node1 x:MissingSegmentRecoveryTest_shard1_replica1] o.a.s.u.UpdateHandler Using UpdateLog implementation: org.apache.solr.update.UpdateLog
   [junit4]   2> 257799 INFO  (coreLoadExecutor-723-thread-1-processing-n:127.0.0.1:57160_solr) [n:127.0.0.1:57160_solr c:MissingSegmentRecoveryTest s:shard1 r:core_node1 x:MissingSegmentRecoveryTest_shard1_replica1] o.a.s.u.UpdateLog Initializing UpdateLog: dataDir=null defaultSyncLevel=FLUSH numRecordsToKeep=100 maxNumLogsToKeep=10 numVersionBuckets=65536
   [junit4]   2> 257802 INFO  (coreLoadExecutor-723-thread-1-processing-n:127.0.0.1:57160_solr) [n:127.0.0.1:57160_solr c:MissingSegmentRecoveryTest s:shard1 r:core_node1 x:MissingSegmentRecoveryTest_shard1_replica1] o.a.s.u.CommitTracker Hard AutoCommit: disabled
   [junit4]   2> 257802 INFO  (coreLoadExecutor-723-thread-1-processing-n:127.0.0.1:57160_solr) [n:127.0.0.1:57160_solr c:MissingSegmentRecoveryTest s:shard1 r:core_node1 x:MissingSegmentRecoveryTest_shard1_replica1] o.a.s.u.CommitTracker Soft AutoCommit: disabled
   [junit4]   2> 257808 INFO  (coreLoadExecutor-723-thread-1-processing-n:127.0.0.1:57160_solr) [n:127.0.0.1:57160_solr c:MissingSegmentRecoveryTest s:shard1 r:core_node1 x:MissingSegmentRecoveryTest_shard1_replica1] o.a.s.c.SolrCore [MissingSegmentRecoveryTest_shard1_replica1]  CLOSING SolrCore org.apache.solr.core.SolrCore@a774e0
   [junit4]   2> 257809 INFO  (coreLoadExecutor-723-thread-1-processing-n:127.0.0.1:57160_solr) [n:127.0.0.1:57160_solr c:MissingSegmentRecoveryTest s:shard1 r:core_node1 x:MissingSegmentRecoveryTest_shard1_replica1] o.a.s.m.SolrMetricManager Closing metric reporters for: solr.core.MissingSegmentRecoveryTest.shard1.replica1
   [junit4]   2> 257820 INFO  (coreLoadExecutor-723-thread-1-processing-n:127.0.0.1:57160_solr) [n:127.0.0.1:57160_solr c:MissingSegmentRecoveryTest s:shard1 r:core_node1 x:MissingSegmentRecoveryTest_shard1_replica1] o.a.s.c.CoreContainer Found active leader, will attempt to create fresh core and recover.
   [junit4]   2> 257820 INFO  (coreLoadExecutor-723-thread-1-processing-n:127.0.0.1:57160_solr) [n:127.0.0.1:57160_solr c:MissingSegmentRecoveryTest s:shard1 r:core_node1 x:MissingSegmentRecoveryTest_shard1_replica1] o.a.s.c.SolrCore Updating index properties... index=index.20170217150829567
   [junit4]   2> 257827 INFO  (coreLoadExecutor-723-thread-1-processing-n:127.0.0.1:57160_solr) [n:127.0.0.1:57160_solr c:MissingSegmentRecoveryTest s:shard1 r:core_node1 x:MissingSegmentRecoveryTest_shard1_replica1] o.a.s.c.SolrCore [[MissingSegmentRecoveryTest_shard1_replica1] ] Opening new SolrCore at [C:\Users\jenkins\workspace\Lucene-Solr-master-Windows\solr\build\solr-core\test\J0\temp\solr.cloud.MissingSegmentRecoveryTest_A3AC04D7F106F40E-001\tempDir-001\node2\MissingSegmentRecoveryTest_shard1_replica1], dataDir=[C:\Users\jenkins\workspace\Lucene-Solr-master-Windows\solr\build\solr-core\test\J0\temp\solr.cloud.MissingSegmentRecoveryTest_A3AC04D7F106F40E-001\tempDir-001\node2\.\MissingSegmentRecoveryTest_shard1_replica1\data\]
   [junit4]   2> 257850 INFO  (OldIndexDirectoryCleanupThreadForCore-MissingSegmentRecoveryTest_shard1_replica1) [n:127.0.0.1:57160_solr c:MissingSegmentRecoveryTest s:shard1 r:core_node1 x:MissingSegmentRecoveryTest_shard1_replica1] o.a.s.c.DirectoryFactory Found 1 old index directories to clean-up under C:\Users\jenkins\workspace\Lucene-Solr-master-Windows\solr\build\solr-core\test\J0\temp\solr.cloud.MissingSegmentRecoveryTest_A3AC04D7F106F40E-001\tempDir-001\node2\.\MissingSegmentRecoveryTest_shard1_replica1\data\ afterReload=false
   [junit4]   2> 257865 INFO  (OldIndexDirectoryCleanupThreadForCore-MissingSegmentRecoveryTest_shard1_replica1) [n:127.0.0.1:57160_solr c:MissingSegmentRecoveryTest s:shard1 r:core_node1 x:MissingSegmentRecoveryTest_shard1_replica1] o.a.s.c.DirectoryFactory Deleted old index directory: C:\Users\jenkins\workspace\Lucene-Solr-master-Windows\solr\build\solr-core\test\J0\temp\solr.cloud.MissingSegmentRecoveryTest_A3AC04D7F106F40E-001\tempDir-001\node2\.\MissingSegmentRecoveryTest_shard1_replica1\data\index.20170217150829567
   [junit4]   2> 257926 INFO  (OldIndexDirectoryCleanupThreadForCore-MissingSegmentRecoveryTest_shard1_replica1) [n:127.0.0.1:57160_solr c:MissingSegmentRecoveryTest s:shard1 r:core_node1 x:MissingSegmentRecoveryTest_shard1_replica1] o.a.s.c.DirectoryFactory Found 1 old index directories to clean-up under C:\Users\jenkins\workspace\Lucene-Solr-master-Windows\solr\build\solr-core\test\J0\temp\solr.cloud.MissingSegmentRecoveryTest_A3AC04D7F106F40E-001\tempDir-001\node2\.\MissingSegmentRecoveryTest_shard1_replica1\data\ afterReload=false
   [junit4]   2> 257952 INFO  (OldIndexDirectoryCleanupThreadForCore-MissingSegmentRecoveryTest_shard1_replica1) [n:127.0.0.1:57160_solr c:MissingSegmentRecoveryTest s:shard1 r:core_node1 x:MissingSegmentRecoveryTest_shard1_replica1] o.a.s.c.DirectoryFactory Deleted old index directory: C:\Users\jenkins\workspace\Lucene-Solr-master-Windows\solr\build\solr-core\test\J0\temp\solr.cloud.MissingSegmentRecoveryTest_A3AC04D7F106F40E-001\tempDir-001\node2\.\MissingSegmentRecoveryTest_shard1_replica1\data\index
   [junit4]   2> 258009 INFO  (coreLoadExecutor-723-thread-1-processing-n:127.0.0.1:57160_solr) [n:127.0.0.1:57160_solr c:MissingSegmentRecoveryTest s:shard1 r:core_node1 x:MissingSegmentRecoveryTest_shard1_replica1] o.a.s.u.UpdateHandler Using UpdateLog implementation: org.apache.solr.update.UpdateLog
   [junit4]   2> 258009 INFO  (coreLoadExecutor-723-thread-1-processing-n:127.0.0.1:57160_solr) [n:127.0.0.1:57160_solr c:MissingSegmentRecoveryTest s:shard1 r:core_node1 x:MissingSegmentRecoveryTest_shard1_replica1] o.a.s.u.UpdateLog Initializing UpdateLog: dataDir=null defaultSyncLevel=FLUSH numRecordsToKeep=100 maxNumLogsToKeep=10 numVersionBuckets=65536
   [junit4]   2> 258013 INFO  (coreLoadExecutor-723-thread-1-processing-n:127.0.0.1:57160_solr) [n:127.0.0.1:57160_solr c:MissingSegmentRecoveryTest s:shard1 r:core_node1 x:MissingSegmentRecoveryTest_shard1_replica1] o.a.s.u.CommitTracker Hard AutoCommit: disabled
   [junit4]   2> 258013 INFO  (coreLoadExecutor-723-thread-1-processing-n:127.0.0.1:57160_solr) [n:127.0.0.1:57160_solr c:MissingSegmentRecoveryTest s:shard1 r:core_node1 x:MissingSegmentRecoveryTest_shard1_replica1] o.a.s.u.CommitTracker Soft AutoCommit: disabled
   [junit4]   2> 258022 INFO  (coreLoadExecutor-723-thread-1-processing-n:127.0.0.1:57160_solr) [n:127.0.0.1:57160_solr c:MissingSegmentRecoveryTest s:shard1 r:core_node1 x:MissingSegmentRecoveryTest_shard1_replica1] o.a.s.c.SolrCore [MissingSegmentRecoveryTest_shard1_replica1]  CLOSING SolrCore org.apache.solr.core.SolrCore@1230a87
   [junit4]   2> 258023 INFO  (coreLoadExecutor-723-thread-1-processing-n:127.0.0.1:57160_solr) [n:127.0.0.1:57160_solr c:MissingSegmentRecoveryTest s:shard1 r:core_node1 x:MissingSegmentRecoveryTest_shard1_replica1] o.a.s.m.SolrMetricManager Closing metric reporters for: solr.core.MissingSegmentRecoveryTest.shard1.replica1
   [junit4]   2> 258029 ERROR (coreContainerWorkExecutor-719-thread-1-processing-n:127.0.0.1:57160_solr) [n:127.0.0.1:57160_solr    ] o.a.s.c.CoreContainer Error waiting for SolrCore to be created
   [junit4]   2> java.util.concurrent.ExecutionException: org.apache.solr.common.SolrException: Unable to create core [MissingSegmentRecoveryTest_shard1_replica1]
   [junit4]   2> 	at java.util.concurrent.FutureTask.report(FutureTask.java:122)
   [junit4]   2> 	at java.util.concurrent.FutureTask.get(FutureTask.java:192)
   [junit4]   2> 	at org.apache.solr.core.CoreContainer.lambda$load$4(CoreContainer.java:600)
   [junit4]   2> 	at com.codahale.metrics.InstrumentedExecutorService$InstrumentedRunnable.run(InstrumentedExecutorService.java:176)
   [junit4]   2> 	at java.util.concurrent.Executors$RunnableAdapter.call(Executors.java:511)
   [junit4]   2> 	at java.util.concurrent.FutureTask.run(FutureTask.java:266)
   [junit4]   2> 	at org.apache.solr.common.util.ExecutorUtil$MDCAwareThreadPoolExecutor.lambda$execute$0(ExecutorUtil.java:229)
   [junit4]   2> 	at java.util.concurrent.ThreadPoolExecutor.runWorker(ThreadPoolExecutor.java:1142)
   [junit4]   2> 	at java.util.concurrent.ThreadPoolExecutor$Worker.run(ThreadPoolExecutor.java:617)
   [junit4]   2> 	at java.lang.Thread.run(Thread.java:745)
   [junit4]   2> Caused by: org.apache.solr.common.SolrException: Unable to create core [MissingSegmentRecoveryTest_shard1_replica1]
   [junit4]   2> 	at org.apache.solr.core.CoreContainer.create(CoreContainer.java:952)
   [junit4]   2> 	at org.apache.solr.core.CoreContainer.lambda$load$3(CoreContainer.java:572)
   [junit4]   2> 	at com.codahale.metrics.InstrumentedExecutorService$InstrumentedCallable.call(InstrumentedExecutorService.java:197)
   [junit4]   2> 	... 5 more
   [junit4]   2> Caused by: org.apache.solr.common.SolrException: Error opening new searcher
   [junit4]   2> 	at org.apache.solr.core.SolrCore.<init>(SolrCore.java:964)
   [junit4]   2> 	at org.apache.solr.core.SolrCore.<init>(SolrCore.java:828)
   [junit4]   2> 	at org.apache.solr.core.CoreContainer.processCoreCreateException(CoreContainer.java:1011)
   [junit4]   2> 	at org.apache.solr.core.CoreContainer.create(CoreContainer.java:939)
   [junit4]   2> 	... 7 more
   [junit4]   2> 	Suppressed: org.apache.solr.common.SolrException: Error opening new searcher
   [junit4]   2> 		at org.apache.solr.core.SolrCore.<init>(SolrCore.java:964)
   [junit4]   2> 		at org.apache.solr.core.SolrCore.<init>(SolrCore.java:828)
   [junit4]   2> 		at org.apache.solr.core.CoreContainer.create(CoreContainer.java:937)
   [junit4]   2> 		... 7 more
   [junit4]   2> 	Caused by: org.apache.solr.common.SolrException: Error opening new searcher
   [junit4]   2> 		at org.apache.solr.core.SolrCore.openNewSearcher(SolrCore.java:2002)
   [junit4]   2> 		at org.apache.solr.core.SolrCore.getSearcher(SolrCore.java:2122)
   [junit4]   2> 		at org.apache.solr.core.SolrCore.initSearcher(SolrCore.java:1053)
   [junit4]   2> 		at org.apache.solr.core.SolrCore.<init>(SolrCore.java:937)
   [junit4]   2> 		... 9 more
   [junit4]   2> 	Caused by: org.apache.lucene.index.CorruptIndexException: Unexpected file read error while reading index. (resource=BufferedChecksumIndexInput(SimpleFSIndexInput(path="C:\Users\jenkins\workspace\Lucene-Solr-master-Windows\solr\build\solr-core\test\J0\temp\solr.cloud.MissingSegmentRecoveryTest_A3AC04D7F106F40E-001\tempDir-001\node2\MissingSegmentRecoveryTest_shard1_replica1\data\index\segments_2")))
   [junit4]   2> 		at org.apache.lucene.index.SegmentInfos.readCommit(SegmentInfos.java:286)
   [junit4]   2> 		at org.apache.lucene.index.IndexWriter.<init>(IndexWriter.java:938)
   [junit4]   2> 		at org.apache.solr.update.SolrIndexWriter.<init>(SolrIndexWriter.java:125)
   [junit4]   2> 		at org.apache.solr.update.SolrIndexWriter.create(SolrIndexWriter.java:100)
   [junit4]   2> 		at org.apache.solr.update.DefaultSolrCoreState.createMainIndexWriter(DefaultSolrCoreState.java:240)
   [junit4]   2> 		at org.apache.solr.update.DefaultSolrCoreState.getIndexWriter(DefaultSolrCoreState.java:114)
   [junit4]   2> 		at org.apache.solr.core.SolrCore.openNewSearcher(SolrCore.java:1963)
   [junit4]   2> 		... 12 more
   [junit4]   2> 	Caused by: java.io.EOFException: read past EOF: SimpleFSIndexInput(path="C:\Users\jenkins\workspace\Lucene-Solr-master-Windows\solr\build\solr-core\test\J0\temp\solr.cloud.MissingSegmentRecoveryTest_A3AC04D7F106F40E-001\tempDir-001\node2\MissingSegmentRecoveryTest_shard1_replica1\data\index\segments_2")
   [junit4]   2> 		at org.apache.lucene.store.BufferedIndexInput.refill(BufferedIndexInput.java:336)
   [junit4]   2> 		at org.apache.lucene.store.BufferedIndexInput.readByte(BufferedIndexInput.java:54)
   [junit4]   2> 		at org.apache.lucene.store.BufferedChecksumIndexInput.readByte(BufferedChecksumIndexInput.java:41)
   [junit4]   2> 		at org.apache.lucene.store.DataInput.readInt(DataInput.java:101)
   [junit4]   2> 		at org.apache.lucene.index.SegmentInfos.readCommit(SegmentInfos.java:296)
   [junit4]   2> 		at org.apache.lucene.index.SegmentInfos.readCommit(SegmentInfos.java:284)
   [junit4]   2> 		... 18 more
   [junit4]   2> Caused by: org.apache.solr.common.SolrException: Error opening new searcher
   [junit4]   2> 	at org.apache.solr.core.SolrCore.openNewSearcher(SolrCore.java:2002)
   [junit4]   2> 	at org.apache.solr.core.SolrCore.getSearcher(SolrCore.java:2122)
   [junit4]   2> 	at org.apache.solr.core.SolrCore.initSearcher(SolrCore.java:1053)
   [junit4]   2> 	at org.apache.solr.core.SolrCore.<init>(SolrCore.java:937)
   [junit4]   2> 	... 10 more
   [junit4]   2> Caused by: org.apache.lucene.index.IndexNotFoundException: no segments* file found in LockValidatingDirectoryWrapper(MetricsDirectory(SimpleFSDirectory@C:\Users\jenkins\workspace\Lucene-Solr-master-Windows\solr\build\solr-core\test\J0\temp\solr.cloud.MissingSegmentRecoveryTest_A3AC04D7F106F40E-001\tempDir-001\node2\MissingSegmentRecoveryTest_shard1_replica1\data\index.20170217150829567 lockFactory=org.apache.lucene.store.NativeFSLockFactory@1f6616b)): files: [write.lock]
   [junit4]   2> 	at org.apache.lucene.index.IndexWriter.<init>(IndexWriter.java:933)
   [junit4]   2> 	at org.apache.solr.update.SolrIndexWriter.<init>(SolrIndexWriter.java:125)
   [junit4]   2> 	at org.apache.solr.update.SolrIndexWriter.create(SolrIndexWriter.java:100)
   [junit4]   2> 	at org.apache.solr.update.DefaultSolrCoreState.createMainIndexWriter(DefaultSolrCoreState.java:240)
   [junit4]   2> 	at org.apache.solr.update.DefaultSolrCoreState.getIndexWriter(DefaultSolrCoreState.java:114)
   [junit4]   2> 	at org.apache.solr.core.SolrCore.openNewSearcher(SolrCore.java:1963)
   [junit4]   2> 	... 13 more
   [junit4]   2> 318184 INFO  (qtp20203080-1670) [n:127.0.0.1:57160_solr    ] o.a.s.h.a.CollectionsHandler Invoked Collection Action :delete with params name=MissingSegmentRecoveryTest&action=DELETE&wt=javabin&version=2 and sendToOCPQueue=true
   [junit4]   2> 318228 INFO  (OverseerThreadFactory-717-thread-1-processing-n:127.0.0.1:57165_solr) [n:127.0.0.1:57165_solr    ] o.a.s.c.OverseerCollectionMessageHandler Executing Collection Cmd : action=UNLOAD&deleteInstanceDir=true&deleteDataDir=true
   [junit4]   2> 318263 INFO  (qtp10804685-1603) [n:127.0.0.1:57165_solr    ] o.a.s.m.SolrMetricManager Closing metric reporters for: solr.core.MissingSegmentRecoveryTest.shard1.replica2
   [junit4]   2> 318263 INFO  (qtp10804685-1603) [n:127.0.0.1:57165_solr    ] o.a.s.c.SolrCore [MissingSegmentRecoveryTest_shard1_replica2]  CLOSING SolrCore org.apache.solr.core.SolrCore@a51e75
   [junit4]   2> 318270 INFO  (qtp10804685-1603) [n:127.0.0.1:57165_solr    ] o.a.s.m.SolrMetricManager Closing metric reporters for: solr.core.MissingSegmentRecoveryTest.shard1.replica2
   [junit4]   2> 318272 INFO  (qtp20203080-1671) [n:127.0.0.1:57160_solr    ] o.a.s.s.HttpSolrCall [admin] webapp=null path=/admin/cores params={deleteInstanceDir=true&core=MissingSegmentRecoveryTest_shard1_replica1&qt=/admin/cores&deleteDataDir=true&action=UNLOAD&wt=javabin&version=2} status=0 QTime=21
   [junit4]   2> 318305 INFO  (qtp10804685-1603) [n:127.0.0.1:57165_solr    ] o.a.s.s.HttpSolrCall [admin] webapp=null path=/admin/cores params={deleteInstanceDir=true&core=MissingSegmentRecoveryTest_shard1_replica2&qt=/admin/cores&deleteDataDir=true&action=UNLOAD&wt=javabin&version=2} status=0 QTime=45
   [junit4]   2> 318312 INFO  (zkCallback-263-thread-2-processing-n:127.0.0.1:57160_solr) [n:127.0.0.1:57160_solr    ] o.a.s.c.c.ZkStateReader A cluster state change: [WatchedEvent state:SyncConnected type:NodeDataChanged path:/collections/MissingSegmentRecoveryTest/state.json] for collection [MissingSegmentRecoveryTest] has occurred - updating... (live nodes size: [2])
   [junit4]   2> 318422 INFO  (zkCallback-263-thread-2-processing-n:127.0.0.1:57160_solr) [n:127.0.0.1:57160_solr    ] o.a.s.c.c.ZkStateReader A cluster state change: [WatchedEvent state:SyncConnected type:NodeDeleted path:/collections/MissingSegmentRecoveryTest/state.json] for collection [MissingSegmentRecoveryTest] has occurred - updating... (live nodes size: [2])
   [junit4]   2> 319068 INFO  (qtp20203080-1670) [n:127.0.0.1:57160_solr    ] o.a.s.s.HttpSolrCall [admin] webapp=null path=/admin/collections params={name=MissingSegmentRecoveryTest&action=DELETE&wt=javabin&version=2} status=0 QTime=884
   [junit4]   2> 319069 INFO  (TEST-MissingSegmentRecoveryTest.testLeaderRecovery-seed#[A3AC04D7F106F40E]) [    ] o.a.s.SolrTestCaseJ4 ###Ending testLeaderRecovery
   [junit4]   2> NOTE: reproduce with: ant test  -Dtestcase=MissingSegmentRecoveryTest -Dtests.method=testLeaderRecovery -Dtests.seed=A3AC04D7F106F40E -Dtests.slow=true -Dtests.locale=bg -Dtests.timezone=Indian/Cocos -Dtests.asserts=true -Dtests.file.encoding=UTF-8
   [junit4] FAILURE 65.5s J0 | MissingSegmentRecoveryTest.testLeaderRecovery <<<
   [junit4]    > Throwable #1: java.lang.AssertionError: Expected a collection with one shard and two replicas
   [junit4]    > null
   [junit4]    > Last available state: DocCollection(MissingSegmentRecoveryTest//collections/MissingSegmentRecoveryTest/state.json/7)={
   [junit4]    >   "replicationFactor":"2",
   [junit4]    >   "shards":{"shard1":{
   [junit4]    >       "range":"80000000-7fffffff",
   [junit4]    >       "state":"active",
   [junit4]    >       "replicas":{
   [junit4]    >         "core_node1":{
   [junit4]    >           "core":"MissingSegmentRecoveryTest_shard1_replica1",
   [junit4]    >           "base_url":"https://127.0.0.1:57160/solr",
   [junit4]    >           "node_name":"127.0.0.1:57160_solr",
   [junit4]    >           "state":"down"},
   [junit4]    >         "core_node2":{
   [junit4]    >           "core":"MissingSegmentRecoveryTest_shard1_replica2",
   [junit4]    >           "base_url":"https://127.0.0.1:57165/solr",
   [junit4]    >           "node_name":"127.0.0.1:57165_solr",
   [junit4]    >           "state":"active",
   [junit4]    >           "leader":"true"}}}},
   [junit4]    >   "router":{"name":"compositeId"},
   [junit4]    >   "maxShardsPerNode":"1",
   [junit4]    >   "autoAddReplicas":"false"}
   [junit4]    > 	at __randomizedtesting.SeedInfo.seed([A3AC04D7F106F40E:F3F99CD4A8274213]:0)
   [junit4]    > 	at org.apache.solr.cloud.SolrCloudTestCase.waitForState(SolrCloudTestCase.java:265)
   [junit4]    > 	at org.apache.solr.cloud.MissingSegmentRecoveryTest.testLeaderRecovery(MissingSegmentRecoveryTest.java:105)
   [junit4]    > 	at java.lang.Thread.run(Thread.java:745)
   [junit4]   2> 319074 WARN  (NIOServerCxn.Factory:0.0.0.0/0.0.0.0:0) [    ] o.a.z.s.NIOServerCnxn caught end of stream exception
   [junit4]   2> EndOfStreamException: Unable to read additional data from client sessionid 0x15a4b38e6f10008, likely client has closed socket
   [junit4]   2> 	at org.apache.zookeeper.server.NIOServerCnxn.doIO(NIOServerCnxn.java:228)
   [junit4]   2> 	at org.apache.zookeeper.server.NIOServerCnxnFactory.run(NIOServerCnxnFactory.java:208)
   [junit4]   2> 	at java.lang.Thread.run(Thread.java:745)
   [junit4]   2> 319163 INFO  (jetty-launcher-241-thread-3) [    ] o.e.j.s.AbstractConnector Stopped ServerConnector@9daf3f{SSL,[ssl, http/1.1]}{127.0.0.1:0}
   [junit4]   2> 319163 INFO  (jetty-launcher-241-thread-3) [    ] o.a.s.c.CoreContainer Shutting down CoreContainer instance=2330055
   [junit4]   2> 319166 INFO  (jetty-launcher-241-thread-4) [    ] o.e.j.s.AbstractConnector Stopped ServerConnector@1d9ff03{SSL,[ssl, http/1.1]}{127.0.0.1:57160}
   [junit4]   2> 319166 INFO  (jetty-launcher-241-thread-4) [    ] o.a.s.c.CoreContainer Shutting down CoreContainer instance=9048418
   [junit4]   2> 319174 INFO  (jetty-launcher-241-thread-3) [    ] o.a.s.c.Overseer Overseer (id=97473049706692614-127.0.0.1:57165_solr-n_0000000001) closing
   [junit4]   2> 319177 INFO  (OverseerStateUpdate-97473049706692614-127.0.0.1:57165_solr-n_0000000001) [n:127.0.0.1:57165_solr    ] o.a.s.c.Overseer Overseer Loop exiting : 127.0.0.1:57165_solr
   [junit4]   2> 319186 INFO  (zkCallback-252-thread-6-processing-n:127.0.0.1:57165_solr) [n:127.0.0.1:57165_solr    ] o.a.s.c.c.ZkStateReader Updated live nodes from ZooKeeper... (2) -> (1)
   [junit4]   2> 319187 INFO  (jetty-launcher-241-thread-4) [    ] o.a.s.m.SolrMetricManager Closing metric reporters for: solr.node
   [junit4]   2> 319188 INFO  (jetty-launcher-241-thread-4) [    ] o.e.j.s.h.ContextHandler Stopped o.e.j.s.ServletContextHandler@15d6e43{/solr,null,UNAVAILABLE}
   [junit4]   2> 319189 WARN  (zkCallback-252-thread-6-processing-n:127.0.0.1:57165_solr) [n:127.0.0.1:57165_solr    ] o.a.s.c.c.ZkStateReader ZooKeeper watch triggered, but Solr cannot talk to ZK: [KeeperErrorCode = Session expired for /live_nodes]
   [junit4]   2> 319195 INFO  (jetty-launcher-241-thread-3) [    ] o.a.s.m.SolrMetricManager Closing metric reporters for: solr.node
   [junit4]   2> 319196 INFO  (jetty-launcher-241-thread-3) [    ] o.e.j.s.h.ContextHandler Stopped o.e.j.s.ServletContextHandler@a7d8ad{/solr,null,UNAVAILABLE}
   [junit4]   2> 319198 INFO  (SUITE-MissingSegmentRecoveryTest-seed#[A3AC04D7F106F40E]-worker) [    ] o.a.s.c.ZkTestServer connecting to 127.0.0.1:57156 57156
   [junit4]   2> 319200 INFO  (Thread-358) [    ] o.a.s.c.ZkTestServer connecting to 127.0.0.1:57156 57156
   [junit4]   2> 319200 WARN  (Thread-358) [    ] o.a.s.c.ZkTestServer Watch limit violations: 
   [junit4]   2> Maximum concurrent create/delete watches above limit:
   [junit4]   2> 
   [junit4]   2> 	4	/solr/aliases.json
   [junit4]   2> 	3	/solr/security.json
   [junit4]   2> 	2	/solr/configs/conf
   [junit4]   2> 
   [junit4]   2> Maximum concurrent data watches above limit:
   [junit4]   2> 
   [junit4]   2> 	4	/solr/clusterstate.json
   [junit4]   2> 	4	/solr/collections/MissingSegmentRecoveryTest/state.json
   [junit4]   2> 	4	/solr/clusterprops.json
   [junit4]   2> 
   [junit4]   2> Maximum concurrent children watches above limit:
   [junit4]   2> 
   [junit4]   2> 	62	/solr/overseer/collection-queue-work
   [junit4]   2> 	23	/solr/overseer/queue
   [junit4]   2> 	4	/solr/collections
   [junit4]   2> 	3	/solr/live_nodes
   [junit4]   2> 	3	/solr/overseer/queue-work
   [junit4]   2> 
   [junit4]   2> 319200 INFO  (SUITE-MissingSegmentRecoveryTest-seed#[A3AC04D7F106F40E]-worker) [    ] o.a.s.SolrTestCaseJ4 ###deleteCore
   [junit4]   2> NOTE: leaving temporary files on disk at: C:\Users\jenkins\workspace\Lucene-Solr-master-Windows\solr\build\solr-core\test\J0\temp\solr.cloud.MissingSegmentRecoveryTest_A3AC04D7F106F40E-001
   [junit4]   2> Feb 17, 2017 8:39:30 AM com.carrotsearch.randomizedtesting.ThreadLeakControl checkThreadLeaks
   [junit4]   2> WARNING: Will linger awaiting termination of 4 leaked thread(s).
   [junit4]   2> NOTE: test params are: codec=Asserting(Lucene70), sim=RandomSimilarity(queryNorm=true): {}, locale=bg, timezone=Indian/Cocos
   [junit4]   2> NOTE: Windows 10 10.0 x86/Oracle Corporation 1.8.0_121 (32-bit)/cpus=3,threads=1,free=64154056,total=283639808
   [junit4]   2> NOTE: All tests run in this JVM: [TestSolrCloudSnapshots, DocumentBuilderTest, OutputWriterTest, TestInfoStreamLogging, TestDefaultSearchFieldResource, SchemaVersionSpecificBehaviorTest, SyncSliceTest, PingRequestHandlerTest, TestUseDocValuesAsStored2, LeaderElectionContextKeyTest, TestLFUCache, DirectSolrSpellCheckerTest, DistributedFacetPivotSmallAdvancedTest, TestPhraseSuggestions, TestDocumentBuilder, TestCSVLoader, TestDocBasedVersionConstraints, ZkControllerTest, TestSolr4Spatial2, ZkNodePropsTest, TestExpandComponent, TestStressReorder, TestRequestStatusCollectionAPI, TestSQLHandlerNonCloud, TestSchemalessBufferedUpdates, QueryResultKeyTest, PluginInfoTest, TestFieldCacheReopen, MissingSegmentRecoveryTest]
   [junit4] Completed [77/694 (1!)] on J0 in 66.48s, 1 test, 1 failure <<< FAILURES!

[...truncated 56808 lines...]


Mime
View raw message