lucene-dev mailing list archives

Site index · List index
Message view « Date » · « Thread »
Top « Date » · « Thread »
From Apache Jenkins Server <jenk...@builds.apache.org>
Subject [JENKINS] Lucene-Solr-Tests-6.4 - Build # 16 - Unstable
Date Wed, 01 Feb 2017 16:44:28 GMT
Build: https://builds.apache.org/job/Lucene-Solr-Tests-6.4/16/

1 tests failed.
FAILED:  org.apache.solr.handler.admin.MBeansHandlerTest.testDiff

Error Message:
expected:<Was: [1, Now: 2], Delta: 1> but was:<Was: [4, Now: 5], Delta: 1>

Stack Trace:
org.junit.ComparisonFailure: expected:<Was: [1, Now: 2], Delta: 1> but was:<Was:
[4, Now: 5], Delta: 1>
	at __randomizedtesting.SeedInfo.seed([C8742392D49774FA:D62E709C4214C9A]:0)
	at org.junit.Assert.assertEquals(Assert.java:125)
	at org.junit.Assert.assertEquals(Assert.java:147)
	at org.apache.solr.handler.admin.MBeansHandlerTest.testDiff(MBeansHandlerTest.java:63)
	at sun.reflect.NativeMethodAccessorImpl.invoke0(Native Method)
	at sun.reflect.NativeMethodAccessorImpl.invoke(NativeMethodAccessorImpl.java:62)
	at sun.reflect.DelegatingMethodAccessorImpl.invoke(DelegatingMethodAccessorImpl.java:43)
	at java.lang.reflect.Method.invoke(Method.java:498)
	at com.carrotsearch.randomizedtesting.RandomizedRunner.invoke(RandomizedRunner.java:1713)
	at com.carrotsearch.randomizedtesting.RandomizedRunner$8.evaluate(RandomizedRunner.java:907)
	at com.carrotsearch.randomizedtesting.RandomizedRunner$9.evaluate(RandomizedRunner.java:943)
	at com.carrotsearch.randomizedtesting.RandomizedRunner$10.evaluate(RandomizedRunner.java:957)
	at com.carrotsearch.randomizedtesting.rules.SystemPropertiesRestoreRule$1.evaluate(SystemPropertiesRestoreRule.java:57)
	at org.apache.lucene.util.TestRuleSetupTeardownChained$1.evaluate(TestRuleSetupTeardownChained.java:49)
	at org.apache.lucene.util.AbstractBeforeAfterRule$1.evaluate(AbstractBeforeAfterRule.java:45)
	at org.apache.lucene.util.TestRuleThreadAndTestName$1.evaluate(TestRuleThreadAndTestName.java:48)
	at org.apache.lucene.util.TestRuleIgnoreAfterMaxFailures$1.evaluate(TestRuleIgnoreAfterMaxFailures.java:64)
	at org.apache.lucene.util.TestRuleMarkFailure$1.evaluate(TestRuleMarkFailure.java:47)
	at com.carrotsearch.randomizedtesting.rules.StatementAdapter.evaluate(StatementAdapter.java:36)
	at com.carrotsearch.randomizedtesting.ThreadLeakControl$StatementRunner.run(ThreadLeakControl.java:367)
	at com.carrotsearch.randomizedtesting.ThreadLeakControl.forkTimeoutingTask(ThreadLeakControl.java:811)
	at com.carrotsearch.randomizedtesting.ThreadLeakControl$3.evaluate(ThreadLeakControl.java:462)
	at com.carrotsearch.randomizedtesting.RandomizedRunner.runSingleTest(RandomizedRunner.java:916)
	at com.carrotsearch.randomizedtesting.RandomizedRunner$5.evaluate(RandomizedRunner.java:802)
	at com.carrotsearch.randomizedtesting.RandomizedRunner$6.evaluate(RandomizedRunner.java:852)
	at com.carrotsearch.randomizedtesting.RandomizedRunner$7.evaluate(RandomizedRunner.java:863)
	at com.carrotsearch.randomizedtesting.rules.StatementAdapter.evaluate(StatementAdapter.java:36)
	at com.carrotsearch.randomizedtesting.rules.SystemPropertiesRestoreRule$1.evaluate(SystemPropertiesRestoreRule.java:57)
	at org.apache.lucene.util.AbstractBeforeAfterRule$1.evaluate(AbstractBeforeAfterRule.java:45)
	at com.carrotsearch.randomizedtesting.rules.StatementAdapter.evaluate(StatementAdapter.java:36)
	at org.apache.lucene.util.TestRuleStoreClassName$1.evaluate(TestRuleStoreClassName.java:41)
	at com.carrotsearch.randomizedtesting.rules.NoShadowingOrOverridesOnMethodsRule$1.evaluate(NoShadowingOrOverridesOnMethodsRule.java:40)
	at com.carrotsearch.randomizedtesting.rules.NoShadowingOrOverridesOnMethodsRule$1.evaluate(NoShadowingOrOverridesOnMethodsRule.java:40)
	at com.carrotsearch.randomizedtesting.rules.StatementAdapter.evaluate(StatementAdapter.java:36)
	at com.carrotsearch.randomizedtesting.rules.StatementAdapter.evaluate(StatementAdapter.java:36)
	at com.carrotsearch.randomizedtesting.rules.StatementAdapter.evaluate(StatementAdapter.java:36)
	at org.apache.lucene.util.TestRuleAssertionsRequired$1.evaluate(TestRuleAssertionsRequired.java:53)
	at org.apache.lucene.util.TestRuleMarkFailure$1.evaluate(TestRuleMarkFailure.java:47)
	at org.apache.lucene.util.TestRuleIgnoreAfterMaxFailures$1.evaluate(TestRuleIgnoreAfterMaxFailures.java:64)
	at org.apache.lucene.util.TestRuleIgnoreTestSuites$1.evaluate(TestRuleIgnoreTestSuites.java:54)
	at com.carrotsearch.randomizedtesting.rules.StatementAdapter.evaluate(StatementAdapter.java:36)
	at com.carrotsearch.randomizedtesting.ThreadLeakControl$StatementRunner.run(ThreadLeakControl.java:367)
	at java.lang.Thread.run(Thread.java:745)




Build Log:
[...truncated 12011 lines...]
   [junit4] Suite: org.apache.solr.handler.admin.MBeansHandlerTest
   [junit4]   2> Creating dataDir: /x1/jenkins/jenkins-slave/workspace/Lucene-Solr-Tests-6.4/solr/build/solr-core/test/J2/temp/solr.handler.admin.MBeansHandlerTest_C8742392D49774FA-001/init-core-data-001
   [junit4]   2> 1273743 INFO  (SUITE-MBeansHandlerTest-seed#[C8742392D49774FA]-worker)
[    ] o.a.s.SolrTestCaseJ4 Randomized ssl (true) and clientAuth (true) via: @org.apache.solr.util.RandomizeSSL(reason=,
ssl=NaN, value=NaN, clientAuth=NaN)
   [junit4]   2> 1273743 INFO  (SUITE-MBeansHandlerTest-seed#[C8742392D49774FA]-worker)
[    ] o.a.s.SolrTestCaseJ4 ####initCore
   [junit4]   2> 1273744 INFO  (SUITE-MBeansHandlerTest-seed#[C8742392D49774FA]-worker)
[    ] o.a.s.c.SolrResourceLoader [null] Added 2 libs to classloader, from paths: [/x1/jenkins/jenkins-slave/workspace/Lucene-Solr-Tests-6.4/solr/core/src/test-files/solr/collection1/lib,
/x1/jenkins/jenkins-slave/workspace/Lucene-Solr-Tests-6.4/solr/core/src/test-files/solr/collection1/lib/classes]
   [junit4]   2> 1273774 INFO  (SUITE-MBeansHandlerTest-seed#[C8742392D49774FA]-worker)
[    ] o.a.s.c.SolrConfig Using Lucene MatchVersion: 6.4.1
   [junit4]   2> 1273797 INFO  (SUITE-MBeansHandlerTest-seed#[C8742392D49774FA]-worker)
[    ] o.a.s.s.IndexSchema [null] Schema name=test
   [junit4]   2> 1273894 WARN  (SUITE-MBeansHandlerTest-seed#[C8742392D49774FA]-worker)
[    ] o.a.s.s.IndexSchema [null] default search field in schema is text. WARNING: Deprecated,
please use 'df' on request instead.
   [junit4]   2> 1273896 INFO  (SUITE-MBeansHandlerTest-seed#[C8742392D49774FA]-worker)
[    ] o.a.s.s.IndexSchema Loaded schema test/1.0 with uniqueid field id
   [junit4]   2> 1273904 INFO  (SUITE-MBeansHandlerTest-seed#[C8742392D49774FA]-worker)
[    ] o.a.s.u.UpdateShardHandler Creating UpdateShardHandler HTTP client with params: socketTimeout=30000&connTimeout=30000&retry=true
   [junit4]   2> 1273906 WARN  (SUITE-MBeansHandlerTest-seed#[C8742392D49774FA]-worker)
[    ] o.a.s.m.r.SolrJmxReporter No serviceUrl or agentId was configured, using first MBeanServer.
   [junit4]   2> 1273909 INFO  (SUITE-MBeansHandlerTest-seed#[C8742392D49774FA]-worker)
[    ] o.a.s.m.r.SolrJmxReporter JMX monitoring enabled at server: com.sun.jmx.mbeanserver.JmxMBeanServer@7db440fa
   [junit4]   2> 1273909 WARN  (SUITE-MBeansHandlerTest-seed#[C8742392D49774FA]-worker)
[    ] o.a.s.m.r.SolrJmxReporter No serviceUrl or agentId was configured, using first MBeanServer.
   [junit4]   2> 1273913 INFO  (SUITE-MBeansHandlerTest-seed#[C8742392D49774FA]-worker)
[    ] o.a.s.m.r.SolrJmxReporter JMX monitoring enabled at server: com.sun.jmx.mbeanserver.JmxMBeanServer@7db440fa
   [junit4]   2> 1273913 WARN  (SUITE-MBeansHandlerTest-seed#[C8742392D49774FA]-worker)
[    ] o.a.s.m.r.SolrJmxReporter No serviceUrl or agentId was configured, using first MBeanServer.
   [junit4]   2> 1273913 INFO  (SUITE-MBeansHandlerTest-seed#[C8742392D49774FA]-worker)
[    ] o.a.s.m.r.SolrJmxReporter JMX monitoring enabled at server: com.sun.jmx.mbeanserver.JmxMBeanServer@7db440fa
   [junit4]   2> 1273914 INFO  (coreLoadExecutor-4819-thread-1) [    x:collection1] o.a.s.c.SolrResourceLoader
[null] Added 2 libs to classloader, from paths: [/x1/jenkins/jenkins-slave/workspace/Lucene-Solr-Tests-6.4/solr/core/src/test-files/solr/collection1/lib,
/x1/jenkins/jenkins-slave/workspace/Lucene-Solr-Tests-6.4/solr/core/src/test-files/solr/collection1/lib/classes]
   [junit4]   2> 1273940 INFO  (coreLoadExecutor-4819-thread-1) [    x:collection1] o.a.s.c.SolrConfig
Using Lucene MatchVersion: 6.4.1
   [junit4]   2> 1273964 INFO  (coreLoadExecutor-4819-thread-1) [    x:collection1] o.a.s.s.IndexSchema
[collection1] Schema name=test
   [junit4]   2> 1274061 WARN  (coreLoadExecutor-4819-thread-1) [    x:collection1] o.a.s.s.IndexSchema
[collection1] default search field in schema is text. WARNING: Deprecated, please use 'df'
on request instead.
   [junit4]   2> 1274064 INFO  (coreLoadExecutor-4819-thread-1) [    x:collection1] o.a.s.s.IndexSchema
Loaded schema test/1.0 with uniqueid field id
   [junit4]   2> 1274070 INFO  (coreLoadExecutor-4819-thread-1) [    x:collection1] o.a.s.c.CoreContainer
Creating SolrCore 'collection1' using configuration from instancedir /x1/jenkins/jenkins-slave/workspace/Lucene-Solr-Tests-6.4/solr/core/src/test-files/solr/collection1
   [junit4]   2> 1274070 WARN  (coreLoadExecutor-4819-thread-1) [    x:collection1] o.a.s.m.r.SolrJmxReporter
No serviceUrl or agentId was configured, using first MBeanServer.
   [junit4]   2> 1274070 INFO  (coreLoadExecutor-4819-thread-1) [    x:collection1] o.a.s.m.r.SolrJmxReporter
JMX monitoring enabled at server: com.sun.jmx.mbeanserver.JmxMBeanServer@7db440fa
   [junit4]   2> 1274070 INFO  (coreLoadExecutor-4819-thread-1) [    x:collection1] o.a.s.c.SolrCore
[[collection1] ] Opening new SolrCore at [/x1/jenkins/jenkins-slave/workspace/Lucene-Solr-Tests-6.4/solr/core/src/test-files/solr/collection1],
dataDir=[/x1/jenkins/jenkins-slave/workspace/Lucene-Solr-Tests-6.4/solr/build/solr-core/test/J2/temp/solr.handler.admin.MBeansHandlerTest_C8742392D49774FA-001/init-core-data-001/]
   [junit4]   2> 1274071 INFO  (coreLoadExecutor-4819-thread-1) [    x:collection1] o.a.s.c.JmxMonitoredMap
JMX monitoring is enabled. Adding Solr mbeans to JMX Server: com.sun.jmx.mbeanserver.JmxMBeanServer@7db440fa
   [junit4]   2> 1274072 INFO  (coreLoadExecutor-4819-thread-1) [    x:collection1] o.a.s.u.RandomMergePolicy
RandomMergePolicy wrapping class org.apache.lucene.index.LogByteSizeMergePolicy: [LogByteSizeMergePolicy:
minMergeSize=1677721, mergeFactor=14, maxMergeSize=2147483648, maxMergeSizeForForcedMerge=9223372036854775807,
calibrateSizeByDeletes=true, maxMergeDocs=2147483647, maxCFSSegmentSizeMB=8.796093022207999E12,
noCFSRatio=1.0]
   [junit4]   2> 1274101 INFO  (coreLoadExecutor-4819-thread-1) [    x:collection1] o.a.s.u.UpdateHandler
Using UpdateLog implementation: org.apache.solr.update.UpdateLog
   [junit4]   2> 1274101 INFO  (coreLoadExecutor-4819-thread-1) [    x:collection1] o.a.s.u.UpdateLog
Initializing UpdateLog: dataDir= defaultSyncLevel=FLUSH numRecordsToKeep=100 maxNumLogsToKeep=10
numVersionBuckets=65536
   [junit4]   2> 1274102 INFO  (coreLoadExecutor-4819-thread-1) [    x:collection1] o.a.s.u.CommitTracker
Hard AutoCommit: disabled
   [junit4]   2> 1274102 INFO  (coreLoadExecutor-4819-thread-1) [    x:collection1] o.a.s.u.CommitTracker
Soft AutoCommit: disabled
   [junit4]   2> 1274103 INFO  (coreLoadExecutor-4819-thread-1) [    x:collection1] o.a.s.u.RandomMergePolicy
RandomMergePolicy wrapping class org.apache.lucene.index.TieredMergePolicy: [TieredMergePolicy:
maxMergeAtOnce=25, maxMergeAtOnceExplicit=50, maxMergedSegmentMB=63.9619140625, floorSegmentMB=0.4765625,
forceMergeDeletesPctAllowed=29.121159482733916, segmentsPerTier=24.0, maxCFSSegmentSizeMB=8.796093022207999E12,
noCFSRatio=0.0
   [junit4]   2> 1274104 INFO  (coreLoadExecutor-4819-thread-1) [    x:collection1] o.a.s.s.SolrIndexSearcher
Opening [Searcher@1be9a297[collection1] main]
   [junit4]   2> 1274104 INFO  (coreLoadExecutor-4819-thread-1) [    x:collection1] o.a.s.h.c.SpellCheckComponent
Initializing spell checkers
   [junit4]   2> 1274110 INFO  (coreLoadExecutor-4819-thread-1) [    x:collection1] o.a.s.s.DirectSolrSpellChecker
init: {name=direct,classname=DirectSolrSpellChecker,field=lowerfilt,minQueryLength=3}
   [junit4]   2> 1274137 INFO  (coreLoadExecutor-4819-thread-1) [    x:collection1] o.a.s.h.ReplicationHandler
Commits will be reserved for  10000
   [junit4]   2> 1274137 INFO  (searcherExecutor-4820-thread-1-processing-x:collection1)
[    x:collection1] o.a.s.h.c.SpellCheckComponent Loading spell index for spellchecker: default
   [junit4]   2> 1274138 INFO  (searcherExecutor-4820-thread-1-processing-x:collection1)
[    x:collection1] o.a.s.h.c.SpellCheckComponent Loading spell index for spellchecker: direct
   [junit4]   2> 1274138 INFO  (searcherExecutor-4820-thread-1-processing-x:collection1)
[    x:collection1] o.a.s.h.c.SpellCheckComponent Loading spell index for spellchecker: wordbreak
   [junit4]   2> 1274138 INFO  (searcherExecutor-4820-thread-1-processing-x:collection1)
[    x:collection1] o.a.s.h.c.SpellCheckComponent Loading spell index for spellchecker: multipleFields
   [junit4]   2> 1274138 INFO  (searcherExecutor-4820-thread-1-processing-x:collection1)
[    x:collection1] o.a.s.h.c.SpellCheckComponent Loading spell index for spellchecker: jarowinkler
   [junit4]   2> 1274139 INFO  (coreLoadExecutor-4819-thread-1) [    x:collection1] o.a.s.u.UpdateLog
Could not find max version in index or recent updates, using new clock 1558147248987045888
   [junit4]   2> 1274139 INFO  (searcherExecutor-4820-thread-1-processing-x:collection1)
[    x:collection1] o.a.s.h.c.SpellCheckComponent Loading spell index for spellchecker: external
   [junit4]   2> 1274139 INFO  (searcherExecutor-4820-thread-1-processing-x:collection1)
[    x:collection1] o.a.s.h.c.SpellCheckComponent Loading spell index for spellchecker: freq
   [junit4]   2> 1274139 INFO  (searcherExecutor-4820-thread-1-processing-x:collection1)
[    x:collection1] o.a.s.h.c.SpellCheckComponent Loading spell index for spellchecker: fqcn
   [junit4]   2> 1274140 INFO  (searcherExecutor-4820-thread-1-processing-x:collection1)
[    x:collection1] o.a.s.h.c.SpellCheckComponent Loading spell index for spellchecker: perDict
   [junit4]   2> 1274140 INFO  (searcherExecutor-4820-thread-1-processing-x:collection1)
[    x:collection1] o.a.s.c.SolrCore [collection1] Registered new searcher Searcher@1be9a297[collection1]
main{ExitableDirectoryReader(UninvertingDirectoryReader())}
   [junit4]   2> 1274142 INFO  (SUITE-MBeansHandlerTest-seed#[C8742392D49774FA]-worker)
[    ] o.a.s.SolrTestCaseJ4 ####initCore end
   [junit4]   2> 1274145 INFO  (TEST-MBeansHandlerTest.testBackCompatNames-seed#[C8742392D49774FA])
[    ] o.a.s.SolrTestCaseJ4 ###Starting testBackCompatNames
   [junit4]   2> 1274146 INFO  (TEST-MBeansHandlerTest.testBackCompatNames-seed#[C8742392D49774FA])
[    ] o.a.s.c.S.Request [collection1]  webapp=null path=null params={qt=/admin/mbeans&wt=xml}
status=0 QTime=0
   [junit4]   2> 1274151 INFO  (TEST-MBeansHandlerTest.testBackCompatNames-seed#[C8742392D49774FA])
[    ] o.a.s.c.S.Request [collection1]  webapp=null path=null params={qt=/admin/mbeans&cat=QUERYHANDLER&wt=xml}
status=0 QTime=0
   [junit4]   2> 1274152 INFO  (TEST-MBeansHandlerTest.testBackCompatNames-seed#[C8742392D49774FA])
[    ] o.a.s.c.S.Request [collection1]  webapp=null path=null params={qt=/admin/mbeans&cat=UPDATE&wt=xml}
status=0 QTime=0
   [junit4]   2> 1274153 INFO  (TEST-MBeansHandlerTest.testBackCompatNames-seed#[C8742392D49774FA])
[    ] o.a.s.SolrTestCaseJ4 ###Ending testBackCompatNames
   [junit4]   2> 1274155 INFO  (TEST-MBeansHandlerTest.testDiff-seed#[C8742392D49774FA])
[    ] o.a.s.SolrTestCaseJ4 ###Starting testDiff
   [junit4]   2> 1274156 INFO  (TEST-MBeansHandlerTest.testDiff-seed#[C8742392D49774FA])
[    ] o.a.s.c.S.Request [collection1]  webapp=null path=null params={qt=/admin/mbeans&stats=true&wt=xml}
status=0 QTime=1
   [junit4]   2> 1274165 INFO  (TEST-MBeansHandlerTest.testDiff-seed#[C8742392D49774FA])
[    ] o.a.s.c.S.Request [collection1]  webapp=null path=null params={qt=/admin/mbeans&stats=true&diff=true&wt=xml}
status=0 QTime=7
   [junit4]   2> 1274167 INFO  (TEST-MBeansHandlerTest.testDiff-seed#[C8742392D49774FA])
[    ] o.a.s.SolrTestCaseJ4 ###Ending testDiff
   [junit4]   2> NOTE: reproduce with: ant test  -Dtestcase=MBeansHandlerTest -Dtests.method=testDiff
-Dtests.seed=C8742392D49774FA -Dtests.multiplier=2 -Dtests.slow=true -Dtests.locale=fr-CA
-Dtests.timezone=Antarctica/Palmer -Dtests.asserts=true -Dtests.file.encoding=UTF-8
   [junit4] FAILURE 0.02s J2 | MBeansHandlerTest.testDiff <<<
   [junit4]    > Throwable #1: org.junit.ComparisonFailure: expected:<Was: [1, Now:
2], Delta: 1> but was:<Was: [4, Now: 5], Delta: 1>
   [junit4]    > 	at __randomizedtesting.SeedInfo.seed([C8742392D49774FA:D62E709C4214C9A]:0)
   [junit4]    > 	at org.apache.solr.handler.admin.MBeansHandlerTest.testDiff(MBeansHandlerTest.java:63)
   [junit4]    > 	at java.lang.Thread.run(Thread.java:745)
   [junit4]   2> 1274173 INFO  (TEST-MBeansHandlerTest.testXMLDiffWithExternalEntity-seed#[C8742392D49774FA])
[    ] o.a.s.SolrTestCaseJ4 ###Starting testXMLDiffWithExternalEntity
   [junit4]   2> 1274251 INFO  (TEST-MBeansHandlerTest.testXMLDiffWithExternalEntity-seed#[C8742392D49774FA])
[    ] o.a.s.SolrTestCaseJ4 ###Ending testXMLDiffWithExternalEntity
   [junit4]   2> 1274251 INFO  (SUITE-MBeansHandlerTest-seed#[C8742392D49774FA]-worker)
[    ] o.a.s.SolrTestCaseJ4 ###deleteCore
   [junit4]   2> 1274251 INFO  (SUITE-MBeansHandlerTest-seed#[C8742392D49774FA]-worker)
[    ] o.a.s.c.CoreContainer Shutting down CoreContainer instance=29361315
   [junit4]   2> 1274252 INFO  (coreCloseExecutor-4825-thread-1) [    x:collection1] o.a.s.c.SolrCore
[collection1]  CLOSING SolrCore org.apache.solr.core.SolrCore@122d7868
   [junit4]   2> 1274312 INFO  (coreCloseExecutor-4825-thread-1) [    x:collection1] o.a.s.m.SolrMetricManager
Closing metric reporters for: solr.core.collection1
   [junit4]   2> 1274315 INFO  (SUITE-MBeansHandlerTest-seed#[C8742392D49774FA]-worker)
[    ] o.a.s.m.SolrMetricManager Closing metric reporters for: solr.node
   [junit4]   2> NOTE: leaving temporary files on disk at: /x1/jenkins/jenkins-slave/workspace/Lucene-Solr-Tests-6.4/solr/build/solr-core/test/J2/temp/solr.handler.admin.MBeansHandlerTest_C8742392D49774FA-001
   [junit4]   2> NOTE: test params are: codec=Asserting(Lucene62), sim=RandomSimilarity(queryNorm=true,coord=yes):
{}, locale=fr-CA, timezone=Antarctica/Palmer
   [junit4]   2> NOTE: Linux 3.13.0-85-generic amd64/Oracle Corporation 1.8.0_102 (64-bit)/cpus=4,threads=1,free=303306576,total=531628032
   [junit4]   2> NOTE: All tests run in this JVM: [TestSolrQueryParserResource, TestRestoreCore,
TestDefaultStatsCache, MetricsHandlerTest, TestJsonFacetRefinement, PrimUtilsTest, TestBinaryResponseWriter,
TestMacros, MinimalSchemaTest, TestFieldCacheSanityChecker, DataDrivenBlockJoinTest, FieldMutatingUpdateProcessorTest,
TestWriterPerf, TestMergePolicyConfig, TestDistributedStatsComponentCardinality, NoCacheHeaderTest,
TestManagedSynonymFilterFactory, TestXIncludeConfig, AssignTest, BadIndexSchemaTest, TestOverriddenPrefixQueryForCustomFieldType,
TimeZoneUtilsTest, BasicDistributedZk2Test, TestGeoJSONResponseWriter, TestSolrDeletionPolicy1,
CircularListTest, RecoveryZkTest, TestConfigOverlay, TestReloadDeadlock, BadComponentTest,
TestBlendedInfixSuggestions, HdfsBasicDistributedZk2Test, PKIAuthenticationIntegrationTest,
TestDynamicFieldCollectionResource, TestTrieFacet, EnumFieldTest, SolrTestCaseJ4Test, TestUnifiedSolrHighlighter,
BufferStoreTest, CloneFieldUpdateProcessorFactoryTest, TestDistribDocBasedVersion, ConnectionReuseTest,
RestartWhileUpdatingTest, UpdateParamsTest, LeaderElectionTest, SolrPluginUtilsTest, TestCoreDiscovery,
ChangedSchemaMergeTest, TestJsonRequest, LukeRequestHandlerTest, LeaderInitiatedRecoveryOnShardRestartTest,
TestManagedResourceStorage, TestBinaryField, TestDynamicLoading, TestReload, OverseerTest,
CdcrBootstrapTest, DeleteReplicaTest, TestSubQueryTransformerCrossCore, TestIndexingPerformance,
BlockJoinFacetDistribTest, CursorMarkTest, TestSolrQueryParser, TestReversedWildcardFilterFactory,
TestRequestStatusCollectionAPI, TestShortCircuitedRequests, DebugComponentTest, TestSolrCloudWithKerberosAlt,
CoreAdminRequestStatusTest, CoreSorterTest, TestLFUCache, SpatialHeatmapFacetsTest, TestTrackingShardHandlerFactory,
TestExtendedDismaxParser, BinaryUpdateRequestHandlerTest, RequestLoggingTest, TestSort, OutOfBoxZkACLAndCredentialsProvidersTest,
CheckHdfsIndexTest, TestFieldResource, HdfsDirectoryFactoryTest, ForceLeaderTest, CdcrRequestHandlerTest,
HdfsUnloadDistributedZkTest, TestOnReconnectListenerSupport, TemplateUpdateProcessorTest,
StatsReloadRaceTest, FullSolrCloudDistribCmdsTest, OpenExchangeRatesOrgProviderTest, TestGraphTermsQParserPlugin,
TestSchemaNameResource, DOMUtilTest, TestSolrXml, CollectionsAPISolrJTest, SolrCloudExampleTest,
ConnectionManagerTest, GraphQueryTest, SaslZkACLProviderTest, FieldAnalysisRequestHandlerTest,
TlogReplayBufferedWhileIndexingTest, SuggesterWFSTTest, DirectUpdateHandlerTest, TestConfig,
TestSchemaVersionResource, SolrMetricsIntegrationTest, HdfsChaosMonkeySafeLeaderTest, TestZkChroot,
TestNumericTerms32, TestDFRSimilarityFactory, OpenCloseCoreStressTest, ClusterStateUpdateTest,
ZkCLITest, TestDistributedGrouping, TestHashPartitioner, TestRealTimeGet, TestStressVersions,
DistributedTermsComponentTest, SolrCoreTest, SpellCheckComponentTest, TestGroupingSearch,
TestIndexSearcher, HighlighterTest, DistributedQueryElevationComponentTest, SuggesterFSTTest,
TestFoldingMultitermQuery, DocValuesTest, SortByFunctionTest, DocValuesMultiTest, DistanceFunctionTest,
CacheHeaderTest, StandardRequestHandlerTest, DocumentAnalysisRequestHandlerTest, PrimitiveFieldTypeTest,
TermsComponentTest, RequestHandlersTest, PathHierarchyTokenizerFactoryTest, RequiredFieldsTest,
IndexSchemaRuntimeFieldTest, IndexSchemaTest, JSONWriterTest, MBeansHandlerTest]
   [junit4] Completed [387/680 (1!)] on J2 in 0.60s, 3 tests, 1 failure <<< FAILURES!

[...truncated 63375 lines...]



Mime
View raw message