lucene-dev mailing list archives

Site index · List index
Message view « Date » · « Thread »
Top « Date » · « Thread »
From Policeman Jenkins Server <jenk...@thetaphi.de>
Subject [JENKINS-EA] Lucene-Solr-6.4-Linux (32bit/jdk-9-ea+153) - Build # 95 - Still Unstable!
Date Thu, 02 Feb 2017 22:28:51 GMT
Build: https://jenkins.thetaphi.de/job/Lucene-Solr-6.4-Linux/95/
Java: 32bit/jdk-9-ea+153 -server -XX:+UseParallelGC

1 tests failed.
FAILED:  org.apache.solr.handler.admin.MBeansHandlerTest.testDiff

Error Message:
expected:<Was: [1, Now: 2], Delta: 1> but was:<Was: [4, Now: 5], Delta: 1>

Stack Trace:
org.junit.ComparisonFailure: expected:<Was: [1, Now: 2], Delta: 1> but was:<Was:
[4, Now: 5], Delta: 1>
	at __randomizedtesting.SeedInfo.seed([BC74C209A4B22B48:79620692B4041328]:0)
	at org.junit.Assert.assertEquals(Assert.java:125)
	at org.junit.Assert.assertEquals(Assert.java:147)
	at org.apache.solr.handler.admin.MBeansHandlerTest.testDiff(MBeansHandlerTest.java:63)
	at java.base/jdk.internal.reflect.NativeMethodAccessorImpl.invoke0(Native Method)
	at java.base/jdk.internal.reflect.NativeMethodAccessorImpl.invoke(NativeMethodAccessorImpl.java:62)
	at java.base/jdk.internal.reflect.DelegatingMethodAccessorImpl.invoke(DelegatingMethodAccessorImpl.java:43)
	at java.base/java.lang.reflect.Method.invoke(Method.java:543)
	at com.carrotsearch.randomizedtesting.RandomizedRunner.invoke(RandomizedRunner.java:1713)
	at com.carrotsearch.randomizedtesting.RandomizedRunner$8.evaluate(RandomizedRunner.java:907)
	at com.carrotsearch.randomizedtesting.RandomizedRunner$9.evaluate(RandomizedRunner.java:943)
	at com.carrotsearch.randomizedtesting.RandomizedRunner$10.evaluate(RandomizedRunner.java:957)
	at com.carrotsearch.randomizedtesting.rules.SystemPropertiesRestoreRule$1.evaluate(SystemPropertiesRestoreRule.java:57)
	at org.apache.lucene.util.TestRuleSetupTeardownChained$1.evaluate(TestRuleSetupTeardownChained.java:49)
	at org.apache.lucene.util.AbstractBeforeAfterRule$1.evaluate(AbstractBeforeAfterRule.java:45)
	at org.apache.lucene.util.TestRuleThreadAndTestName$1.evaluate(TestRuleThreadAndTestName.java:48)
	at org.apache.lucene.util.TestRuleIgnoreAfterMaxFailures$1.evaluate(TestRuleIgnoreAfterMaxFailures.java:64)
	at org.apache.lucene.util.TestRuleMarkFailure$1.evaluate(TestRuleMarkFailure.java:47)
	at com.carrotsearch.randomizedtesting.rules.StatementAdapter.evaluate(StatementAdapter.java:36)
	at com.carrotsearch.randomizedtesting.ThreadLeakControl$StatementRunner.run(ThreadLeakControl.java:367)
	at com.carrotsearch.randomizedtesting.ThreadLeakControl.forkTimeoutingTask(ThreadLeakControl.java:811)
	at com.carrotsearch.randomizedtesting.ThreadLeakControl$3.evaluate(ThreadLeakControl.java:462)
	at com.carrotsearch.randomizedtesting.RandomizedRunner.runSingleTest(RandomizedRunner.java:916)
	at com.carrotsearch.randomizedtesting.RandomizedRunner$5.evaluate(RandomizedRunner.java:802)
	at com.carrotsearch.randomizedtesting.RandomizedRunner$6.evaluate(RandomizedRunner.java:852)
	at com.carrotsearch.randomizedtesting.RandomizedRunner$7.evaluate(RandomizedRunner.java:863)
	at com.carrotsearch.randomizedtesting.rules.StatementAdapter.evaluate(StatementAdapter.java:36)
	at com.carrotsearch.randomizedtesting.rules.SystemPropertiesRestoreRule$1.evaluate(SystemPropertiesRestoreRule.java:57)
	at org.apache.lucene.util.AbstractBeforeAfterRule$1.evaluate(AbstractBeforeAfterRule.java:45)
	at com.carrotsearch.randomizedtesting.rules.StatementAdapter.evaluate(StatementAdapter.java:36)
	at org.apache.lucene.util.TestRuleStoreClassName$1.evaluate(TestRuleStoreClassName.java:41)
	at com.carrotsearch.randomizedtesting.rules.NoShadowingOrOverridesOnMethodsRule$1.evaluate(NoShadowingOrOverridesOnMethodsRule.java:40)
	at com.carrotsearch.randomizedtesting.rules.NoShadowingOrOverridesOnMethodsRule$1.evaluate(NoShadowingOrOverridesOnMethodsRule.java:40)
	at com.carrotsearch.randomizedtesting.rules.StatementAdapter.evaluate(StatementAdapter.java:36)
	at com.carrotsearch.randomizedtesting.rules.StatementAdapter.evaluate(StatementAdapter.java:36)
	at org.apache.lucene.util.TestRuleAssertionsRequired$1.evaluate(TestRuleAssertionsRequired.java:53)
	at org.apache.lucene.util.TestRuleMarkFailure$1.evaluate(TestRuleMarkFailure.java:47)
	at org.apache.lucene.util.TestRuleIgnoreAfterMaxFailures$1.evaluate(TestRuleIgnoreAfterMaxFailures.java:64)
	at org.apache.lucene.util.TestRuleIgnoreTestSuites$1.evaluate(TestRuleIgnoreTestSuites.java:54)
	at com.carrotsearch.randomizedtesting.rules.StatementAdapter.evaluate(StatementAdapter.java:36)
	at com.carrotsearch.randomizedtesting.ThreadLeakControl$StatementRunner.run(ThreadLeakControl.java:367)
	at java.base/java.lang.Thread.run(Thread.java:844)




Build Log:
[...truncated 12132 lines...]
   [junit4] Suite: org.apache.solr.handler.admin.MBeansHandlerTest
   [junit4]   2> Creating dataDir: /home/jenkins/workspace/Lucene-Solr-6.4-Linux/solr/build/solr-core/test/J0/temp/solr.handler.admin.MBeansHandlerTest_BC74C209A4B22B48-001/init-core-data-001
   [junit4]   2> 1384513 INFO  (SUITE-MBeansHandlerTest-seed#[BC74C209A4B22B48]-worker)
[    ] o.a.s.SolrTestCaseJ4 Randomized ssl (false) and clientAuth (false) via: @org.apache.solr.util.RandomizeSSL(reason="",
ssl=0.0/0.0, value=0.0/0.0, clientAuth=0.0/0.0)
   [junit4]   2> 1384514 INFO  (SUITE-MBeansHandlerTest-seed#[BC74C209A4B22B48]-worker)
[    ] o.a.s.SolrTestCaseJ4 ####initCore
   [junit4]   2> 1384515 INFO  (SUITE-MBeansHandlerTest-seed#[BC74C209A4B22B48]-worker)
[    ] o.a.s.c.SolrResourceLoader [null] Added 2 libs to classloader, from paths: [/home/jenkins/workspace/Lucene-Solr-6.4-Linux/solr/core/src/test-files/solr/collection1/lib,
/home/jenkins/workspace/Lucene-Solr-6.4-Linux/solr/core/src/test-files/solr/collection1/lib/classes]
   [junit4]   2> 1384602 WARN  (SUITE-MBeansHandlerTest-seed#[BC74C209A4B22B48]-worker)
[    ] o.a.s.c.Config Beginning with Solr 5.5, <mergePolicy> is deprecated, use <mergePolicyFactory>
instead.
   [junit4]   2> 1384603 INFO  (SUITE-MBeansHandlerTest-seed#[BC74C209A4B22B48]-worker)
[    ] o.a.s.c.SolrConfig Using Lucene MatchVersion: 6.4.1
   [junit4]   2> 1384621 INFO  (SUITE-MBeansHandlerTest-seed#[BC74C209A4B22B48]-worker)
[    ] o.a.s.s.IndexSchema [null] Schema name=test
   [junit4]   2> 1384683 WARN  (SUITE-MBeansHandlerTest-seed#[BC74C209A4B22B48]-worker)
[    ] o.a.s.s.IndexSchema [null] default search field in schema is text. WARNING: Deprecated,
please use 'df' on request instead.
   [junit4]   2> 1384685 INFO  (SUITE-MBeansHandlerTest-seed#[BC74C209A4B22B48]-worker)
[    ] o.a.s.s.IndexSchema Loaded schema test/1.0 with uniqueid field id
   [junit4]   2> 1384708 INFO  (SUITE-MBeansHandlerTest-seed#[BC74C209A4B22B48]-worker)
[    ] o.a.s.u.UpdateShardHandler Creating UpdateShardHandler HTTP client with params: socketTimeout=30000&connTimeout=30000&retry=true
   [junit4]   2> 1384711 WARN  (SUITE-MBeansHandlerTest-seed#[BC74C209A4B22B48]-worker)
[    ] o.a.s.m.r.SolrJmxReporter No serviceUrl or agentId was configured, using first MBeanServer.
   [junit4]   2> 1384713 INFO  (SUITE-MBeansHandlerTest-seed#[BC74C209A4B22B48]-worker)
[    ] o.a.s.m.r.SolrJmxReporter JMX monitoring enabled at server: com.sun.jmx.mbeanserver.JmxMBeanServer@19fbf47
   [junit4]   2> 1384713 WARN  (SUITE-MBeansHandlerTest-seed#[BC74C209A4B22B48]-worker)
[    ] o.a.s.m.r.SolrJmxReporter No serviceUrl or agentId was configured, using first MBeanServer.
   [junit4]   2> 1384716 INFO  (SUITE-MBeansHandlerTest-seed#[BC74C209A4B22B48]-worker)
[    ] o.a.s.m.r.SolrJmxReporter JMX monitoring enabled at server: com.sun.jmx.mbeanserver.JmxMBeanServer@19fbf47
   [junit4]   2> 1384717 WARN  (SUITE-MBeansHandlerTest-seed#[BC74C209A4B22B48]-worker)
[    ] o.a.s.m.r.SolrJmxReporter No serviceUrl or agentId was configured, using first MBeanServer.
   [junit4]   2> 1384717 INFO  (SUITE-MBeansHandlerTest-seed#[BC74C209A4B22B48]-worker)
[    ] o.a.s.m.r.SolrJmxReporter JMX monitoring enabled at server: com.sun.jmx.mbeanserver.JmxMBeanServer@19fbf47
   [junit4]   2> 1384719 INFO  (coreLoadExecutor-4694-thread-1) [    ] o.a.s.c.SolrResourceLoader
[null] Added 2 libs to classloader, from paths: [/home/jenkins/workspace/Lucene-Solr-6.4-Linux/solr/core/src/test-files/solr/collection1/lib,
/home/jenkins/workspace/Lucene-Solr-6.4-Linux/solr/core/src/test-files/solr/collection1/lib/classes]
   [junit4]   2> 1384796 WARN  (coreLoadExecutor-4694-thread-1) [    ] o.a.s.c.Config Beginning
with Solr 5.5, <mergePolicy> is deprecated, use <mergePolicyFactory> instead.
   [junit4]   2> 1384797 INFO  (coreLoadExecutor-4694-thread-1) [    ] o.a.s.c.SolrConfig
Using Lucene MatchVersion: 6.4.1
   [junit4]   2> 1384816 INFO  (coreLoadExecutor-4694-thread-1) [    ] o.a.s.s.IndexSchema
[collection1] Schema name=test
   [junit4]   2> 1384869 WARN  (coreLoadExecutor-4694-thread-1) [    ] o.a.s.s.IndexSchema
[collection1] default search field in schema is text. WARNING: Deprecated, please use 'df'
on request instead.
   [junit4]   2> 1384875 INFO  (coreLoadExecutor-4694-thread-1) [    ] o.a.s.s.IndexSchema
Loaded schema test/1.0 with uniqueid field id
   [junit4]   2> 1384895 INFO  (coreLoadExecutor-4694-thread-1) [    ] o.a.s.c.CoreContainer
Creating SolrCore 'collection1' using configuration from instancedir /home/jenkins/workspace/Lucene-Solr-6.4-Linux/solr/core/src/test-files/solr/collection1
   [junit4]   2> 1384895 WARN  (coreLoadExecutor-4694-thread-1) [    ] o.a.s.m.r.SolrJmxReporter
No serviceUrl or agentId was configured, using first MBeanServer.
   [junit4]   2> 1384895 INFO  (coreLoadExecutor-4694-thread-1) [    ] o.a.s.m.r.SolrJmxReporter
JMX monitoring enabled at server: com.sun.jmx.mbeanserver.JmxMBeanServer@19fbf47
   [junit4]   2> 1384895 INFO  (coreLoadExecutor-4694-thread-1) [    ] o.a.s.c.SolrCore
[[collection1] ] Opening new SolrCore at [/home/jenkins/workspace/Lucene-Solr-6.4-Linux/solr/core/src/test-files/solr/collection1],
dataDir=[/home/jenkins/workspace/Lucene-Solr-6.4-Linux/solr/build/solr-core/test/J0/temp/solr.handler.admin.MBeansHandlerTest_BC74C209A4B22B48-001/init-core-data-001/]
   [junit4]   2> 1384896 INFO  (coreLoadExecutor-4694-thread-1) [    ] o.a.s.c.JmxMonitoredMap
JMX monitoring is enabled. Adding Solr mbeans to JMX Server: com.sun.jmx.mbeanserver.JmxMBeanServer@19fbf47
   [junit4]   2> 1384897 INFO  (coreLoadExecutor-4694-thread-1) [    ] o.a.s.u.RandomMergePolicy
RandomMergePolicy wrapping class org.apache.lucene.index.TieredMergePolicy: [TieredMergePolicy:
maxMergeAtOnce=46, maxMergeAtOnceExplicit=20, maxMergedSegmentMB=69.330078125, floorSegmentMB=0.4287109375,
forceMergeDeletesPctAllowed=27.745096336385796, segmentsPerTier=17.0, maxCFSSegmentSizeMB=8.796093022207999E12,
noCFSRatio=1.0
   [junit4]   2> 1384918 INFO  (coreLoadExecutor-4694-thread-1) [    ] o.a.s.u.UpdateHandler
Using UpdateLog implementation: org.apache.solr.update.UpdateLog
   [junit4]   2> 1384918 INFO  (coreLoadExecutor-4694-thread-1) [    ] o.a.s.u.UpdateLog
Initializing UpdateLog: dataDir= defaultSyncLevel=FLUSH numRecordsToKeep=100 maxNumLogsToKeep=10
numVersionBuckets=65536
   [junit4]   2> 1384919 INFO  (coreLoadExecutor-4694-thread-1) [    ] o.a.s.u.CommitTracker
Hard AutoCommit: disabled
   [junit4]   2> 1384919 INFO  (coreLoadExecutor-4694-thread-1) [    ] o.a.s.u.CommitTracker
Soft AutoCommit: disabled
   [junit4]   2> 1384920 INFO  (coreLoadExecutor-4694-thread-1) [    ] o.a.s.u.RandomMergePolicy
RandomMergePolicy wrapping class org.apache.lucene.index.TieredMergePolicy: [TieredMergePolicy:
maxMergeAtOnce=42, maxMergeAtOnceExplicit=37, maxMergedSegmentMB=86.9619140625, floorSegmentMB=1.3037109375,
forceMergeDeletesPctAllowed=28.315239341927303, segmentsPerTier=48.0, maxCFSSegmentSizeMB=8.796093022207999E12,
noCFSRatio=0.0
   [junit4]   2> 1384920 INFO  (coreLoadExecutor-4694-thread-1) [    ] o.a.s.s.SolrIndexSearcher
Opening [Searcher@2d5118[collection1] main]
   [junit4]   2> 1384921 INFO  (coreLoadExecutor-4694-thread-1) [    ] o.a.s.h.c.SpellCheckComponent
Initializing spell checkers
   [junit4]   2> 1384966 INFO  (coreLoadExecutor-4694-thread-1) [    ] o.a.s.s.DirectSolrSpellChecker
init: {name=direct,classname=DirectSolrSpellChecker,field=lowerfilt,minQueryLength=3}
   [junit4]   2> 1385283 INFO  (coreLoadExecutor-4694-thread-1) [    ] o.a.s.h.ReplicationHandler
Commits will be reserved for  10000
   [junit4]   2> 1385284 INFO  (searcherExecutor-4695-thread-1) [    ] o.a.s.h.c.SpellCheckComponent
Loading spell index for spellchecker: default
   [junit4]   2> 1385285 INFO  (coreLoadExecutor-4694-thread-1) [    ] o.a.s.u.UpdateLog
Could not find max version in index or recent updates, using new clock 1558260703985401856
   [junit4]   2> 1385285 INFO  (searcherExecutor-4695-thread-1) [    ] o.a.s.h.c.SpellCheckComponent
Loading spell index for spellchecker: direct
   [junit4]   2> 1385285 INFO  (searcherExecutor-4695-thread-1) [    ] o.a.s.h.c.SpellCheckComponent
Loading spell index for spellchecker: wordbreak
   [junit4]   2> 1385285 INFO  (searcherExecutor-4695-thread-1) [    ] o.a.s.h.c.SpellCheckComponent
Loading spell index for spellchecker: multipleFields
   [junit4]   2> 1385287 INFO  (searcherExecutor-4695-thread-1) [    ] o.a.s.h.c.SpellCheckComponent
Loading spell index for spellchecker: jarowinkler
   [junit4]   2> 1385288 INFO  (SUITE-MBeansHandlerTest-seed#[BC74C209A4B22B48]-worker)
[    ] o.a.s.SolrTestCaseJ4 ####initCore end
   [junit4]   2> 1385289 INFO  (searcherExecutor-4695-thread-1) [    ] o.a.s.h.c.SpellCheckComponent
Loading spell index for spellchecker: external
   [junit4]   2> 1385290 INFO  (TEST-MBeansHandlerTest.testXMLDiffWithExternalEntity-seed#[BC74C209A4B22B48])
[    ] o.a.s.SolrTestCaseJ4 ###Starting testXMLDiffWithExternalEntity
   [junit4]   2> 1385291 INFO  (searcherExecutor-4695-thread-1) [    ] o.a.s.h.c.SpellCheckComponent
Loading spell index for spellchecker: freq
   [junit4]   2> 1385293 INFO  (searcherExecutor-4695-thread-1) [    ] o.a.s.h.c.SpellCheckComponent
Loading spell index for spellchecker: fqcn
   [junit4]   2> 1385295 INFO  (searcherExecutor-4695-thread-1) [    ] o.a.s.h.c.SpellCheckComponent
Loading spell index for spellchecker: perDict
   [junit4]   2> 1385296 INFO  (searcherExecutor-4695-thread-1) [    ] o.a.s.c.SolrCore
[collection1] Registered new searcher Searcher@2d5118[collection1] main{ExitableDirectoryReader(UninvertingDirectoryReader())}
   [junit4]   2> 1385300 INFO  (TEST-MBeansHandlerTest.testXMLDiffWithExternalEntity-seed#[BC74C209A4B22B48])
[    ] o.a.s.SolrTestCaseJ4 ###Ending testXMLDiffWithExternalEntity
   [junit4]   2> 1385302 INFO  (TEST-MBeansHandlerTest.testBackCompatNames-seed#[BC74C209A4B22B48])
[    ] o.a.s.SolrTestCaseJ4 ###Starting testBackCompatNames
   [junit4]   2> 1385303 INFO  (TEST-MBeansHandlerTest.testBackCompatNames-seed#[BC74C209A4B22B48])
[    ] o.a.s.c.S.Request [collection1]  webapp=null path=null params={qt=/admin/mbeans&wt=xml}
status=0 QTime=0
   [junit4]   2> 1385310 INFO  (TEST-MBeansHandlerTest.testBackCompatNames-seed#[BC74C209A4B22B48])
[    ] o.a.s.c.S.Request [collection1]  webapp=null path=null params={qt=/admin/mbeans&cat=QUERYHANDLER&wt=xml}
status=0 QTime=0
   [junit4]   2> 1385312 INFO  (TEST-MBeansHandlerTest.testBackCompatNames-seed#[BC74C209A4B22B48])
[    ] o.a.s.c.S.Request [collection1]  webapp=null path=null params={qt=/admin/mbeans&cat=UPDATE&wt=xml}
status=0 QTime=0
   [junit4]   2> 1385312 INFO  (TEST-MBeansHandlerTest.testBackCompatNames-seed#[BC74C209A4B22B48])
[    ] o.a.s.SolrTestCaseJ4 ###Ending testBackCompatNames
   [junit4]   2> 1385313 INFO  (TEST-MBeansHandlerTest.testDiff-seed#[BC74C209A4B22B48])
[    ] o.a.s.SolrTestCaseJ4 ###Starting testDiff
   [junit4]   2> 1385314 INFO  (TEST-MBeansHandlerTest.testDiff-seed#[BC74C209A4B22B48])
[    ] o.a.s.c.S.Request [collection1]  webapp=null path=null params={qt=/admin/mbeans&stats=true&wt=xml}
status=0 QTime=0
   [junit4]   2> 1385334 INFO  (TEST-MBeansHandlerTest.testDiff-seed#[BC74C209A4B22B48])
[    ] o.a.s.c.S.Request [collection1]  webapp=null path=null params={qt=/admin/mbeans&stats=true&diff=true&wt=xml}
status=0 QTime=18
   [junit4]   2> 1385336 INFO  (TEST-MBeansHandlerTest.testDiff-seed#[BC74C209A4B22B48])
[    ] o.a.s.SolrTestCaseJ4 ###Ending testDiff
   [junit4]   2> NOTE: reproduce with: ant test  -Dtestcase=MBeansHandlerTest -Dtests.method=testDiff
-Dtests.seed=BC74C209A4B22B48 -Dtests.multiplier=3 -Dtests.slow=true -Dtests.locale=lb -Dtests.timezone=Pacific/Samoa
-Dtests.asserts=true -Dtests.file.encoding=UTF-8
   [junit4] FAILURE 0.03s J0 | MBeansHandlerTest.testDiff <<<
   [junit4]    > Throwable #1: org.junit.ComparisonFailure: expected:<Was: [1, Now:
2], Delta: 1> but was:<Was: [4, Now: 5], Delta: 1>
   [junit4]    > 	at __randomizedtesting.SeedInfo.seed([BC74C209A4B22B48:79620692B4041328]:0)
   [junit4]    > 	at org.apache.solr.handler.admin.MBeansHandlerTest.testDiff(MBeansHandlerTest.java:63)
   [junit4]    > 	at java.base/jdk.internal.reflect.NativeMethodAccessorImpl.invoke0(Native
Method)
   [junit4]    > 	at java.base/jdk.internal.reflect.NativeMethodAccessorImpl.invoke(NativeMethodAccessorImpl.java:62)
   [junit4]    > 	at java.base/jdk.internal.reflect.DelegatingMethodAccessorImpl.invoke(DelegatingMethodAccessorImpl.java:43)
   [junit4]    > 	at java.base/java.lang.reflect.Method.invoke(Method.java:543)
   [junit4]    > 	at java.base/java.lang.Thread.run(Thread.java:844)
   [junit4]   2> 1385339 INFO  (SUITE-MBeansHandlerTest-seed#[BC74C209A4B22B48]-worker)
[    ] o.a.s.SolrTestCaseJ4 ###deleteCore
   [junit4]   2> 1385339 INFO  (SUITE-MBeansHandlerTest-seed#[BC74C209A4B22B48]-worker)
[    ] o.a.s.c.CoreContainer Shutting down CoreContainer instance=14306148
   [junit4]   2> 1385339 INFO  (coreCloseExecutor-4700-thread-1) [    ] o.a.s.c.SolrCore
[collection1]  CLOSING SolrCore org.apache.solr.core.SolrCore@10343e3
   [junit4]   2> 1385367 INFO  (coreCloseExecutor-4700-thread-1) [    ] o.a.s.m.SolrMetricManager
Closing metric reporters for: solr.core.collection1
   [junit4]   2> 1385369 INFO  (SUITE-MBeansHandlerTest-seed#[BC74C209A4B22B48]-worker)
[    ] o.a.s.m.SolrMetricManager Closing metric reporters for: solr.node
   [junit4]   2> NOTE: leaving temporary files on disk at: /home/jenkins/workspace/Lucene-Solr-6.4-Linux/solr/build/solr-core/test/J0/temp/solr.handler.admin.MBeansHandlerTest_BC74C209A4B22B48-001
   [junit4]   2> NOTE: test params are: codec=Asserting(Lucene62): {}, docValues:{}, maxPointsInLeafNode=1335,
maxMBSortInHeap=5.231969261353703, sim=RandomSimilarity(queryNorm=true,coord=crazy): {}, locale=lb,
timezone=Pacific/Samoa
   [junit4]   2> NOTE: Linux 4.4.0-53-generic i386/Oracle Corporation 9-ea (32-bit)/cpus=12,threads=1,free=121991584,total=352059392
   [junit4]   2> NOTE: All tests run in this JVM: [HLLUtilTest, TestSolrCloudWithHadoopAuthPlugin,
ConcurrentDeleteAndCreateCollectionTest, HdfsThreadLeakTest, TestReplicationHandlerBackup,
TestCrossCoreJoin, TestSolrCLIRunExample, DirectoryFactoryTest, DeleteShardTest, SolrSlf4jReporterTest,
HdfsCollectionsAPIDistributedZkTest, DistributedDebugComponentTest, SecurityConfHandlerTest,
TestCryptoKeys, TestRandomFlRTGCloud, DistribDocExpirationUpdateProcessorTest, TestSha256AuthenticationProvider,
DistributedFacetPivotLargeTest, AnalysisAfterCoreReloadTest, TestReplicationHandler, SolrCoreTest,
AddSchemaFieldsUpdateProcessorFactoryTest, TestDocumentBuilder, PathHierarchyTokenizerFactoryTest,
RequiredFieldsTest, PolyFieldTest, OutputWriterTest, UUIDFieldTest, ReplicaListTransformerTest,
TestComponentsName, CloudExitableDirectoryReaderTest, TestNRTOpen, UniqFieldsUpdateProcessorFactoryTest,
TestGraphMLResponseWriter, CursorPagingTest, BasicZkTest, TestStressLucene, TestConfigSetsAPI,
BigEndianAscendingWordDeserializerTest, CreateCollectionCleanupTest, PeerSyncTest, TestFaceting,
TestFieldTypeCollectionResource, QueryEqualityTest, TestCustomDocTransformer, AnalysisErrorHandlingTest,
SolrGangliaReporterTest, TestBadConfig, TestEmbeddedSolrServerConstructors, TestChildDocTransformer,
SyncSliceTest, TestCorePropertiesReload, TestUniqueKeyFieldResource, AlternateDirectoryTest,
TestHighlightDedupGrouping, TestFunctionQuery, TestDownShardTolerantSearch, NumericFieldsTest,
BasicDistributedZkTest, RollingRestartTest, TestBlobHandler, DistributedQueryElevationComponentTest,
HighlighterConfigTest, DeleteLastCustomShardedReplicaTest, QueryResultKeyTest, DistributedFacetPivotSmallTest,
TestLRUStatsCache, PreAnalyzedUpdateProcessorTest, TestDynamicFieldResource, SolrXmlInZkTest,
TestExceedMaxTermLength, TestCSVLoader, TestPerFieldSimilarity, ClusterStateTest, TestCopyFieldCollectionResource,
DateRangeFieldTest, TestFieldSortValues, TestFieldCache, TestFastLRUCache, HdfsBasicDistributedZkTest,
TestHashQParserPlugin, TriLevelCompositeIdRoutingTest, HttpPartitionTest, DefaultValueUpdateProcessorTest,
SignatureUpdateProcessorFactoryTest, ScriptEngineTest, TestSchemalessBufferedUpdates, TestFastWriter,
TestIntervalFaceting, TestLocalFSCloudBackupRestore, NotRequiredUniqueKeyTest, SimpleCollectionCreateDeleteTest,
ExternalFileFieldSortTest, TestFileDictionaryLookup, TestAtomicUpdateErrorCases, BlockJoinFacetRandomTest,
TestCloudRecovery, TestSolrCloudSnapshots, TestSortByMinMaxFunction, ResourceLoaderTest, CollectionTooManyReplicasTest,
TestMissingGroups, TestReplicaProperties, TestSSLRandomization, TestSolrConfigHandler, TestSubQueryTransformerDistrib,
QueryElevationComponentTest, TestHashPartitioner, TestRealTimeGet, TestStressReorder, TestJoin,
DistributedTermsComponentTest, SpellCheckComponentTest, DirectUpdateHandlerTest, CurrencyFieldXmlFileTest,
SuggesterFSTTest, SolrRequestParserTest, TestFoldingMultitermQuery, SuggesterTSTTest, SuggesterWFSTTest,
SchemaVersionSpecificBehaviorTest, TestPseudoReturnFields, TestSolrDeletionPolicy1, DebugComponentTest,
IndexBasedSpellCheckerTest, TestReversedWildcardFilterFactory, TestOmitPositions, XmlUpdateRequestHandlerTest,
TestValueSourceCache, FastVectorHighlighterTest, RegexBoostProcessorTest, TestJmxIntegration,
MBeansHandlerTest]
   [junit4] Completed [418/680 (1!)] on J0 in 0.89s, 3 tests, 1 failure <<< FAILURES!

[...truncated 52377 lines...]


Mime
View raw message