lucene-dev mailing list archives

Site index · List index
Message view « Date » · « Thread »
Top « Date » · « Thread »
From Policeman Jenkins Server <jenk...@thetaphi.de>
Subject [JENKINS-EA] Lucene-Solr-6.x-Linux (32bit/jdk-9-ea+153) - Build # 2783 - Still Unstable!
Date Thu, 02 Feb 2017 11:25:15 GMT
Build: https://jenkins.thetaphi.de/job/Lucene-Solr-6.x-Linux/2783/
Java: 32bit/jdk-9-ea+153 -server -XX:+UseG1GC

1 tests failed.
FAILED:  org.apache.solr.cloud.OverseerTaskQueueTest.testPeekElements

Error Message:


Stack Trace:
java.lang.AssertionError
	at __randomizedtesting.SeedInfo.seed([7912D314CDE40164:843C69351DDD5579]:0)
	at org.junit.Assert.fail(Assert.java:92)
	at org.junit.Assert.assertTrue(Assert.java:43)
	at org.junit.Assert.assertTrue(Assert.java:54)
	at org.apache.solr.cloud.DistributedQueueTest.testPeekElements(DistributedQueueTest.java:182)
	at java.base/jdk.internal.reflect.NativeMethodAccessorImpl.invoke0(Native Method)
	at java.base/jdk.internal.reflect.NativeMethodAccessorImpl.invoke(NativeMethodAccessorImpl.java:62)
	at java.base/jdk.internal.reflect.DelegatingMethodAccessorImpl.invoke(DelegatingMethodAccessorImpl.java:43)
	at java.base/java.lang.reflect.Method.invoke(Method.java:543)
	at com.carrotsearch.randomizedtesting.RandomizedRunner.invoke(RandomizedRunner.java:1713)
	at com.carrotsearch.randomizedtesting.RandomizedRunner$8.evaluate(RandomizedRunner.java:907)
	at com.carrotsearch.randomizedtesting.RandomizedRunner$9.evaluate(RandomizedRunner.java:943)
	at com.carrotsearch.randomizedtesting.RandomizedRunner$10.evaluate(RandomizedRunner.java:957)
	at com.carrotsearch.randomizedtesting.rules.SystemPropertiesRestoreRule$1.evaluate(SystemPropertiesRestoreRule.java:57)
	at org.apache.lucene.util.TestRuleSetupTeardownChained$1.evaluate(TestRuleSetupTeardownChained.java:49)
	at org.apache.lucene.util.AbstractBeforeAfterRule$1.evaluate(AbstractBeforeAfterRule.java:45)
	at org.apache.lucene.util.TestRuleThreadAndTestName$1.evaluate(TestRuleThreadAndTestName.java:48)
	at org.apache.lucene.util.TestRuleIgnoreAfterMaxFailures$1.evaluate(TestRuleIgnoreAfterMaxFailures.java:64)
	at org.apache.lucene.util.TestRuleMarkFailure$1.evaluate(TestRuleMarkFailure.java:47)
	at com.carrotsearch.randomizedtesting.rules.StatementAdapter.evaluate(StatementAdapter.java:36)
	at com.carrotsearch.randomizedtesting.ThreadLeakControl$StatementRunner.run(ThreadLeakControl.java:368)
	at com.carrotsearch.randomizedtesting.ThreadLeakControl.forkTimeoutingTask(ThreadLeakControl.java:817)
	at com.carrotsearch.randomizedtesting.ThreadLeakControl$3.evaluate(ThreadLeakControl.java:468)
	at com.carrotsearch.randomizedtesting.RandomizedRunner.runSingleTest(RandomizedRunner.java:916)
	at com.carrotsearch.randomizedtesting.RandomizedRunner$5.evaluate(RandomizedRunner.java:802)
	at com.carrotsearch.randomizedtesting.RandomizedRunner$6.evaluate(RandomizedRunner.java:852)
	at com.carrotsearch.randomizedtesting.RandomizedRunner$7.evaluate(RandomizedRunner.java:863)
	at com.carrotsearch.randomizedtesting.rules.StatementAdapter.evaluate(StatementAdapter.java:36)
	at com.carrotsearch.randomizedtesting.rules.SystemPropertiesRestoreRule$1.evaluate(SystemPropertiesRestoreRule.java:57)
	at org.apache.lucene.util.AbstractBeforeAfterRule$1.evaluate(AbstractBeforeAfterRule.java:45)
	at com.carrotsearch.randomizedtesting.rules.StatementAdapter.evaluate(StatementAdapter.java:36)
	at org.apache.lucene.util.TestRuleStoreClassName$1.evaluate(TestRuleStoreClassName.java:41)
	at com.carrotsearch.randomizedtesting.rules.NoShadowingOrOverridesOnMethodsRule$1.evaluate(NoShadowingOrOverridesOnMethodsRule.java:40)
	at com.carrotsearch.randomizedtesting.rules.NoShadowingOrOverridesOnMethodsRule$1.evaluate(NoShadowingOrOverridesOnMethodsRule.java:40)
	at com.carrotsearch.randomizedtesting.rules.StatementAdapter.evaluate(StatementAdapter.java:36)
	at com.carrotsearch.randomizedtesting.rules.StatementAdapter.evaluate(StatementAdapter.java:36)
	at org.apache.lucene.util.TestRuleAssertionsRequired$1.evaluate(TestRuleAssertionsRequired.java:53)
	at org.apache.lucene.util.TestRuleMarkFailure$1.evaluate(TestRuleMarkFailure.java:47)
	at org.apache.lucene.util.TestRuleIgnoreAfterMaxFailures$1.evaluate(TestRuleIgnoreAfterMaxFailures.java:64)
	at org.apache.lucene.util.TestRuleIgnoreTestSuites$1.evaluate(TestRuleIgnoreTestSuites.java:54)
	at com.carrotsearch.randomizedtesting.rules.StatementAdapter.evaluate(StatementAdapter.java:36)
	at com.carrotsearch.randomizedtesting.ThreadLeakControl$StatementRunner.run(ThreadLeakControl.java:368)
	at java.base/java.lang.Thread.run(Thread.java:844)




Build Log:
[...truncated 11593 lines...]
   [junit4] Suite: org.apache.solr.cloud.OverseerTaskQueueTest
   [junit4]   2> Creating dataDir: /home/jenkins/workspace/Lucene-Solr-6.x-Linux/solr/build/solr-core/test/J0/temp/solr.cloud.OverseerTaskQueueTest_7912D314CDE40164-001/init-core-data-001
   [junit4]   2> 815250 INFO  (SUITE-OverseerTaskQueueTest-seed#[7912D314CDE40164]-worker)
[    ] o.a.s.SolrTestCaseJ4 Randomized ssl (false) and clientAuth (false) via: @org.apache.solr.util.RandomizeSSL(reason="",
ssl=0.0/0.0, value=0.0/0.0, clientAuth=0.0/0.0)
   [junit4]   2> 815251 INFO  (TEST-OverseerTaskQueueTest.testPeekElements-seed#[7912D314CDE40164])
[    ] o.a.s.SolrTestCaseJ4 ###Starting testPeekElements
   [junit4]   2> 815251 INFO  (TEST-OverseerTaskQueueTest.testPeekElements-seed#[7912D314CDE40164])
[    ] o.a.s.c.ZkTestServer STARTING ZK TEST SERVER
   [junit4]   2> 815251 INFO  (Thread-1532) [    ] o.a.s.c.ZkTestServer client port:0.0.0.0/0.0.0.0:0
   [junit4]   2> 815251 INFO  (Thread-1532) [    ] o.a.s.c.ZkTestServer Starting server
   [junit4]   2> 815351 INFO  (TEST-OverseerTaskQueueTest.testPeekElements-seed#[7912D314CDE40164])
[    ] o.a.s.c.ZkTestServer start zk server on port:40970
   [junit4]   2> 818048 INFO  (TEST-OverseerTaskQueueTest.testPeekElements-seed#[7912D314CDE40164])
[    ] o.a.s.SolrTestCaseJ4 ###Ending testPeekElements
   [junit4]   2> 818065 INFO  (TEST-OverseerTaskQueueTest.testPeekElements-seed#[7912D314CDE40164])
[    ] o.a.s.c.ZkTestServer connecting to 127.0.0.1:40970 40970
   [junit4]   2> 818098 INFO  (Thread-1532) [    ] o.a.s.c.ZkTestServer connecting to 127.0.0.1:40970
40970
   [junit4]   2> NOTE: reproduce with: ant test  -Dtestcase=OverseerTaskQueueTest -Dtests.method=testPeekElements
-Dtests.seed=7912D314CDE40164 -Dtests.multiplier=3 -Dtests.slow=true -Dtests.locale=ksb -Dtests.timezone=America/Argentina/Mendoza
-Dtests.asserts=true -Dtests.file.encoding=US-ASCII
   [junit4] FAILURE 2.85s J0 | OverseerTaskQueueTest.testPeekElements <<<
   [junit4]    > Throwable #1: java.lang.AssertionError
   [junit4]    > 	at __randomizedtesting.SeedInfo.seed([7912D314CDE40164:843C69351DDD5579]:0)
   [junit4]    > 	at org.apache.solr.cloud.DistributedQueueTest.testPeekElements(DistributedQueueTest.java:182)
   [junit4]    > 	at java.base/jdk.internal.reflect.NativeMethodAccessorImpl.invoke0(Native
Method)
   [junit4]    > 	at java.base/jdk.internal.reflect.NativeMethodAccessorImpl.invoke(NativeMethodAccessorImpl.java:62)
   [junit4]    > 	at java.base/jdk.internal.reflect.DelegatingMethodAccessorImpl.invoke(DelegatingMethodAccessorImpl.java:43)
   [junit4]    > 	at java.base/java.lang.reflect.Method.invoke(Method.java:543)
   [junit4]    > 	at java.base/java.lang.Thread.run(Thread.java:844)
   [junit4]   2> 818102 INFO  (TEST-OverseerTaskQueueTest.testDistributedQueue-seed#[7912D314CDE40164])
[    ] o.a.s.SolrTestCaseJ4 ###Starting testDistributedQueue
   [junit4]   2> 818102 INFO  (TEST-OverseerTaskQueueTest.testDistributedQueue-seed#[7912D314CDE40164])
[    ] o.a.s.c.ZkTestServer STARTING ZK TEST SERVER
   [junit4]   2> 818102 INFO  (Thread-1533) [    ] o.a.s.c.ZkTestServer client port:0.0.0.0/0.0.0.0:0
   [junit4]   2> 818102 INFO  (Thread-1533) [    ] o.a.s.c.ZkTestServer Starting server
   [junit4]   2> 818202 INFO  (TEST-OverseerTaskQueueTest.testDistributedQueue-seed#[7912D314CDE40164])
[    ] o.a.s.c.ZkTestServer start zk server on port:45372
   [junit4]   2> 820212 INFO  (TEST-OverseerTaskQueueTest.testDistributedQueue-seed#[7912D314CDE40164])
[    ] o.a.s.SolrTestCaseJ4 ###Ending testDistributedQueue
   [junit4]   2> 820213 INFO  (TEST-OverseerTaskQueueTest.testDistributedQueue-seed#[7912D314CDE40164])
[    ] o.a.s.c.ZkTestServer connecting to 127.0.0.1:45372 45372
   [junit4]   2> 820308 INFO  (Thread-1533) [    ] o.a.s.c.ZkTestServer connecting to 127.0.0.1:45372
45372
   [junit4]   2> 820309 WARN  (Thread-1533) [    ] o.a.s.c.ZkTestServer Watch limit violations:

   [junit4]   2> Maximum concurrent children watches above limit:
   [junit4]   2> 
   [junit4]   2> 	5	/solr/distqueue/test
   [junit4]   2> 
   [junit4]   2> 820311 INFO  (TEST-OverseerTaskQueueTest.testDistributedQueueBlocking-seed#[7912D314CDE40164])
[    ] o.a.s.SolrTestCaseJ4 ###Starting testDistributedQueueBlocking
   [junit4]   2> 820312 INFO  (TEST-OverseerTaskQueueTest.testDistributedQueueBlocking-seed#[7912D314CDE40164])
[    ] o.a.s.c.ZkTestServer STARTING ZK TEST SERVER
   [junit4]   2> 820312 INFO  (Thread-1536) [    ] o.a.s.c.ZkTestServer client port:0.0.0.0/0.0.0.0:0
   [junit4]   2> 820312 INFO  (Thread-1536) [    ] o.a.s.c.ZkTestServer Starting server
   [junit4]   2> 820412 INFO  (TEST-OverseerTaskQueueTest.testDistributedQueueBlocking-seed#[7912D314CDE40164])
[    ] o.a.s.c.ZkTestServer start zk server on port:38100
   [junit4]   2> 821619 WARN  (zkCallback-3210-thread-2) [    ] o.a.s.c.c.ConnectionManager
Watcher org.apache.solr.common.cloud.ConnectionManager@185e94d name: ZooKeeperConnection Watcher:127.0.0.1:38100/solr
got event WatchedEvent state:Disconnected type:None path:null path: null type: None
   [junit4]   2> 821619 WARN  (zkCallback-3210-thread-2) [    ] o.a.s.c.c.ConnectionManager
zkClient has disconnected
   [junit4]   2> 823221 WARN  (zkCallback-3210-thread-2) [    ] o.a.s.c.c.ConnectionManager
Watcher org.apache.solr.common.cloud.ConnectionManager@185e94d name: ZooKeeperConnection Watcher:127.0.0.1:38100/solr
got event WatchedEvent state:Expired type:None path:null path: null type: None
   [junit4]   2> 823221 WARN  (zkCallback-3210-thread-2) [    ] o.a.s.c.c.ConnectionManager
Our previous ZooKeeper session was expired. Attempting to reconnect to recover relationship
with ZooKeeper...
   [junit4]   2> 823222 WARN  (zkCallback-3210-thread-2) [    ] o.a.s.c.c.DefaultConnectionStrategy
Connection expired - starting a new one...
   [junit4]   2> 823223 INFO  (zkCallback-3210-thread-2) [    ] o.a.s.c.c.ConnectionManager
Connection with ZooKeeper reestablished.
   [junit4]   2> 823223 INFO  (zkCallback-3210-thread-2) [    ] o.a.s.c.c.DefaultConnectionStrategy
Reconnected to ZooKeeper
   [junit4]   2> 823223 INFO  (zkCallback-3210-thread-2) [    ] o.a.s.c.c.ConnectionManager
Connected:true
   [junit4]   2> 824378 INFO  (TEST-OverseerTaskQueueTest.testDistributedQueueBlocking-seed#[7912D314CDE40164])
[    ] o.a.s.SolrTestCaseJ4 ###Ending testDistributedQueueBlocking
   [junit4]   2> 824378 INFO  (TEST-OverseerTaskQueueTest.testDistributedQueueBlocking-seed#[7912D314CDE40164])
[    ] o.a.s.c.ZkTestServer connecting to 127.0.0.1:38100 38100
   [junit4]   2> 824390 INFO  (Thread-1536) [    ] o.a.s.c.ZkTestServer connecting to 127.0.0.1:38100
38100
   [junit4]   2> 824391 WARN  (Thread-1536) [    ] o.a.s.c.ZkTestServer Watch limit violations:

   [junit4]   2> Maximum concurrent children watches above limit:
   [junit4]   2> 
   [junit4]   2> 	3	/solr/distqueue/test
   [junit4]   2> 
   [junit4]   2> 824393 INFO  (TEST-OverseerTaskQueueTest.testContainsTaskWithRequestId-seed#[7912D314CDE40164])
[    ] o.a.s.SolrTestCaseJ4 ###Starting testContainsTaskWithRequestId
   [junit4]   2> 824394 INFO  (TEST-OverseerTaskQueueTest.testContainsTaskWithRequestId-seed#[7912D314CDE40164])
[    ] o.a.s.c.ZkTestServer STARTING ZK TEST SERVER
   [junit4]   2> 824394 INFO  (Thread-1537) [    ] o.a.s.c.ZkTestServer client port:0.0.0.0/0.0.0.0:0
   [junit4]   2> 824394 INFO  (Thread-1537) [    ] o.a.s.c.ZkTestServer Starting server
   [junit4]   2> 824494 INFO  (TEST-OverseerTaskQueueTest.testContainsTaskWithRequestId-seed#[7912D314CDE40164])
[    ] o.a.s.c.ZkTestServer start zk server on port:41583
   [junit4]   2> 824502 INFO  (TEST-OverseerTaskQueueTest.testContainsTaskWithRequestId-seed#[7912D314CDE40164])
[    ] o.a.s.SolrTestCaseJ4 ###Ending testContainsTaskWithRequestId
   [junit4]   2> 824503 INFO  (TEST-OverseerTaskQueueTest.testContainsTaskWithRequestId-seed#[7912D314CDE40164])
[    ] o.a.s.c.ZkTestServer connecting to 127.0.0.1:41583 41583
   [junit4]   2> 824649 INFO  (Thread-1537) [    ] o.a.s.c.ZkTestServer connecting to 127.0.0.1:41583
41583
   [junit4]   2> 824651 INFO  (SUITE-OverseerTaskQueueTest-seed#[7912D314CDE40164]-worker)
[    ] o.a.s.SolrTestCaseJ4 ###deleteCore
   [junit4]   2> NOTE: leaving temporary files on disk at: /home/jenkins/workspace/Lucene-Solr-6.x-Linux/solr/build/solr-core/test/J0/temp/solr.cloud.OverseerTaskQueueTest_7912D314CDE40164-001
   [junit4]   2> Feb 02, 2017 10:49:17 AM com.carrotsearch.randomizedtesting.ThreadLeakControl
checkThreadLeaks
   [junit4]   2> WARNING: Will linger awaiting termination of 2 leaked thread(s).
   [junit4]   2> NOTE: test params are: codec=Asserting(Lucene62): {}, docValues:{}, maxPointsInLeafNode=378,
maxMBSortInHeap=6.305806856364235, sim=RandomSimilarity(queryNorm=false,coord=no): {}, locale=ksb,
timezone=America/Argentina/Mendoza
   [junit4]   2> NOTE: Linux 4.4.0-53-generic i386/Oracle Corporation 9-ea (32-bit)/cpus=12,threads=1,free=92483552,total=304087040
   [junit4]   2> NOTE: All tests run in this JVM: [LeaderFailureAfterFreshStartTest, ReturnFieldsTest,
TestScoreJoinQPScore, SuggestComponentTest, TestFieldTypeResource, AnalysisAfterCoreReloadTest,
TestJavabinTupleStreamParser, TestDynamicLoading, RequestLoggingTest, TestPHPSerializedResponseWriter,
DistributedSuggestComponentTest, NotRequiredUniqueKeyTest, SegmentsInfoRequestHandlerTest,
TestStressRecovery, BigEndianAscendingWordSerializerTest, TestCloudManagedSchema, TestBadConfig,
SaslZkACLProviderTest, HdfsRecoverLeaseTest, DistributedExpandComponentTest, SharedFSAutoReplicaFailoverUtilsTest,
CursorPagingTest, TestPivotHelperCode, TolerantUpdateProcessorTest, CdcrReplicationDistributedZkTest,
TestPKIAuthenticationPlugin, TestFieldCacheReopen, TestRealTimeGet, TestRestoreCore, TestHighlightDedupGrouping,
DistributedSpellCheckComponentTest, TestSolrCoreProperties, PreAnalyzedFieldManagedSchemaCloudTest,
TestExactSharedStatsCache, HdfsLockFactoryTest, OutputWriterTest, UniqFieldsUpdateProcessorFactoryTest,
TestCloudDeleteByQuery, TestStressLiveNodes, ClassificationUpdateProcessorTest, OverseerModifyCollectionTest,
RequiredFieldsTest, TestCodecSupport, MBeansHandlerTest, SolrGraphiteReporterTest, DisMaxRequestHandlerTest,
HighlighterConfigTest, TestReplicationHandler, TestUseDocValuesAsStored, TestSolrCoreParser,
TestFoldingMultitermQuery, TestShortCircuitedRequests, TestCollectionAPI, TestManagedStopFilterFactory,
TestFreeTextSuggestions, TestTestInjection, TestOnReconnectListenerSupport, TestRandomCollapseQParserPlugin,
TestDistributedSearch, DeleteShardTest, OverseerTaskQueueTest]
   [junit4] Completed [234/682 (1!)] on J0 in 9.92s, 4 tests, 1 failure <<< FAILURES!

[...truncated 52965 lines...]


Mime
View raw message