lucene-dev mailing list archives

Site index · List index
Message view « Date » · « Thread »
Top « Date » · « Thread »
From Policeman Jenkins Server <jenk...@thetaphi.de>
Subject [JENKINS] Lucene-Solr-6.x-MacOSX (64bit/jdk1.8.0) - Build # 679 - Still Unstable!
Date Thu, 02 Feb 2017 21:26:44 GMT
Build: https://jenkins.thetaphi.de/job/Lucene-Solr-6.x-MacOSX/679/
Java: 64bit/jdk1.8.0 -XX:+UseCompressedOops -XX:+UseG1GC

1 tests failed.
FAILED:  org.apache.solr.handler.admin.MBeansHandlerTest.testDiff

Error Message:
expected:<Was: [1, Now: 2], Delta: 1> but was:<Was: [4, Now: 5], Delta: 1>

Stack Trace:
org.junit.ComparisonFailure: expected:<Was: [1, Now: 2], Delta: 1> but was:<Was:
[4, Now: 5], Delta: 1>
	at __randomizedtesting.SeedInfo.seed([966FB6A6B9948EA5:5379723DA922B6C5]:0)
	at org.junit.Assert.assertEquals(Assert.java:125)
	at org.junit.Assert.assertEquals(Assert.java:147)
	at org.apache.solr.handler.admin.MBeansHandlerTest.testDiff(MBeansHandlerTest.java:63)
	at sun.reflect.NativeMethodAccessorImpl.invoke0(Native Method)
	at sun.reflect.NativeMethodAccessorImpl.invoke(NativeMethodAccessorImpl.java:62)
	at sun.reflect.DelegatingMethodAccessorImpl.invoke(DelegatingMethodAccessorImpl.java:43)
	at java.lang.reflect.Method.invoke(Method.java:498)
	at com.carrotsearch.randomizedtesting.RandomizedRunner.invoke(RandomizedRunner.java:1713)
	at com.carrotsearch.randomizedtesting.RandomizedRunner$8.evaluate(RandomizedRunner.java:907)
	at com.carrotsearch.randomizedtesting.RandomizedRunner$9.evaluate(RandomizedRunner.java:943)
	at com.carrotsearch.randomizedtesting.RandomizedRunner$10.evaluate(RandomizedRunner.java:957)
	at com.carrotsearch.randomizedtesting.rules.SystemPropertiesRestoreRule$1.evaluate(SystemPropertiesRestoreRule.java:57)
	at org.apache.lucene.util.TestRuleSetupTeardownChained$1.evaluate(TestRuleSetupTeardownChained.java:49)
	at org.apache.lucene.util.AbstractBeforeAfterRule$1.evaluate(AbstractBeforeAfterRule.java:45)
	at org.apache.lucene.util.TestRuleThreadAndTestName$1.evaluate(TestRuleThreadAndTestName.java:48)
	at org.apache.lucene.util.TestRuleIgnoreAfterMaxFailures$1.evaluate(TestRuleIgnoreAfterMaxFailures.java:64)
	at org.apache.lucene.util.TestRuleMarkFailure$1.evaluate(TestRuleMarkFailure.java:47)
	at com.carrotsearch.randomizedtesting.rules.StatementAdapter.evaluate(StatementAdapter.java:36)
	at com.carrotsearch.randomizedtesting.ThreadLeakControl$StatementRunner.run(ThreadLeakControl.java:368)
	at com.carrotsearch.randomizedtesting.ThreadLeakControl.forkTimeoutingTask(ThreadLeakControl.java:817)
	at com.carrotsearch.randomizedtesting.ThreadLeakControl$3.evaluate(ThreadLeakControl.java:468)
	at com.carrotsearch.randomizedtesting.RandomizedRunner.runSingleTest(RandomizedRunner.java:916)
	at com.carrotsearch.randomizedtesting.RandomizedRunner$5.evaluate(RandomizedRunner.java:802)
	at com.carrotsearch.randomizedtesting.RandomizedRunner$6.evaluate(RandomizedRunner.java:852)
	at com.carrotsearch.randomizedtesting.RandomizedRunner$7.evaluate(RandomizedRunner.java:863)
	at com.carrotsearch.randomizedtesting.rules.StatementAdapter.evaluate(StatementAdapter.java:36)
	at com.carrotsearch.randomizedtesting.rules.SystemPropertiesRestoreRule$1.evaluate(SystemPropertiesRestoreRule.java:57)
	at org.apache.lucene.util.AbstractBeforeAfterRule$1.evaluate(AbstractBeforeAfterRule.java:45)
	at com.carrotsearch.randomizedtesting.rules.StatementAdapter.evaluate(StatementAdapter.java:36)
	at org.apache.lucene.util.TestRuleStoreClassName$1.evaluate(TestRuleStoreClassName.java:41)
	at com.carrotsearch.randomizedtesting.rules.NoShadowingOrOverridesOnMethodsRule$1.evaluate(NoShadowingOrOverridesOnMethodsRule.java:40)
	at com.carrotsearch.randomizedtesting.rules.NoShadowingOrOverridesOnMethodsRule$1.evaluate(NoShadowingOrOverridesOnMethodsRule.java:40)
	at com.carrotsearch.randomizedtesting.rules.StatementAdapter.evaluate(StatementAdapter.java:36)
	at com.carrotsearch.randomizedtesting.rules.StatementAdapter.evaluate(StatementAdapter.java:36)
	at com.carrotsearch.randomizedtesting.rules.StatementAdapter.evaluate(StatementAdapter.java:36)
	at org.apache.lucene.util.TestRuleAssertionsRequired$1.evaluate(TestRuleAssertionsRequired.java:53)
	at org.apache.lucene.util.TestRuleMarkFailure$1.evaluate(TestRuleMarkFailure.java:47)
	at org.apache.lucene.util.TestRuleIgnoreAfterMaxFailures$1.evaluate(TestRuleIgnoreAfterMaxFailures.java:64)
	at org.apache.lucene.util.TestRuleIgnoreTestSuites$1.evaluate(TestRuleIgnoreTestSuites.java:54)
	at com.carrotsearch.randomizedtesting.rules.StatementAdapter.evaluate(StatementAdapter.java:36)
	at com.carrotsearch.randomizedtesting.ThreadLeakControl$StatementRunner.run(ThreadLeakControl.java:368)
	at java.lang.Thread.run(Thread.java:745)




Build Log:
[...truncated 11011 lines...]
   [junit4] Suite: org.apache.solr.handler.admin.MBeansHandlerTest
   [junit4]   2> Creating dataDir: /Users/jenkins/workspace/Lucene-Solr-6.x-MacOSX/solr/build/solr-core/test/J1/temp/solr.handler.admin.MBeansHandlerTest_966FB6A6B9948EA5-001/init-core-data-001
   [junit4]   2> 315081 INFO  (SUITE-MBeansHandlerTest-seed#[966FB6A6B9948EA5]-worker)
[    ] o.a.s.SolrTestCaseJ4 Randomized ssl (false) and clientAuth (false) via: @org.apache.solr.util.RandomizeSSL(reason=,
value=NaN, ssl=NaN, clientAuth=NaN) w/ MAC_OS_X supressed clientAuth
   [junit4]   2> 315082 INFO  (SUITE-MBeansHandlerTest-seed#[966FB6A6B9948EA5]-worker)
[    ] o.a.s.SolrTestCaseJ4 ####initCore
   [junit4]   2> 315083 INFO  (SUITE-MBeansHandlerTest-seed#[966FB6A6B9948EA5]-worker)
[    ] o.a.s.c.SolrResourceLoader [null] Added 2 libs to classloader, from paths: [/Users/jenkins/workspace/Lucene-Solr-6.x-MacOSX/solr/core/src/test-files/solr/collection1/lib,
/Users/jenkins/workspace/Lucene-Solr-6.x-MacOSX/solr/core/src/test-files/solr/collection1/lib/classes]
   [junit4]   2> 315156 WARN  (SUITE-MBeansHandlerTest-seed#[966FB6A6B9948EA5]-worker)
[    ] o.a.s.c.Config Beginning with Solr 5.5, <mergePolicy> is deprecated, use <mergePolicyFactory>
instead.
   [junit4]   2> 315158 INFO  (SUITE-MBeansHandlerTest-seed#[966FB6A6B9948EA5]-worker)
[    ] o.a.s.c.SolrConfig Using Lucene MatchVersion: 6.5.0
   [junit4]   2> 315202 INFO  (SUITE-MBeansHandlerTest-seed#[966FB6A6B9948EA5]-worker)
[    ] o.a.s.s.IndexSchema [null] Schema name=test
   [junit4]   2> 315348 WARN  (SUITE-MBeansHandlerTest-seed#[966FB6A6B9948EA5]-worker)
[    ] o.a.s.s.IndexSchema [null] default search field in schema is text. WARNING: Deprecated,
please use 'df' on request instead.
   [junit4]   2> 315352 INFO  (SUITE-MBeansHandlerTest-seed#[966FB6A6B9948EA5]-worker)
[    ] o.a.s.s.IndexSchema Loaded schema test/1.0 with uniqueid field id
   [junit4]   2> 315366 INFO  (SUITE-MBeansHandlerTest-seed#[966FB6A6B9948EA5]-worker)
[    ] o.a.s.u.UpdateShardHandler Creating UpdateShardHandler HTTP client with params: socketTimeout=30000&connTimeout=30000&retry=true
   [junit4]   2> 315370 WARN  (SUITE-MBeansHandlerTest-seed#[966FB6A6B9948EA5]-worker)
[    ] o.a.s.m.r.SolrJmxReporter No serviceUrl or agentId was configured, using first MBeanServer.
   [junit4]   2> 315374 INFO  (SUITE-MBeansHandlerTest-seed#[966FB6A6B9948EA5]-worker)
[    ] o.a.s.m.r.SolrJmxReporter JMX monitoring enabled at server: com.sun.jmx.mbeanserver.JmxMBeanServer@7768576
   [junit4]   2> 315374 WARN  (SUITE-MBeansHandlerTest-seed#[966FB6A6B9948EA5]-worker)
[    ] o.a.s.m.r.SolrJmxReporter No serviceUrl or agentId was configured, using first MBeanServer.
   [junit4]   2> 315380 INFO  (SUITE-MBeansHandlerTest-seed#[966FB6A6B9948EA5]-worker)
[    ] o.a.s.m.r.SolrJmxReporter JMX monitoring enabled at server: com.sun.jmx.mbeanserver.JmxMBeanServer@7768576
   [junit4]   2> 315380 WARN  (SUITE-MBeansHandlerTest-seed#[966FB6A6B9948EA5]-worker)
[    ] o.a.s.m.r.SolrJmxReporter No serviceUrl or agentId was configured, using first MBeanServer.
   [junit4]   2> 315380 INFO  (SUITE-MBeansHandlerTest-seed#[966FB6A6B9948EA5]-worker)
[    ] o.a.s.m.r.SolrJmxReporter JMX monitoring enabled at server: com.sun.jmx.mbeanserver.JmxMBeanServer@7768576
   [junit4]   2> 315383 INFO  (coreLoadExecutor-1481-thread-1) [    x:collection1] o.a.s.c.SolrResourceLoader
[null] Added 2 libs to classloader, from paths: [/Users/jenkins/workspace/Lucene-Solr-6.x-MacOSX/solr/core/src/test-files/solr/collection1/lib,
/Users/jenkins/workspace/Lucene-Solr-6.x-MacOSX/solr/core/src/test-files/solr/collection1/lib/classes]
   [junit4]   2> 315422 WARN  (coreLoadExecutor-1481-thread-1) [    x:collection1] o.a.s.c.Config
Beginning with Solr 5.5, <mergePolicy> is deprecated, use <mergePolicyFactory>
instead.
   [junit4]   2> 315424 INFO  (coreLoadExecutor-1481-thread-1) [    x:collection1] o.a.s.c.SolrConfig
Using Lucene MatchVersion: 6.5.0
   [junit4]   2> 315456 INFO  (coreLoadExecutor-1481-thread-1) [    x:collection1] o.a.s.s.IndexSchema
[collection1] Schema name=test
   [junit4]   2> 315580 WARN  (coreLoadExecutor-1481-thread-1) [    x:collection1] o.a.s.s.IndexSchema
[collection1] default search field in schema is text. WARNING: Deprecated, please use 'df'
on request instead.
   [junit4]   2> 315583 INFO  (coreLoadExecutor-1481-thread-1) [    x:collection1] o.a.s.s.IndexSchema
Loaded schema test/1.0 with uniqueid field id
   [junit4]   2> 315599 INFO  (coreLoadExecutor-1481-thread-1) [    x:collection1] o.a.s.c.CoreContainer
Creating SolrCore 'collection1' using configuration from instancedir /Users/jenkins/workspace/Lucene-Solr-6.x-MacOSX/solr/core/src/test-files/solr/collection1
   [junit4]   2> 315599 WARN  (coreLoadExecutor-1481-thread-1) [    x:collection1] o.a.s.m.r.SolrJmxReporter
No serviceUrl or agentId was configured, using first MBeanServer.
   [junit4]   2> 315599 INFO  (coreLoadExecutor-1481-thread-1) [    x:collection1] o.a.s.m.r.SolrJmxReporter
JMX monitoring enabled at server: com.sun.jmx.mbeanserver.JmxMBeanServer@7768576
   [junit4]   2> 315600 INFO  (coreLoadExecutor-1481-thread-1) [    x:collection1] o.a.s.c.SolrCore
[[collection1] ] Opening new SolrCore at [/Users/jenkins/workspace/Lucene-Solr-6.x-MacOSX/solr/core/src/test-files/solr/collection1],
dataDir=[/Users/jenkins/workspace/Lucene-Solr-6.x-MacOSX/solr/build/solr-core/test/J1/temp/solr.handler.admin.MBeansHandlerTest_966FB6A6B9948EA5-001/init-core-data-001/]
   [junit4]   2> 315600 INFO  (coreLoadExecutor-1481-thread-1) [    x:collection1] o.a.s.c.JmxMonitoredMap
JMX monitoring is enabled. Adding Solr mbeans to JMX Server: com.sun.jmx.mbeanserver.JmxMBeanServer@7768576
   [junit4]   2> 315607 INFO  (coreLoadExecutor-1481-thread-1) [    x:collection1] o.a.s.u.RandomMergePolicy
RandomMergePolicy wrapping class org.apache.lucene.index.LogByteSizeMergePolicy: [LogByteSizeMergePolicy:
minMergeSize=1677721, mergeFactor=45, maxMergeSize=2147483648, maxMergeSizeForForcedMerge=9223372036854775807,
calibrateSizeByDeletes=true, maxMergeDocs=2147483647, maxCFSSegmentSizeMB=8.796093022207999E12,
noCFSRatio=0.5137210686681396]
   [junit4]   2> 315655 INFO  (coreLoadExecutor-1481-thread-1) [    x:collection1] o.a.s.u.UpdateHandler
Using UpdateLog implementation: org.apache.solr.update.UpdateLog
   [junit4]   2> 315655 INFO  (coreLoadExecutor-1481-thread-1) [    x:collection1] o.a.s.u.UpdateLog
Initializing UpdateLog: dataDir= defaultSyncLevel=FLUSH numRecordsToKeep=100 maxNumLogsToKeep=10
numVersionBuckets=65536
   [junit4]   2> 315656 INFO  (coreLoadExecutor-1481-thread-1) [    x:collection1] o.a.s.u.CommitTracker
Hard AutoCommit: disabled
   [junit4]   2> 315656 INFO  (coreLoadExecutor-1481-thread-1) [    x:collection1] o.a.s.u.CommitTracker
Soft AutoCommit: disabled
   [junit4]   2> 315657 INFO  (coreLoadExecutor-1481-thread-1) [    x:collection1] o.a.s.u.RandomMergePolicy
RandomMergePolicy wrapping class org.apache.lucene.index.LogDocMergePolicy: [LogDocMergePolicy:
minMergeSize=1000, mergeFactor=10, maxMergeSize=9223372036854775807, maxMergeSizeForForcedMerge=9223372036854775807,
calibrateSizeByDeletes=true, maxMergeDocs=2147483647, maxCFSSegmentSizeMB=8.796093022207999E12,
noCFSRatio=0.6725424771785893]
   [junit4]   2> 315659 INFO  (coreLoadExecutor-1481-thread-1) [    x:collection1] o.a.s.s.SolrIndexSearcher
Opening [Searcher@233e0d0a[collection1] main]
   [junit4]   2> 315660 INFO  (coreLoadExecutor-1481-thread-1) [    x:collection1] o.a.s.h.c.SpellCheckComponent
Initializing spell checkers
   [junit4]   2> 315692 INFO  (coreLoadExecutor-1481-thread-1) [    x:collection1] o.a.s.s.DirectSolrSpellChecker
init: {name=direct,classname=DirectSolrSpellChecker,field=lowerfilt,minQueryLength=3}
   [junit4]   2> 315800 INFO  (coreLoadExecutor-1481-thread-1) [    x:collection1] o.a.s.h.ReplicationHandler
Commits will be reserved for  10000
   [junit4]   2> 315801 INFO  (searcherExecutor-1482-thread-1-processing-x:collection1)
[    x:collection1] o.a.s.h.c.SpellCheckComponent Loading spell index for spellchecker: default
   [junit4]   2> 315802 INFO  (searcherExecutor-1482-thread-1-processing-x:collection1)
[    x:collection1] o.a.s.h.c.SpellCheckComponent Loading spell index for spellchecker: direct
   [junit4]   2> 315802 INFO  (searcherExecutor-1482-thread-1-processing-x:collection1)
[    x:collection1] o.a.s.h.c.SpellCheckComponent Loading spell index for spellchecker: wordbreak
   [junit4]   2> 315802 INFO  (searcherExecutor-1482-thread-1-processing-x:collection1)
[    x:collection1] o.a.s.h.c.SpellCheckComponent Loading spell index for spellchecker: multipleFields
   [junit4]   2> 315803 INFO  (searcherExecutor-1482-thread-1-processing-x:collection1)
[    x:collection1] o.a.s.h.c.SpellCheckComponent Loading spell index for spellchecker: jarowinkler
   [junit4]   2> 315803 INFO  (searcherExecutor-1482-thread-1-processing-x:collection1)
[    x:collection1] o.a.s.h.c.SpellCheckComponent Loading spell index for spellchecker: external
   [junit4]   2> 315806 INFO  (searcherExecutor-1482-thread-1-processing-x:collection1)
[    x:collection1] o.a.s.h.c.SpellCheckComponent Loading spell index for spellchecker: freq
   [junit4]   2> 315807 INFO  (searcherExecutor-1482-thread-1-processing-x:collection1)
[    x:collection1] o.a.s.h.c.SpellCheckComponent Loading spell index for spellchecker: fqcn
   [junit4]   2> 315807 INFO  (coreLoadExecutor-1481-thread-1) [    x:collection1] o.a.s.u.UpdateLog
Could not find max version in index or recent updates, using new clock 1558252965580505088
   [junit4]   2> 315813 INFO  (SUITE-MBeansHandlerTest-seed#[966FB6A6B9948EA5]-worker)
[    ] o.a.s.SolrTestCaseJ4 ####initCore end
   [junit4]   2> 315815 INFO  (searcherExecutor-1482-thread-1-processing-x:collection1)
[    x:collection1] o.a.s.h.c.SpellCheckComponent Loading spell index for spellchecker: perDict
   [junit4]   2> 315818 INFO  (TEST-MBeansHandlerTest.testBackCompatNames-seed#[966FB6A6B9948EA5])
[    ] o.a.s.SolrTestCaseJ4 ###Starting testBackCompatNames
   [junit4]   2> 315819 INFO  (searcherExecutor-1482-thread-1-processing-x:collection1)
[    x:collection1] o.a.s.c.SolrCore [collection1] Registered new searcher Searcher@233e0d0a[collection1]
main{ExitableDirectoryReader(UninvertingDirectoryReader())}
   [junit4]   2> 315822 INFO  (TEST-MBeansHandlerTest.testBackCompatNames-seed#[966FB6A6B9948EA5])
[    ] o.a.s.c.S.Request [collection1]  webapp=null path=null params={qt=/admin/mbeans&wt=xml}
status=0 QTime=3
   [junit4]   2> 315834 INFO  (TEST-MBeansHandlerTest.testBackCompatNames-seed#[966FB6A6B9948EA5])
[    ] o.a.s.c.S.Request [collection1]  webapp=null path=null params={qt=/admin/mbeans&cat=QUERYHANDLER&wt=xml}
status=0 QTime=0
   [junit4]   2> 315836 INFO  (TEST-MBeansHandlerTest.testBackCompatNames-seed#[966FB6A6B9948EA5])
[    ] o.a.s.c.S.Request [collection1]  webapp=null path=null params={qt=/admin/mbeans&cat=UPDATE&wt=xml}
status=0 QTime=0
   [junit4]   2> 315838 INFO  (TEST-MBeansHandlerTest.testBackCompatNames-seed#[966FB6A6B9948EA5])
[    ] o.a.s.SolrTestCaseJ4 ###Ending testBackCompatNames
   [junit4]   2> 315842 INFO  (TEST-MBeansHandlerTest.testXMLDiffWithExternalEntity-seed#[966FB6A6B9948EA5])
[    ] o.a.s.SolrTestCaseJ4 ###Starting testXMLDiffWithExternalEntity
   [junit4]   2> 316161 INFO  (TEST-MBeansHandlerTest.testXMLDiffWithExternalEntity-seed#[966FB6A6B9948EA5])
[    ] o.a.s.SolrTestCaseJ4 ###Ending testXMLDiffWithExternalEntity
   [junit4]   2> 316172 INFO  (TEST-MBeansHandlerTest.testDiff-seed#[966FB6A6B9948EA5])
[    ] o.a.s.SolrTestCaseJ4 ###Starting testDiff
   [junit4]   2> 316181 INFO  (TEST-MBeansHandlerTest.testDiff-seed#[966FB6A6B9948EA5])
[    ] o.a.s.c.S.Request [collection1]  webapp=null path=null params={qt=/admin/mbeans&stats=true&wt=xml}
status=0 QTime=8
   [junit4]   2> 316238 INFO  (TEST-MBeansHandlerTest.testDiff-seed#[966FB6A6B9948EA5])
[    ] o.a.s.c.S.Request [collection1]  webapp=null path=null params={qt=/admin/mbeans&stats=true&diff=true&wt=xml}
status=0 QTime=49
   [junit4]   2> 316242 INFO  (TEST-MBeansHandlerTest.testDiff-seed#[966FB6A6B9948EA5])
[    ] o.a.s.SolrTestCaseJ4 ###Ending testDiff
   [junit4]   2> NOTE: reproduce with: ant test  -Dtestcase=MBeansHandlerTest -Dtests.method=testDiff
-Dtests.seed=966FB6A6B9948EA5 -Dtests.slow=true -Dtests.locale=sr-Latn-BA -Dtests.timezone=America/Rankin_Inlet
-Dtests.asserts=true -Dtests.file.encoding=UTF-8
   [junit4] FAILURE 0.09s J1 | MBeansHandlerTest.testDiff <<<
   [junit4]    > Throwable #1: org.junit.ComparisonFailure: expected:<Was: [1, Now:
2], Delta: 1> but was:<Was: [4, Now: 5], Delta: 1>
   [junit4]    > 	at __randomizedtesting.SeedInfo.seed([966FB6A6B9948EA5:5379723DA922B6C5]:0)
   [junit4]    > 	at org.apache.solr.handler.admin.MBeansHandlerTest.testDiff(MBeansHandlerTest.java:63)
   [junit4]    > 	at java.lang.Thread.run(Thread.java:745)
   [junit4]   2> 316250 INFO  (SUITE-MBeansHandlerTest-seed#[966FB6A6B9948EA5]-worker)
[    ] o.a.s.SolrTestCaseJ4 ###deleteCore
   [junit4]   2> 316250 INFO  (SUITE-MBeansHandlerTest-seed#[966FB6A6B9948EA5]-worker)
[    ] o.a.s.c.CoreContainer Shutting down CoreContainer instance=1845658545
   [junit4]   2> 316251 INFO  (coreCloseExecutor-1487-thread-1) [    x:collection1] o.a.s.c.SolrCore
[collection1]  CLOSING SolrCore org.apache.solr.core.SolrCore@43a0b91b
   [junit4]   2> 316327 INFO  (coreCloseExecutor-1487-thread-1) [    x:collection1] o.a.s.m.SolrMetricManager
Closing metric reporters for: solr.core.collection1
   [junit4]   2> 316349 INFO  (SUITE-MBeansHandlerTest-seed#[966FB6A6B9948EA5]-worker)
[    ] o.a.s.m.SolrMetricManager Closing metric reporters for: solr.node
   [junit4]   2> NOTE: leaving temporary files on disk at: /Users/jenkins/workspace/Lucene-Solr-6.x-MacOSX/solr/build/solr-core/test/J1/temp/solr.handler.admin.MBeansHandlerTest_966FB6A6B9948EA5-001
   [junit4]   2> NOTE: test params are: codec=CheapBastard, sim=RandomSimilarity(queryNorm=true,coord=yes):
{}, locale=sr-Latn-BA, timezone=America/Rankin_Inlet
   [junit4]   2> NOTE: Mac OS X 10.11.6 x86_64/Oracle Corporation 1.8.0_121 (64-bit)/cpus=3,threads=1,free=322744272,total=495976448
   [junit4]   2> NOTE: All tests run in this JVM: [TestConfigSets, AsyncCallRequestStatusResponseTest,
TestDynamicFieldCollectionResource, TestSystemIdResolver, DistributedFacetPivotLargeTest,
TestIntervalFaceting, SolrIndexConfigTest, TestSerializedLuceneMatchVersion, TestReqParamsAPI,
TestCrossCoreJoin, CurrencyFieldOpenExchangeTest, OverseerCollectionConfigSetProcessorTest,
TestBlendedInfixSuggestions, ReplaceNodeTest, TestSolr4Spatial, InfoHandlerTest, SuggestComponentContextFilterQueryTest,
CloneFieldUpdateProcessorFactoryTest, EchoParamsTest, TestSolrCoreParser, TestUninvertingReader,
HttpSolrCallGetCoreTest, TestExactSharedStatsCache, ChaosMonkeySafeLeaderTest, QueryParsingTest,
ClusterStateTest, SliceStateTest, TestBackupRepositoryFactory, LukeRequestHandlerTest, SmileWriterTest,
SolrIndexSplitterTest, TestRecoveryHdfs, SharedFSAutoReplicaFailoverUtilsTest, RequestHandlersTest,
SpatialRPTFieldTypeTest, TestSolrConfigHandler, TestMacros, GraphQueryTest, LeaderElectionContextKeyTest,
FieldAnalysisRequestHandlerTest, ResourceLoaderTest, TestBadConfig, LeaderFailureAfterFreshStartTest,
ShowFileRequestHandlerTest, TestSolrQueryParserResource, AnalysisErrorHandlingTest, MBeansHandlerTest]
   [junit4] Completed [88/682 (1!)] on J1 in 1.30s, 3 tests, 1 failure <<< FAILURES!

[...truncated 64433 lines...]


Mime
View raw message