lucene-dev mailing list archives

Site index · List index
Message view « Date » · « Thread »
Top « Date » · « Thread »
From Policeman Jenkins Server <jenk...@thetaphi.de>
Subject [JENKINS] Lucene-Solr-6.4-Linux (32bit/jdk1.8.0_121) - Build # 94 - Still Unstable!
Date Thu, 02 Feb 2017 17:31:05 GMT
Build: https://jenkins.thetaphi.de/job/Lucene-Solr-6.4-Linux/94/
Java: 32bit/jdk1.8.0_121 -client -XX:+UseConcMarkSweepGC

1 tests failed.
FAILED:  org.apache.solr.handler.admin.MBeansHandlerTest.testDiff

Error Message:
expected:<Was: [1, Now: 2], Delta: 1> but was:<Was: [4, Now: 5], Delta: 1>

Stack Trace:
org.junit.ComparisonFailure: expected:<Was: [1, Now: 2], Delta: 1> but was:<Was:
[4, Now: 5], Delta: 1>
	at __randomizedtesting.SeedInfo.seed([4B0AB59D4FFF8D25:8E1C71065F49B545]:0)
	at org.junit.Assert.assertEquals(Assert.java:125)
	at org.junit.Assert.assertEquals(Assert.java:147)
	at org.apache.solr.handler.admin.MBeansHandlerTest.testDiff(MBeansHandlerTest.java:63)
	at sun.reflect.NativeMethodAccessorImpl.invoke0(Native Method)
	at sun.reflect.NativeMethodAccessorImpl.invoke(NativeMethodAccessorImpl.java:62)
	at sun.reflect.DelegatingMethodAccessorImpl.invoke(DelegatingMethodAccessorImpl.java:43)
	at java.lang.reflect.Method.invoke(Method.java:498)
	at com.carrotsearch.randomizedtesting.RandomizedRunner.invoke(RandomizedRunner.java:1713)
	at com.carrotsearch.randomizedtesting.RandomizedRunner$8.evaluate(RandomizedRunner.java:907)
	at com.carrotsearch.randomizedtesting.RandomizedRunner$9.evaluate(RandomizedRunner.java:943)
	at com.carrotsearch.randomizedtesting.RandomizedRunner$10.evaluate(RandomizedRunner.java:957)
	at com.carrotsearch.randomizedtesting.rules.SystemPropertiesRestoreRule$1.evaluate(SystemPropertiesRestoreRule.java:57)
	at org.apache.lucene.util.TestRuleSetupTeardownChained$1.evaluate(TestRuleSetupTeardownChained.java:49)
	at org.apache.lucene.util.AbstractBeforeAfterRule$1.evaluate(AbstractBeforeAfterRule.java:45)
	at org.apache.lucene.util.TestRuleThreadAndTestName$1.evaluate(TestRuleThreadAndTestName.java:48)
	at org.apache.lucene.util.TestRuleIgnoreAfterMaxFailures$1.evaluate(TestRuleIgnoreAfterMaxFailures.java:64)
	at org.apache.lucene.util.TestRuleMarkFailure$1.evaluate(TestRuleMarkFailure.java:47)
	at com.carrotsearch.randomizedtesting.rules.StatementAdapter.evaluate(StatementAdapter.java:36)
	at com.carrotsearch.randomizedtesting.ThreadLeakControl$StatementRunner.run(ThreadLeakControl.java:367)
	at com.carrotsearch.randomizedtesting.ThreadLeakControl.forkTimeoutingTask(ThreadLeakControl.java:811)
	at com.carrotsearch.randomizedtesting.ThreadLeakControl$3.evaluate(ThreadLeakControl.java:462)
	at com.carrotsearch.randomizedtesting.RandomizedRunner.runSingleTest(RandomizedRunner.java:916)
	at com.carrotsearch.randomizedtesting.RandomizedRunner$5.evaluate(RandomizedRunner.java:802)
	at com.carrotsearch.randomizedtesting.RandomizedRunner$6.evaluate(RandomizedRunner.java:852)
	at com.carrotsearch.randomizedtesting.RandomizedRunner$7.evaluate(RandomizedRunner.java:863)
	at com.carrotsearch.randomizedtesting.rules.StatementAdapter.evaluate(StatementAdapter.java:36)
	at com.carrotsearch.randomizedtesting.rules.SystemPropertiesRestoreRule$1.evaluate(SystemPropertiesRestoreRule.java:57)
	at org.apache.lucene.util.AbstractBeforeAfterRule$1.evaluate(AbstractBeforeAfterRule.java:45)
	at com.carrotsearch.randomizedtesting.rules.StatementAdapter.evaluate(StatementAdapter.java:36)
	at org.apache.lucene.util.TestRuleStoreClassName$1.evaluate(TestRuleStoreClassName.java:41)
	at com.carrotsearch.randomizedtesting.rules.NoShadowingOrOverridesOnMethodsRule$1.evaluate(NoShadowingOrOverridesOnMethodsRule.java:40)
	at com.carrotsearch.randomizedtesting.rules.NoShadowingOrOverridesOnMethodsRule$1.evaluate(NoShadowingOrOverridesOnMethodsRule.java:40)
	at com.carrotsearch.randomizedtesting.rules.StatementAdapter.evaluate(StatementAdapter.java:36)
	at com.carrotsearch.randomizedtesting.rules.StatementAdapter.evaluate(StatementAdapter.java:36)
	at com.carrotsearch.randomizedtesting.rules.StatementAdapter.evaluate(StatementAdapter.java:36)
	at org.apache.lucene.util.TestRuleAssertionsRequired$1.evaluate(TestRuleAssertionsRequired.java:53)
	at org.apache.lucene.util.TestRuleMarkFailure$1.evaluate(TestRuleMarkFailure.java:47)
	at org.apache.lucene.util.TestRuleIgnoreAfterMaxFailures$1.evaluate(TestRuleIgnoreAfterMaxFailures.java:64)
	at org.apache.lucene.util.TestRuleIgnoreTestSuites$1.evaluate(TestRuleIgnoreTestSuites.java:54)
	at com.carrotsearch.randomizedtesting.rules.StatementAdapter.evaluate(StatementAdapter.java:36)
	at com.carrotsearch.randomizedtesting.ThreadLeakControl$StatementRunner.run(ThreadLeakControl.java:367)
	at java.lang.Thread.run(Thread.java:745)




Build Log:
[...truncated 12137 lines...]
   [junit4] Suite: org.apache.solr.handler.admin.MBeansHandlerTest
   [junit4]   2> Creating dataDir: /home/jenkins/workspace/Lucene-Solr-6.4-Linux/solr/build/solr-core/test/J0/temp/solr.handler.admin.MBeansHandlerTest_4B0AB59D4FFF8D25-001/init-core-data-001
   [junit4]   2> 1769384 INFO  (SUITE-MBeansHandlerTest-seed#[4B0AB59D4FFF8D25]-worker)
[    ] o.a.s.SolrTestCaseJ4 Randomized ssl (false) and clientAuth (true) via: @org.apache.solr.util.RandomizeSSL(reason=,
ssl=NaN, value=NaN, clientAuth=NaN)
   [junit4]   2> 1769385 INFO  (SUITE-MBeansHandlerTest-seed#[4B0AB59D4FFF8D25]-worker)
[    ] o.a.s.SolrTestCaseJ4 ####initCore
   [junit4]   2> 1769385 INFO  (SUITE-MBeansHandlerTest-seed#[4B0AB59D4FFF8D25]-worker)
[    ] o.a.s.c.SolrResourceLoader [null] Added 2 libs to classloader, from paths: [/home/jenkins/workspace/Lucene-Solr-6.4-Linux/solr/core/src/test-files/solr/collection1/lib,
/home/jenkins/workspace/Lucene-Solr-6.4-Linux/solr/core/src/test-files/solr/collection1/lib/classes]
   [junit4]   2> 1769415 WARN  (SUITE-MBeansHandlerTest-seed#[4B0AB59D4FFF8D25]-worker)
[    ] o.a.s.c.Config Beginning with Solr 5.5, <mergePolicy> is deprecated, use <mergePolicyFactory>
instead.
   [junit4]   2> 1769417 INFO  (SUITE-MBeansHandlerTest-seed#[4B0AB59D4FFF8D25]-worker)
[    ] o.a.s.c.SolrConfig Using Lucene MatchVersion: 6.4.1
   [junit4]   2> 1769441 INFO  (SUITE-MBeansHandlerTest-seed#[4B0AB59D4FFF8D25]-worker)
[    ] o.a.s.s.IndexSchema [null] Schema name=test
   [junit4]   2> 1769529 WARN  (SUITE-MBeansHandlerTest-seed#[4B0AB59D4FFF8D25]-worker)
[    ] o.a.s.s.IndexSchema [null] default search field in schema is text. WARNING: Deprecated,
please use 'df' on request instead.
   [junit4]   2> 1769533 INFO  (SUITE-MBeansHandlerTest-seed#[4B0AB59D4FFF8D25]-worker)
[    ] o.a.s.s.IndexSchema Loaded schema test/1.0 with uniqueid field id
   [junit4]   2> 1769542 INFO  (SUITE-MBeansHandlerTest-seed#[4B0AB59D4FFF8D25]-worker)
[    ] o.a.s.u.UpdateShardHandler Creating UpdateShardHandler HTTP client with params: socketTimeout=30000&connTimeout=30000&retry=true
   [junit4]   2> 1769545 WARN  (SUITE-MBeansHandlerTest-seed#[4B0AB59D4FFF8D25]-worker)
[    ] o.a.s.m.r.SolrJmxReporter No serviceUrl or agentId was configured, using first MBeanServer.
   [junit4]   2> 1769548 INFO  (SUITE-MBeansHandlerTest-seed#[4B0AB59D4FFF8D25]-worker)
[    ] o.a.s.m.r.SolrJmxReporter JMX monitoring enabled at server: com.sun.jmx.mbeanserver.JmxMBeanServer@1a4be40
   [junit4]   2> 1769548 WARN  (SUITE-MBeansHandlerTest-seed#[4B0AB59D4FFF8D25]-worker)
[    ] o.a.s.m.r.SolrJmxReporter No serviceUrl or agentId was configured, using first MBeanServer.
   [junit4]   2> 1769554 INFO  (SUITE-MBeansHandlerTest-seed#[4B0AB59D4FFF8D25]-worker)
[    ] o.a.s.m.r.SolrJmxReporter JMX monitoring enabled at server: com.sun.jmx.mbeanserver.JmxMBeanServer@1a4be40
   [junit4]   2> 1769554 WARN  (SUITE-MBeansHandlerTest-seed#[4B0AB59D4FFF8D25]-worker)
[    ] o.a.s.m.r.SolrJmxReporter No serviceUrl or agentId was configured, using first MBeanServer.
   [junit4]   2> 1769554 INFO  (SUITE-MBeansHandlerTest-seed#[4B0AB59D4FFF8D25]-worker)
[    ] o.a.s.m.r.SolrJmxReporter JMX monitoring enabled at server: com.sun.jmx.mbeanserver.JmxMBeanServer@1a4be40
   [junit4]   2> 1769556 INFO  (coreLoadExecutor-3760-thread-1) [    x:collection1] o.a.s.c.SolrResourceLoader
[null] Added 2 libs to classloader, from paths: [/home/jenkins/workspace/Lucene-Solr-6.4-Linux/solr/core/src/test-files/solr/collection1/lib,
/home/jenkins/workspace/Lucene-Solr-6.4-Linux/solr/core/src/test-files/solr/collection1/lib/classes]
   [junit4]   2> 1769586 WARN  (coreLoadExecutor-3760-thread-1) [    x:collection1] o.a.s.c.Config
Beginning with Solr 5.5, <mergePolicy> is deprecated, use <mergePolicyFactory>
instead.
   [junit4]   2> 1769588 INFO  (coreLoadExecutor-3760-thread-1) [    x:collection1] o.a.s.c.SolrConfig
Using Lucene MatchVersion: 6.4.1
   [junit4]   2> 1769623 INFO  (coreLoadExecutor-3760-thread-1) [    x:collection1] o.a.s.s.IndexSchema
[collection1] Schema name=test
   [junit4]   2> 1769718 WARN  (coreLoadExecutor-3760-thread-1) [    x:collection1] o.a.s.s.IndexSchema
[collection1] default search field in schema is text. WARNING: Deprecated, please use 'df'
on request instead.
   [junit4]   2> 1769722 INFO  (coreLoadExecutor-3760-thread-1) [    x:collection1] o.a.s.s.IndexSchema
Loaded schema test/1.0 with uniqueid field id
   [junit4]   2> 1769732 INFO  (coreLoadExecutor-3760-thread-1) [    x:collection1] o.a.s.c.CoreContainer
Creating SolrCore 'collection1' using configuration from instancedir /home/jenkins/workspace/Lucene-Solr-6.4-Linux/solr/core/src/test-files/solr/collection1
   [junit4]   2> 1769732 WARN  (coreLoadExecutor-3760-thread-1) [    x:collection1] o.a.s.m.r.SolrJmxReporter
No serviceUrl or agentId was configured, using first MBeanServer.
   [junit4]   2> 1769733 INFO  (coreLoadExecutor-3760-thread-1) [    x:collection1] o.a.s.m.r.SolrJmxReporter
JMX monitoring enabled at server: com.sun.jmx.mbeanserver.JmxMBeanServer@1a4be40
   [junit4]   2> 1769733 INFO  (coreLoadExecutor-3760-thread-1) [    x:collection1] o.a.s.c.SolrCore
[[collection1] ] Opening new SolrCore at [/home/jenkins/workspace/Lucene-Solr-6.4-Linux/solr/core/src/test-files/solr/collection1],
dataDir=[/home/jenkins/workspace/Lucene-Solr-6.4-Linux/solr/build/solr-core/test/J0/temp/solr.handler.admin.MBeansHandlerTest_4B0AB59D4FFF8D25-001/init-core-data-001/]
   [junit4]   2> 1769733 INFO  (coreLoadExecutor-3760-thread-1) [    x:collection1] o.a.s.c.JmxMonitoredMap
JMX monitoring is enabled. Adding Solr mbeans to JMX Server: com.sun.jmx.mbeanserver.JmxMBeanServer@1a4be40
   [junit4]   2> 1769736 INFO  (coreLoadExecutor-3760-thread-1) [    x:collection1] o.a.s.u.RandomMergePolicy
RandomMergePolicy wrapping class org.apache.lucene.index.LogDocMergePolicy: [LogDocMergePolicy:
minMergeSize=1000, mergeFactor=43, maxMergeSize=9223372036854775807, maxMergeSizeForForcedMerge=9223372036854775807,
calibrateSizeByDeletes=false, maxMergeDocs=2147483647, maxCFSSegmentSizeMB=8.796093022207999E12,
noCFSRatio=0.4318112233031267]
   [junit4]   2> 1769780 INFO  (coreLoadExecutor-3760-thread-1) [    x:collection1] o.a.s.u.UpdateHandler
Using UpdateLog implementation: org.apache.solr.update.UpdateLog
   [junit4]   2> 1769780 INFO  (coreLoadExecutor-3760-thread-1) [    x:collection1] o.a.s.u.UpdateLog
Initializing UpdateLog: dataDir= defaultSyncLevel=FLUSH numRecordsToKeep=100 maxNumLogsToKeep=10
numVersionBuckets=65536
   [junit4]   2> 1769782 INFO  (coreLoadExecutor-3760-thread-1) [    x:collection1] o.a.s.u.CommitTracker
Hard AutoCommit: disabled
   [junit4]   2> 1769782 INFO  (coreLoadExecutor-3760-thread-1) [    x:collection1] o.a.s.u.CommitTracker
Soft AutoCommit: disabled
   [junit4]   2> 1769783 INFO  (coreLoadExecutor-3760-thread-1) [    x:collection1] o.a.s.u.RandomMergePolicy
RandomMergePolicy wrapping class org.apache.lucene.index.TieredMergePolicy: [TieredMergePolicy:
maxMergeAtOnce=34, maxMergeAtOnceExplicit=42, maxMergedSegmentMB=4.666015625, floorSegmentMB=0.9931640625,
forceMergeDeletesPctAllowed=12.487472863707032, segmentsPerTier=35.0, maxCFSSegmentSizeMB=8.796093022207999E12,
noCFSRatio=0.4185551703749162
   [junit4]   2> 1769784 INFO  (coreLoadExecutor-3760-thread-1) [    x:collection1] o.a.s.s.SolrIndexSearcher
Opening [Searcher@9b34da[collection1] main]
   [junit4]   2> 1769784 INFO  (coreLoadExecutor-3760-thread-1) [    x:collection1] o.a.s.h.c.SpellCheckComponent
Initializing spell checkers
   [junit4]   2> 1769877 INFO  (coreLoadExecutor-3760-thread-1) [    x:collection1] o.a.s.s.DirectSolrSpellChecker
init: {name=direct,classname=DirectSolrSpellChecker,field=lowerfilt,minQueryLength=3}
   [junit4]   2> 1770007 INFO  (coreLoadExecutor-3760-thread-1) [    x:collection1] o.a.s.h.ReplicationHandler
Commits will be reserved for  10000
   [junit4]   2> 1770007 INFO  (searcherExecutor-3761-thread-1-processing-x:collection1)
[    x:collection1] o.a.s.h.c.SpellCheckComponent Loading spell index for spellchecker: default
   [junit4]   2> 1770007 INFO  (searcherExecutor-3761-thread-1-processing-x:collection1)
[    x:collection1] o.a.s.h.c.SpellCheckComponent Loading spell index for spellchecker: direct
   [junit4]   2> 1770007 INFO  (searcherExecutor-3761-thread-1-processing-x:collection1)
[    x:collection1] o.a.s.h.c.SpellCheckComponent Loading spell index for spellchecker: wordbreak
   [junit4]   2> 1770007 INFO  (searcherExecutor-3761-thread-1-processing-x:collection1)
[    x:collection1] o.a.s.h.c.SpellCheckComponent Loading spell index for spellchecker: multipleFields
   [junit4]   2> 1770008 INFO  (searcherExecutor-3761-thread-1-processing-x:collection1)
[    x:collection1] o.a.s.h.c.SpellCheckComponent Loading spell index for spellchecker: jarowinkler
   [junit4]   2> 1770008 INFO  (searcherExecutor-3761-thread-1-processing-x:collection1)
[    x:collection1] o.a.s.h.c.SpellCheckComponent Loading spell index for spellchecker: external
   [junit4]   2> 1770008 INFO  (searcherExecutor-3761-thread-1-processing-x:collection1)
[    x:collection1] o.a.s.h.c.SpellCheckComponent Loading spell index for spellchecker: freq
   [junit4]   2> 1770008 INFO  (searcherExecutor-3761-thread-1-processing-x:collection1)
[    x:collection1] o.a.s.h.c.SpellCheckComponent Loading spell index for spellchecker: fqcn
   [junit4]   2> 1770008 INFO  (searcherExecutor-3761-thread-1-processing-x:collection1)
[    x:collection1] o.a.s.h.c.SpellCheckComponent Loading spell index for spellchecker: perDict
   [junit4]   2> 1770014 INFO  (searcherExecutor-3761-thread-1-processing-x:collection1)
[    x:collection1] o.a.s.c.SolrCore [collection1] Registered new searcher Searcher@9b34da[collection1]
main{ExitableDirectoryReader(UninvertingDirectoryReader())}
   [junit4]   2> 1770020 INFO  (coreLoadExecutor-3760-thread-1) [    x:collection1] o.a.s.u.UpdateLog
Could not find max version in index or recent updates, using new clock 1558241932714442752
   [junit4]   2> 1770025 INFO  (SUITE-MBeansHandlerTest-seed#[4B0AB59D4FFF8D25]-worker)
[    ] o.a.s.SolrTestCaseJ4 ####initCore end
   [junit4]   2> 1770029 INFO  (TEST-MBeansHandlerTest.testBackCompatNames-seed#[4B0AB59D4FFF8D25])
[    ] o.a.s.SolrTestCaseJ4 ###Starting testBackCompatNames
   [junit4]   2> 1770030 INFO  (TEST-MBeansHandlerTest.testBackCompatNames-seed#[4B0AB59D4FFF8D25])
[    ] o.a.s.c.S.Request [collection1]  webapp=null path=null params={qt=/admin/mbeans&wt=xml}
status=0 QTime=1
   [junit4]   2> 1770043 INFO  (TEST-MBeansHandlerTest.testBackCompatNames-seed#[4B0AB59D4FFF8D25])
[    ] o.a.s.c.S.Request [collection1]  webapp=null path=null params={qt=/admin/mbeans&cat=QUERYHANDLER&wt=xml}
status=0 QTime=0
   [junit4]   2> 1770045 INFO  (TEST-MBeansHandlerTest.testBackCompatNames-seed#[4B0AB59D4FFF8D25])
[    ] o.a.s.c.S.Request [collection1]  webapp=null path=null params={qt=/admin/mbeans&cat=UPDATE&wt=xml}
status=0 QTime=0
   [junit4]   2> 1770045 INFO  (TEST-MBeansHandlerTest.testBackCompatNames-seed#[4B0AB59D4FFF8D25])
[    ] o.a.s.SolrTestCaseJ4 ###Ending testBackCompatNames
   [junit4]   2> 1770048 INFO  (TEST-MBeansHandlerTest.testXMLDiffWithExternalEntity-seed#[4B0AB59D4FFF8D25])
[    ] o.a.s.SolrTestCaseJ4 ###Starting testXMLDiffWithExternalEntity
   [junit4]   2> 1770080 INFO  (TEST-MBeansHandlerTest.testXMLDiffWithExternalEntity-seed#[4B0AB59D4FFF8D25])
[    ] o.a.s.SolrTestCaseJ4 ###Ending testXMLDiffWithExternalEntity
   [junit4]   2> 1770083 INFO  (TEST-MBeansHandlerTest.testDiff-seed#[4B0AB59D4FFF8D25])
[    ] o.a.s.SolrTestCaseJ4 ###Starting testDiff
   [junit4]   2> 1770084 INFO  (TEST-MBeansHandlerTest.testDiff-seed#[4B0AB59D4FFF8D25])
[    ] o.a.s.c.S.Request [collection1]  webapp=null path=null params={qt=/admin/mbeans&stats=true&wt=xml}
status=0 QTime=1
   [junit4]   2> 1770114 INFO  (TEST-MBeansHandlerTest.testDiff-seed#[4B0AB59D4FFF8D25])
[    ] o.a.s.c.S.Request [collection1]  webapp=null path=null params={qt=/admin/mbeans&stats=true&diff=true&wt=xml}
status=0 QTime=26
   [junit4]   2> 1770116 INFO  (TEST-MBeansHandlerTest.testDiff-seed#[4B0AB59D4FFF8D25])
[    ] o.a.s.SolrTestCaseJ4 ###Ending testDiff
   [junit4]   2> NOTE: reproduce with: ant test  -Dtestcase=MBeansHandlerTest -Dtests.method=testDiff
-Dtests.seed=4B0AB59D4FFF8D25 -Dtests.multiplier=3 -Dtests.slow=true -Dtests.locale=bg -Dtests.timezone=AET
-Dtests.asserts=true -Dtests.file.encoding=UTF-8
   [junit4] FAILURE 0.04s J0 | MBeansHandlerTest.testDiff <<<
   [junit4]    > Throwable #1: org.junit.ComparisonFailure: expected:<Was: [1, Now:
2], Delta: 1> but was:<Was: [4, Now: 5], Delta: 1>
   [junit4]    > 	at __randomizedtesting.SeedInfo.seed([4B0AB59D4FFF8D25:8E1C71065F49B545]:0)
   [junit4]    > 	at org.apache.solr.handler.admin.MBeansHandlerTest.testDiff(MBeansHandlerTest.java:63)
   [junit4]    > 	at java.lang.Thread.run(Thread.java:745)
   [junit4]   2> 1770120 INFO  (SUITE-MBeansHandlerTest-seed#[4B0AB59D4FFF8D25]-worker)
[    ] o.a.s.SolrTestCaseJ4 ###deleteCore
   [junit4]   2> 1770120 INFO  (SUITE-MBeansHandlerTest-seed#[4B0AB59D4FFF8D25]-worker)
[    ] o.a.s.c.CoreContainer Shutting down CoreContainer instance=21215983
   [junit4]   2> 1770120 INFO  (coreCloseExecutor-3766-thread-1) [    x:collection1] o.a.s.c.SolrCore
[collection1]  CLOSING SolrCore org.apache.solr.core.SolrCore@17217bb
   [junit4]   2> 1770188 INFO  (coreCloseExecutor-3766-thread-1) [    x:collection1] o.a.s.m.SolrMetricManager
Closing metric reporters for: solr.core.collection1
   [junit4]   2> 1770192 INFO  (SUITE-MBeansHandlerTest-seed#[4B0AB59D4FFF8D25]-worker)
[    ] o.a.s.m.SolrMetricManager Closing metric reporters for: solr.node
   [junit4]   2> NOTE: leaving temporary files on disk at: /home/jenkins/workspace/Lucene-Solr-6.4-Linux/solr/build/solr-core/test/J0/temp/solr.handler.admin.MBeansHandlerTest_4B0AB59D4FFF8D25-001
   [junit4]   2> NOTE: test params are: codec=Asserting(Lucene62): {}, docValues:{}, maxPointsInLeafNode=314,
maxMBSortInHeap=6.203569887591655, sim=RandomSimilarity(queryNorm=true,coord=yes): {}, locale=bg,
timezone=AET
   [junit4]   2> NOTE: Linux 4.4.0-53-generic i386/Oracle Corporation 1.8.0_121 (32-bit)/cpus=12,threads=1,free=64339088,total=487612416
   [junit4]   2> NOTE: All tests run in this JVM: [TestSearcherReuse, JSONWriterTest, TestPHPSerializedResponseWriter,
TestPerFieldSimilarityWithDefaultOverride, TestSolrConfigHandler, TestManagedSchemaAPI, TestSlowCompositeReaderWrapper,
TestChildDocTransformer, ZkStateReaderTest, RuleEngineTest, SolrSlf4jReporterTest, TestExceedMaxTermLength,
TestRandomDVFaceting, TestRandomFlRTGCloud, TestUniqueKeyFieldResource, PreAnalyzedUpdateProcessorTest,
PathHierarchyTokenizerFactoryTest, HdfsBasicDistributedZkTest, TestTolerantUpdateProcessorCloud,
TestFastWriter, ResourceLoaderTest, TestXmlQParser, TestCustomDocTransformer, ReplaceNodeTest,
NumericFieldsTest, SynonymTokenizerTest, ShardSplitTest, HdfsWriteToMultipleCollectionsTest,
ConjunctionSolrSpellCheckerTest, DateFieldTest, UUIDFieldTest, TestFileDictionaryLookup, TestRawResponseWriter,
CacheHeaderTest, TestDownShardTolerantSearch, ZkNodePropsTest, TestHighlightDedupGrouping,
SolrRequestParserTest, AnalysisAfterCoreReloadTest, BasicDistributedZkTest, ScriptEngineTest,
TestPseudoReturnFields, TestRemoteStreaming, TestReplicaProperties, TestSolr4Spatial, TestRangeQuery,
CurrencyFieldOpenExchangeTest, TestStressLucene, TestNRTOpen, TestBinaryResponseWriter, TestCloudRecovery,
TestLazyCores, TestQuerySenderNoQuery, AsyncCallRequestStatusResponseTest, TestCorePropertiesReload,
TestFieldCacheWithThreads, TestLocalFSCloudBackupRestore, ReturnFieldsTest, TestConfigSetsAPI,
TestCloudSchemaless, BlockCacheTest, TestJmxIntegration, HttpPartitionTest, PeerSyncReplicationTest,
HdfsRecoveryZkTest, DistributedSpellCheckComponentTest, DateRangeFieldTest, TestReplicationHandlerBackup,
TestAddFieldRealTimeGet, TestConfigSetImmutable, AnalysisErrorHandlingTest, QueryResultKeyTest,
TestNamedUpdateProcessors, ExternalFileFieldSortTest, TestFoldingMultitermQuery, DistributedFacetPivotLargeTest,
TestDynamicFieldResource, OverriddenZkACLAndCredentialsProvidersTest, AnalyticsMergeStrategyTest,
DeleteLastCustomShardedReplicaTest, DistributedFacetPivotSmallTest, TestFieldTypeCollectionResource,
TestAuthorizationFramework, TestDistribIDF, QueryElevationComponentTest, MBeansHandlerTest]
   [junit4] Completed [440/680 (1!)] on J0 in 0.83s, 3 tests, 1 failure <<< FAILURES!

[...truncated 55513 lines...]


Mime
View raw message