lucene-dev mailing list archives

Site index · List index
Message view « Date » · « Thread »
Top « Date » · « Thread »
From Policeman Jenkins Server <jenk...@thetaphi.de>
Subject [JENKINS] Lucene-Solr-master-Windows (32bit/jdk1.8.0_121) - Build # 6379 - Still unstable!
Date Mon, 06 Feb 2017 11:14:13 GMT
Build: https://jenkins.thetaphi.de/job/Lucene-Solr-master-Windows/6379/
Java: 32bit/jdk1.8.0_121 -server -XX:+UseG1GC

3 tests failed.
FAILED:  org.apache.solr.core.TestLazyCores.testNoCommit

Error Message:
Exception during query

Stack Trace:
java.lang.RuntimeException: Exception during query
	at __randomizedtesting.SeedInfo.seed([D821DE5AB1A8DB83:7417F8B7A8FB826]:0)
	at org.apache.solr.SolrTestCaseJ4.assertQ(SolrTestCaseJ4.java:857)
	at org.apache.solr.core.TestLazyCores.check10(TestLazyCores.java:794)
	at org.apache.solr.core.TestLazyCores.testNoCommit(TestLazyCores.java:776)
	at sun.reflect.NativeMethodAccessorImpl.invoke0(Native Method)
	at sun.reflect.NativeMethodAccessorImpl.invoke(NativeMethodAccessorImpl.java:62)
	at sun.reflect.DelegatingMethodAccessorImpl.invoke(DelegatingMethodAccessorImpl.java:43)
	at java.lang.reflect.Method.invoke(Method.java:498)
	at com.carrotsearch.randomizedtesting.RandomizedRunner.invoke(RandomizedRunner.java:1713)
	at com.carrotsearch.randomizedtesting.RandomizedRunner$8.evaluate(RandomizedRunner.java:907)
	at com.carrotsearch.randomizedtesting.RandomizedRunner$9.evaluate(RandomizedRunner.java:943)
	at com.carrotsearch.randomizedtesting.RandomizedRunner$10.evaluate(RandomizedRunner.java:957)
	at com.carrotsearch.randomizedtesting.rules.SystemPropertiesRestoreRule$1.evaluate(SystemPropertiesRestoreRule.java:57)
	at org.apache.lucene.util.TestRuleSetupTeardownChained$1.evaluate(TestRuleSetupTeardownChained.java:49)
	at org.apache.lucene.util.AbstractBeforeAfterRule$1.evaluate(AbstractBeforeAfterRule.java:45)
	at org.apache.lucene.util.TestRuleThreadAndTestName$1.evaluate(TestRuleThreadAndTestName.java:48)
	at org.apache.lucene.util.TestRuleIgnoreAfterMaxFailures$1.evaluate(TestRuleIgnoreAfterMaxFailures.java:64)
	at org.apache.lucene.util.TestRuleMarkFailure$1.evaluate(TestRuleMarkFailure.java:47)
	at com.carrotsearch.randomizedtesting.rules.StatementAdapter.evaluate(StatementAdapter.java:36)
	at com.carrotsearch.randomizedtesting.ThreadLeakControl$StatementRunner.run(ThreadLeakControl.java:368)
	at com.carrotsearch.randomizedtesting.ThreadLeakControl.forkTimeoutingTask(ThreadLeakControl.java:817)
	at com.carrotsearch.randomizedtesting.ThreadLeakControl$3.evaluate(ThreadLeakControl.java:468)
	at com.carrotsearch.randomizedtesting.RandomizedRunner.runSingleTest(RandomizedRunner.java:916)
	at com.carrotsearch.randomizedtesting.RandomizedRunner$5.evaluate(RandomizedRunner.java:802)
	at com.carrotsearch.randomizedtesting.RandomizedRunner$6.evaluate(RandomizedRunner.java:852)
	at com.carrotsearch.randomizedtesting.RandomizedRunner$7.evaluate(RandomizedRunner.java:863)
	at com.carrotsearch.randomizedtesting.rules.StatementAdapter.evaluate(StatementAdapter.java:36)
	at com.carrotsearch.randomizedtesting.rules.SystemPropertiesRestoreRule$1.evaluate(SystemPropertiesRestoreRule.java:57)
	at org.apache.lucene.util.AbstractBeforeAfterRule$1.evaluate(AbstractBeforeAfterRule.java:45)
	at com.carrotsearch.randomizedtesting.rules.StatementAdapter.evaluate(StatementAdapter.java:36)
	at org.apache.lucene.util.TestRuleStoreClassName$1.evaluate(TestRuleStoreClassName.java:41)
	at com.carrotsearch.randomizedtesting.rules.NoShadowingOrOverridesOnMethodsRule$1.evaluate(NoShadowingOrOverridesOnMethodsRule.java:40)
	at com.carrotsearch.randomizedtesting.rules.NoShadowingOrOverridesOnMethodsRule$1.evaluate(NoShadowingOrOverridesOnMethodsRule.java:40)
	at com.carrotsearch.randomizedtesting.rules.StatementAdapter.evaluate(StatementAdapter.java:36)
	at com.carrotsearch.randomizedtesting.rules.StatementAdapter.evaluate(StatementAdapter.java:36)
	at com.carrotsearch.randomizedtesting.rules.StatementAdapter.evaluate(StatementAdapter.java:36)
	at org.apache.lucene.util.TestRuleAssertionsRequired$1.evaluate(TestRuleAssertionsRequired.java:53)
	at org.apache.lucene.util.TestRuleMarkFailure$1.evaluate(TestRuleMarkFailure.java:47)
	at org.apache.lucene.util.TestRuleIgnoreAfterMaxFailures$1.evaluate(TestRuleIgnoreAfterMaxFailures.java:64)
	at org.apache.lucene.util.TestRuleIgnoreTestSuites$1.evaluate(TestRuleIgnoreTestSuites.java:54)
	at com.carrotsearch.randomizedtesting.rules.StatementAdapter.evaluate(StatementAdapter.java:36)
	at com.carrotsearch.randomizedtesting.ThreadLeakControl$StatementRunner.run(ThreadLeakControl.java:368)
	at java.lang.Thread.run(Thread.java:745)
Caused by: java.lang.RuntimeException: REQUEST FAILED: xpath=//result[@numFound='10']
	xml response was: <?xml version="1.0" encoding="UTF-8"?>
<response>

<lst name="responseHeader">
  <int name="status">0</int>
  <int name="QTime">0</int>
  <lst name="params">
    <str name="q">*:*</str>
  </lst>
</lst>
<result name="response" numFound="0" start="0">
</result>
</response>

	request was:q=*:*
	at org.apache.solr.SolrTestCaseJ4.assertQ(SolrTestCaseJ4.java:850)
	... 41 more


FAILED:  junit.framework.TestSuite.org.apache.solr.core.TestLazyCores

Error Message:
1 thread leaked from SUITE scope at org.apache.solr.core.TestLazyCores:     1) Thread[id=10501, name=searcherExecutor-4588-thread-1, state=WAITING, group=TGRP-TestLazyCores]         at sun.misc.Unsafe.park(Native Method)         at java.util.concurrent.locks.LockSupport.park(LockSupport.java:175)         at java.util.concurrent.locks.AbstractQueuedSynchronizer$ConditionObject.await(AbstractQueuedSynchronizer.java:2039)         at java.util.concurrent.LinkedBlockingQueue.take(LinkedBlockingQueue.java:442)         at java.util.concurrent.ThreadPoolExecutor.getTask(ThreadPoolExecutor.java:1067)         at java.util.concurrent.ThreadPoolExecutor.runWorker(ThreadPoolExecutor.java:1127)         at java.util.concurrent.ThreadPoolExecutor$Worker.run(ThreadPoolExecutor.java:617)         at java.lang.Thread.run(Thread.java:745)

Stack Trace:
com.carrotsearch.randomizedtesting.ThreadLeakError: 1 thread leaked from SUITE scope at org.apache.solr.core.TestLazyCores: 
   1) Thread[id=10501, name=searcherExecutor-4588-thread-1, state=WAITING, group=TGRP-TestLazyCores]
        at sun.misc.Unsafe.park(Native Method)
        at java.util.concurrent.locks.LockSupport.park(LockSupport.java:175)
        at java.util.concurrent.locks.AbstractQueuedSynchronizer$ConditionObject.await(AbstractQueuedSynchronizer.java:2039)
        at java.util.concurrent.LinkedBlockingQueue.take(LinkedBlockingQueue.java:442)
        at java.util.concurrent.ThreadPoolExecutor.getTask(ThreadPoolExecutor.java:1067)
        at java.util.concurrent.ThreadPoolExecutor.runWorker(ThreadPoolExecutor.java:1127)
        at java.util.concurrent.ThreadPoolExecutor$Worker.run(ThreadPoolExecutor.java:617)
        at java.lang.Thread.run(Thread.java:745)
	at __randomizedtesting.SeedInfo.seed([D821DE5AB1A8DB83]:0)


FAILED:  junit.framework.TestSuite.org.apache.solr.core.TestLazyCores

Error Message:
There are still zombie threads that couldn't be terminated:    1) Thread[id=10501, name=searcherExecutor-4588-thread-1, state=WAITING, group=TGRP-TestLazyCores]         at sun.misc.Unsafe.park(Native Method)         at java.util.concurrent.locks.LockSupport.park(LockSupport.java:175)         at java.util.concurrent.locks.AbstractQueuedSynchronizer$ConditionObject.await(AbstractQueuedSynchronizer.java:2039)         at java.util.concurrent.LinkedBlockingQueue.take(LinkedBlockingQueue.java:442)         at java.util.concurrent.ThreadPoolExecutor.getTask(ThreadPoolExecutor.java:1067)         at java.util.concurrent.ThreadPoolExecutor.runWorker(ThreadPoolExecutor.java:1127)         at java.util.concurrent.ThreadPoolExecutor$Worker.run(ThreadPoolExecutor.java:617)         at java.lang.Thread.run(Thread.java:745)

Stack Trace:
com.carrotsearch.randomizedtesting.ThreadLeakError: There are still zombie threads that couldn't be terminated:
   1) Thread[id=10501, name=searcherExecutor-4588-thread-1, state=WAITING, group=TGRP-TestLazyCores]
        at sun.misc.Unsafe.park(Native Method)
        at java.util.concurrent.locks.LockSupport.park(LockSupport.java:175)
        at java.util.concurrent.locks.AbstractQueuedSynchronizer$ConditionObject.await(AbstractQueuedSynchronizer.java:2039)
        at java.util.concurrent.LinkedBlockingQueue.take(LinkedBlockingQueue.java:442)
        at java.util.concurrent.ThreadPoolExecutor.getTask(ThreadPoolExecutor.java:1067)
        at java.util.concurrent.ThreadPoolExecutor.runWorker(ThreadPoolExecutor.java:1127)
        at java.util.concurrent.ThreadPoolExecutor$Worker.run(ThreadPoolExecutor.java:617)
        at java.lang.Thread.run(Thread.java:745)
	at __randomizedtesting.SeedInfo.seed([D821DE5AB1A8DB83]:0)




Build Log:
[...truncated 11606 lines...]
   [junit4] Suite: org.apache.solr.core.TestLazyCores
   [junit4]   2> Creating dataDir: C:\Users\jenkins\workspace\Lucene-Solr-master-Windows\solr\build\solr-core\test\J0\temp\solr.core.TestLazyCores_D821DE5AB1A8DB83-001\init-core-data-001
   [junit4]   2> 1389089 INFO  (SUITE-TestLazyCores-seed#[D821DE5AB1A8DB83]-worker) [    ] o.a.s.SolrTestCaseJ4 Using TrieFields
   [junit4]   2> 1389097 INFO  (SUITE-TestLazyCores-seed#[D821DE5AB1A8DB83]-worker) [    ] o.a.s.SolrTestCaseJ4 Randomized ssl (true) and clientAuth (false) via: @org.apache.solr.util.RandomizeSSL(reason=, value=NaN, ssl=NaN, clientAuth=NaN)
   [junit4]   2> 1389099 INFO  (TEST-TestLazyCores.testNoCommit-seed#[D821DE5AB1A8DB83]) [    ] o.a.s.SolrTestCaseJ4 ###Starting testNoCommit
   [junit4]   2> 1389193 INFO  (TEST-TestLazyCores.testNoCommit-seed#[D821DE5AB1A8DB83]) [    ] o.a.s.c.SolrCores Allocating transient cache for 4 transient cores
   [junit4]   2> 1389380 WARN  (coreLoadExecutor-4555-thread-1) [    x:collection1] o.a.s.c.Config Beginning with Solr 5.5, <mergePolicy> is deprecated, use <mergePolicyFactory> instead.
   [junit4]   2> 1389380 WARN  (coreLoadExecutor-4555-thread-3) [    x:collection5] o.a.s.c.Config Beginning with Solr 5.5, <mergePolicy> is deprecated, use <mergePolicyFactory> instead.
   [junit4]   2> 1389380 WARN  (coreLoadExecutor-4555-thread-2) [    x:collection2] o.a.s.c.Config Beginning with Solr 5.5, <mergePolicy> is deprecated, use <mergePolicyFactory> instead.
   [junit4]   2> 1389380 INFO  (coreLoadExecutor-4555-thread-1) [    x:collection1] o.a.s.c.SolrConfig Using Lucene MatchVersion: 7.0.0
   [junit4]   2> 1389380 INFO  (coreLoadExecutor-4555-thread-3) [    x:collection5] o.a.s.c.SolrConfig Using Lucene MatchVersion: 7.0.0
   [junit4]   2> 1389380 INFO  (coreLoadExecutor-4555-thread-2) [    x:collection2] o.a.s.c.SolrConfig Using Lucene MatchVersion: 7.0.0
   [junit4]   2> 1389389 INFO  (coreLoadExecutor-4555-thread-2) [    x:collection2] o.a.s.s.IndexSchema [collection2] Schema name=tiny
   [junit4]   2> 1389389 INFO  (coreLoadExecutor-4555-thread-1) [    x:collection1] o.a.s.s.IndexSchema [collection1] Schema name=tiny
   [junit4]   2> 1389389 INFO  (coreLoadExecutor-4555-thread-3) [    x:collection5] o.a.s.s.IndexSchema [collection5] Schema name=tiny
   [junit4]   2> 1389395 INFO  (coreLoadExecutor-4555-thread-3) [    x:collection5] o.a.s.s.IndexSchema Loaded schema tiny/1.1 with uniqueid field id
   [junit4]   2> 1389395 INFO  (coreLoadExecutor-4555-thread-2) [    x:collection2] o.a.s.s.IndexSchema Loaded schema tiny/1.1 with uniqueid field id
   [junit4]   2> 1389408 INFO  (coreLoadExecutor-4555-thread-2) [    x:collection2] o.a.s.c.CoreContainer Creating SolrCore 'collection2' using configuration from instancedir C:\Users\jenkins\workspace\Lucene-Solr-master-Windows\solr\build\solr-core\test\J0\temp\solr.core.TestLazyCores_D821DE5AB1A8DB83-001\tempDir-001\collection2
   [junit4]   2> 1389408 INFO  (coreLoadExecutor-4555-thread-3) [    x:collection5] o.a.s.c.CoreContainer Creating SolrCore 'collection5' using configuration from instancedir C:\Users\jenkins\workspace\Lucene-Solr-master-Windows\solr\build\solr-core\test\J0\temp\solr.core.TestLazyCores_D821DE5AB1A8DB83-001\tempDir-001\collection5
   [junit4]   2> 1389409 INFO  (coreLoadExecutor-4555-thread-2) [    x:collection2] o.a.s.c.SolrCore [[collection2] ] Opening new SolrCore at [C:\Users\jenkins\workspace\Lucene-Solr-master-Windows\solr\build\solr-core\test\J0\temp\solr.core.TestLazyCores_D821DE5AB1A8DB83-001\tempDir-001\collection2], dataDir=[C:\Users\jenkins\workspace\Lucene-Solr-master-Windows\solr\build\solr-core\test\J0\temp\solr.core.TestLazyCores_D821DE5AB1A8DB83-001\tempDir-001\collection2\data\]
   [junit4]   2> 1389409 INFO  (coreLoadExecutor-4555-thread-3) [    x:collection5] o.a.s.c.SolrCore [[collection5] ] Opening new SolrCore at [C:\Users\jenkins\workspace\Lucene-Solr-master-Windows\solr\build\solr-core\test\J0\temp\solr.core.TestLazyCores_D821DE5AB1A8DB83-001\tempDir-001\collection5], dataDir=[C:\Users\jenkins\workspace\Lucene-Solr-master-Windows\solr\build\solr-core\test\J0\temp\solr.core.TestLazyCores_D821DE5AB1A8DB83-001\tempDir-001\collection5\data\]
   [junit4]   2> 1389417 INFO  (coreLoadExecutor-4555-thread-3) [    x:collection5] o.a.s.u.RandomMergePolicy RandomMergePolicy wrapping class org.apache.lucene.index.TieredMergePolicy: [TieredMergePolicy: maxMergeAtOnce=6, maxMergeAtOnceExplicit=5, maxMergedSegmentMB=71.3193359375, floorSegmentMB=1.8857421875, forceMergeDeletesPctAllowed=19.06230029912371, segmentsPerTier=29.0, maxCFSSegmentSizeMB=8.796093022207999E12, noCFSRatio=0.7420682934276116
   [junit4]   2> 1389418 INFO  (coreLoadExecutor-4555-thread-2) [    x:collection2] o.a.s.u.RandomMergePolicy RandomMergePolicy wrapping class org.apache.lucene.index.TieredMergePolicy: [TieredMergePolicy: maxMergeAtOnce=6, maxMergeAtOnceExplicit=5, maxMergedSegmentMB=71.3193359375, floorSegmentMB=1.8857421875, forceMergeDeletesPctAllowed=19.06230029912371, segmentsPerTier=29.0, maxCFSSegmentSizeMB=8.796093022207999E12, noCFSRatio=0.7420682934276116
   [junit4]   2> 1389423 INFO  (coreLoadExecutor-4555-thread-1) [    x:collection1] o.a.s.s.IndexSchema Loaded schema tiny/1.1 with uniqueid field id
   [junit4]   2> 1389434 INFO  (coreLoadExecutor-4555-thread-1) [    x:collection1] o.a.s.c.CoreContainer Creating SolrCore 'collection1' using configuration from instancedir C:\Users\jenkins\workspace\Lucene-Solr-master-Windows\solr\build\solr-core\test\J0\temp\solr.core.TestLazyCores_D821DE5AB1A8DB83-001\tempDir-001\collection1
   [junit4]   2> 1389435 INFO  (coreLoadExecutor-4555-thread-1) [    x:collection1] o.a.s.c.SolrCore [[collection1] ] Opening new SolrCore at [C:\Users\jenkins\workspace\Lucene-Solr-master-Windows\solr\build\solr-core\test\J0\temp\solr.core.TestLazyCores_D821DE5AB1A8DB83-001\tempDir-001\collection1], dataDir=[C:\Users\jenkins\workspace\Lucene-Solr-master-Windows\solr\build\solr-core\test\J0\temp\solr.core.TestLazyCores_D821DE5AB1A8DB83-001\tempDir-001\collection1\data\]
   [junit4]   2> 1389446 INFO  (coreLoadExecutor-4555-thread-1) [    x:collection1] o.a.s.u.RandomMergePolicy RandomMergePolicy wrapping class org.apache.lucene.index.TieredMergePolicy: [TieredMergePolicy: maxMergeAtOnce=6, maxMergeAtOnceExplicit=5, maxMergedSegmentMB=71.3193359375, floorSegmentMB=1.8857421875, forceMergeDeletesPctAllowed=19.06230029912371, segmentsPerTier=29.0, maxCFSSegmentSizeMB=8.796093022207999E12, noCFSRatio=0.7420682934276116
   [junit4]   2> 1389611 INFO  (coreLoadExecutor-4555-thread-1) [    x:collection1] o.a.s.u.CommitTracker Hard AutoCommit: disabled
   [junit4]   2> 1389611 INFO  (coreLoadExecutor-4555-thread-1) [    x:collection1] o.a.s.u.CommitTracker Soft AutoCommit: disabled
   [junit4]   2> 1389611 INFO  (coreLoadExecutor-4555-thread-1) [    x:collection1] o.a.s.u.RandomMergePolicy RandomMergePolicy wrapping class org.apache.lucene.index.TieredMergePolicy: [TieredMergePolicy: maxMergeAtOnce=45, maxMergeAtOnceExplicit=13, maxMergedSegmentMB=39.5986328125, floorSegmentMB=1.2421875, forceMergeDeletesPctAllowed=6.569934249772057, segmentsPerTier=19.0, maxCFSSegmentSizeMB=8.796093022207999E12, noCFSRatio=0.0
   [junit4]   2> 1389612 INFO  (coreLoadExecutor-4555-thread-1) [    x:collection1] o.a.s.s.SolrIndexSearcher Opening [Searcher@c3f24d[collection1] main]
   [junit4]   2> 1389613 INFO  (coreLoadExecutor-4555-thread-1) [    x:collection1] o.a.s.r.ManagedResourceStorage File-based storage initialized to use dir: C:\Users\jenkins\workspace\Lucene-Solr-master-Windows\solr\build\solr-core\test\J0\temp\solr.core.TestLazyCores_D821DE5AB1A8DB83-001\tempDir-001\collection1\conf
   [junit4]   2> 1389614 INFO  (coreLoadExecutor-4555-thread-1) [    x:collection1] o.a.s.h.ReplicationHandler Commits will be reserved for  10000
   [junit4]   2> 1389619 INFO  (searcherExecutor-4558-thread-1-processing-x:collection1) [    x:collection1] o.a.s.c.SolrCore [collection1] Registered new searcher Searcher@c3f24d[collection1] main{ExitableDirectoryReader(UninvertingDirectoryReader())}
   [junit4]   2> 1389622 INFO  (coreLoadExecutor-4555-thread-2) [    x:collection2] o.a.s.u.CommitTracker Hard AutoCommit: disabled
   [junit4]   2> 1389622 INFO  (coreLoadExecutor-4555-thread-2) [    x:collection2] o.a.s.u.CommitTracker Soft AutoCommit: disabled
   [junit4]   2> 1389622 INFO  (coreLoadExecutor-4555-thread-3) [    x:collection5] o.a.s.u.CommitTracker Hard AutoCommit: disabled
   [junit4]   2> 1389622 INFO  (coreLoadExecutor-4555-thread-3) [    x:collection5] o.a.s.u.CommitTracker Soft AutoCommit: disabled
   [junit4]   2> 1389624 INFO  (coreLoadExecutor-4555-thread-2) [    x:collection2] o.a.s.u.RandomMergePolicy RandomMergePolicy wrapping class org.apache.lucene.index.TieredMergePolicy: [TieredMergePolicy: maxMergeAtOnce=45, maxMergeAtOnceExplicit=13, maxMergedSegmentMB=39.5986328125, floorSegmentMB=1.2421875, forceMergeDeletesPctAllowed=6.569934249772057, segmentsPerTier=19.0, maxCFSSegmentSizeMB=8.796093022207999E12, noCFSRatio=0.0
   [junit4]   2> 1389624 INFO  (coreLoadExecutor-4555-thread-3) [    x:collection5] o.a.s.u.RandomMergePolicy RandomMergePolicy wrapping class org.apache.lucene.index.TieredMergePolicy: [TieredMergePolicy: maxMergeAtOnce=45, maxMergeAtOnceExplicit=13, maxMergedSegmentMB=39.5986328125, floorSegmentMB=1.2421875, forceMergeDeletesPctAllowed=6.569934249772057, segmentsPerTier=19.0, maxCFSSegmentSizeMB=8.796093022207999E12, noCFSRatio=0.0
   [junit4]   2> 1389625 INFO  (coreLoadExecutor-4555-thread-2) [    x:collection2] o.a.s.s.SolrIndexSearcher Opening [Searcher@45f010[collection2] main]
   [junit4]   2> 1389626 INFO  (coreLoadExecutor-4555-thread-3) [    x:collection5] o.a.s.s.SolrIndexSearcher Opening [Searcher@1c239a6[collection5] main]
   [junit4]   2> 1389627 INFO  (coreLoadExecutor-4555-thread-2) [    x:collection2] o.a.s.r.ManagedResourceStorage File-based storage initialized to use dir: C:\Users\jenkins\workspace\Lucene-Solr-master-Windows\solr\build\solr-core\test\J0\temp\solr.core.TestLazyCores_D821DE5AB1A8DB83-001\tempDir-001\collection2\conf
   [junit4]   2> 1389627 INFO  (coreLoadExecutor-4555-thread-3) [    x:collection5] o.a.s.r.ManagedResourceStorage File-based storage initialized to use dir: C:\Users\jenkins\workspace\Lucene-Solr-master-Windows\solr\build\solr-core\test\J0\temp\solr.core.TestLazyCores_D821DE5AB1A8DB83-001\tempDir-001\collection5\conf
   [junit4]   2> 1389627 INFO  (coreLoadExecutor-4555-thread-2) [    x:collection2] o.a.s.h.ReplicationHandler Commits will be reserved for  10000
   [junit4]   2> 1389627 INFO  (coreLoadExecutor-4555-thread-3) [    x:collection5] o.a.s.h.ReplicationHandler Commits will be reserved for  10000
   [junit4]   2> 1389628 INFO  (coreLoadExecutor-4555-thread-2) [    x:collection2] o.a.s.c.SolrCores Opening transient core collection2
   [junit4]   2> 1389629 INFO  (searcherExecutor-4557-thread-1-processing-x:collection5) [    x:collection5] o.a.s.c.SolrCore [collection5] Registered new searcher Searcher@1c239a6[collection5] main{ExitableDirectoryReader(UninvertingDirectoryReader())}
   [junit4]   2> 1389629 INFO  (searcherExecutor-4556-thread-1-processing-x:collection2) [    x:collection2] o.a.s.c.SolrCore [collection2] Registered new searcher Searcher@45f010[collection2] main{ExitableDirectoryReader(UninvertingDirectoryReader())}
   [junit4]   2> 1389679 WARN  (TEST-TestLazyCores.testNoCommit-seed#[D821DE5AB1A8DB83]) [    x:collection3] o.a.s.c.Config Beginning with Solr 5.5, <mergePolicy> is deprecated, use <mergePolicyFactory> instead.
   [junit4]   2> 1389679 INFO  (TEST-TestLazyCores.testNoCommit-seed#[D821DE5AB1A8DB83]) [    x:collection3] o.a.s.c.SolrConfig Using Lucene MatchVersion: 7.0.0
   [junit4]   2> 1389687 INFO  (TEST-TestLazyCores.testNoCommit-seed#[D821DE5AB1A8DB83]) [    x:collection3] o.a.s.s.IndexSchema [collection3] Schema name=tiny
   [junit4]   2> 1389693 INFO  (TEST-TestLazyCores.testNoCommit-seed#[D821DE5AB1A8DB83]) [    x:collection3] o.a.s.s.IndexSchema Loaded schema tiny/1.1 with uniqueid field id
   [junit4]   2> 1389705 INFO  (TEST-TestLazyCores.testNoCommit-seed#[D821DE5AB1A8DB83]) [    x:collection3] o.a.s.c.CoreContainer Creating SolrCore 'collection3' using configuration from instancedir C:\Users\jenkins\workspace\Lucene-Solr-master-Windows\solr\build\solr-core\test\J0\temp\solr.core.TestLazyCores_D821DE5AB1A8DB83-001\tempDir-001\collection3
   [junit4]   2> 1389706 INFO  (TEST-TestLazyCores.testNoCommit-seed#[D821DE5AB1A8DB83]) [    x:collection3] o.a.s.c.SolrCore [[collection3] ] Opening new SolrCore at [C:\Users\jenkins\workspace\Lucene-Solr-master-Windows\solr\build\solr-core\test\J0\temp\solr.core.TestLazyCores_D821DE5AB1A8DB83-001\tempDir-001\collection3], dataDir=[C:\Users\jenkins\workspace\Lucene-Solr-master-Windows\solr\build\solr-core\test\J0\temp\solr.core.TestLazyCores_D821DE5AB1A8DB83-001\tempDir-001\collection3\data\]
   [junit4]   2> 1389717 INFO  (TEST-TestLazyCores.testNoCommit-seed#[D821DE5AB1A8DB83]) [    x:collection3] o.a.s.u.RandomMergePolicy RandomMergePolicy wrapping class org.apache.lucene.index.LogDocMergePolicy: [LogDocMergePolicy: minMergeSize=1000, mergeFactor=37, maxMergeSize=9223372036854775807, maxMergeSizeForForcedMerge=9223372036854775807, calibrateSizeByDeletes=false, maxMergeDocs=2147483647, maxCFSSegmentSizeMB=8.796093022207999E12, noCFSRatio=0.42652481184794444]
   [junit4]   2> 1389867 INFO  (TEST-TestLazyCores.testNoCommit-seed#[D821DE5AB1A8DB83]) [    x:collection3] o.a.s.u.CommitTracker Hard AutoCommit: disabled
   [junit4]   2> 1389867 INFO  (TEST-TestLazyCores.testNoCommit-seed#[D821DE5AB1A8DB83]) [    x:collection3] o.a.s.u.CommitTracker Soft AutoCommit: disabled
   [junit4]   2> 1389868 INFO  (TEST-TestLazyCores.testNoCommit-seed#[D821DE5AB1A8DB83]) [    x:collection3] o.a.s.u.RandomMergePolicy RandomMergePolicy wrapping class org.apache.lucene.index.TieredMergePolicy: [TieredMergePolicy: maxMergeAtOnce=48, maxMergeAtOnceExplicit=35, maxMergedSegmentMB=0.0087890625, floorSegmentMB=2.1201171875, forceMergeDeletesPctAllowed=24.226736505863766, segmentsPerTier=22.0, maxCFSSegmentSizeMB=8.796093022207999E12, noCFSRatio=0.8624491134618132
   [junit4]   2> 1389869 INFO  (TEST-TestLazyCores.testNoCommit-seed#[D821DE5AB1A8DB83]) [    x:collection3] o.a.s.s.SolrIndexSearcher Opening [Searcher@7af709[collection3] main]
   [junit4]   2> 1389870 INFO  (TEST-TestLazyCores.testNoCommit-seed#[D821DE5AB1A8DB83]) [    x:collection3] o.a.s.r.ManagedResourceStorage File-based storage initialized to use dir: C:\Users\jenkins\workspace\Lucene-Solr-master-Windows\solr\build\solr-core\test\J0\temp\solr.core.TestLazyCores_D821DE5AB1A8DB83-001\tempDir-001\collection3\conf
   [junit4]   2> 1389871 INFO  (TEST-TestLazyCores.testNoCommit-seed#[D821DE5AB1A8DB83]) [    x:collection3] o.a.s.h.ReplicationHandler Commits will be reserved for  10000
   [junit4]   2> 1389871 INFO  (searcherExecutor-4568-thread-1-processing-x:collection3) [    x:collection3] o.a.s.c.SolrCore [collection3] Registered new searcher Searcher@7af709[collection3] main{ExitableDirectoryReader(UninvertingDirectoryReader())}
   [junit4]   2> 1389871 INFO  (TEST-TestLazyCores.testNoCommit-seed#[D821DE5AB1A8DB83]) [    x:collection3] o.a.s.c.SolrCores Opening transient core collection3
   [junit4]   2> 1389919 WARN  (TEST-TestLazyCores.testNoCommit-seed#[D821DE5AB1A8DB83]) [    x:collection3] o.a.s.c.Config Beginning with Solr 5.5, <mergePolicy> is deprecated, use <mergePolicyFactory> instead.
   [junit4]   2> 1389919 INFO  (TEST-TestLazyCores.testNoCommit-seed#[D821DE5AB1A8DB83]) [    x:collection3] o.a.s.c.SolrConfig Using Lucene MatchVersion: 7.0.0
   [junit4]   2> 1389927 INFO  (TEST-TestLazyCores.testNoCommit-seed#[D821DE5AB1A8DB83]) [    x:collection3] o.a.s.s.IndexSchema [collection6] Schema name=tiny
   [junit4]   2> 1389938 INFO  (TEST-TestLazyCores.testNoCommit-seed#[D821DE5AB1A8DB83]) [    x:collection3] o.a.s.s.IndexSchema Loaded schema tiny/1.1 with uniqueid field id
   [junit4]   2> 1389950 INFO  (TEST-TestLazyCores.testNoCommit-seed#[D821DE5AB1A8DB83]) [    x:collection3] o.a.s.c.CoreContainer Creating SolrCore 'collection6' using configuration from instancedir C:\Users\jenkins\workspace\Lucene-Solr-master-Windows\solr\build\solr-core\test\J0\temp\solr.core.TestLazyCores_D821DE5AB1A8DB83-001\tempDir-001\collection6
   [junit4]   2> 1389951 INFO  (TEST-TestLazyCores.testNoCommit-seed#[D821DE5AB1A8DB83]) [    x:collection3] o.a.s.c.SolrCore [[collection6] ] Opening new SolrCore at [C:\Users\jenkins\workspace\Lucene-Solr-master-Windows\solr\build\solr-core\test\J0\temp\solr.core.TestLazyCores_D821DE5AB1A8DB83-001\tempDir-001\collection6], dataDir=[C:\Users\jenkins\workspace\Lucene-Solr-master-Windows\solr\build\solr-core\test\J0\temp\solr.core.TestLazyCores_D821DE5AB1A8DB83-001\tempDir-001\collection6\data\]
   [junit4]   2> 1389961 INFO  (TEST-TestLazyCores.testNoCommit-seed#[D821DE5AB1A8DB83]) [    x:collection3] o.a.s.u.RandomMergePolicy RandomMergePolicy wrapping class org.apache.lucene.index.TieredMergePolicy: [TieredMergePolicy: maxMergeAtOnce=46, maxMergeAtOnceExplicit=32, maxMergedSegmentMB=37.5185546875, floorSegmentMB=2.197265625, forceMergeDeletesPctAllowed=1.844574821870193, segmentsPerTier=38.0, maxCFSSegmentSizeMB=8.796093022207999E12, noCFSRatio=0.0
   [junit4]   2> 1390101 INFO  (TEST-TestLazyCores.testNoCommit-seed#[D821DE5AB1A8DB83]) [    x:collection3] o.a.s.u.CommitTracker Hard AutoCommit: disabled
   [junit4]   2> 1390101 INFO  (TEST-TestLazyCores.testNoCommit-seed#[D821DE5AB1A8DB83]) [    x:collection3] o.a.s.u.CommitTracker Soft AutoCommit: disabled
   [junit4]   2> 1390102 INFO  (TEST-TestLazyCores.testNoCommit-seed#[D821DE5AB1A8DB83]) [    x:collection3] o.a.s.u.RandomMergePolicy RandomMergePolicy wrapping class org.apache.lucene.index.TieredMergePolicy: [TieredMergePolicy: maxMergeAtOnce=25, maxMergeAtOnceExplicit=14, maxMergedSegmentMB=74.1259765625, floorSegmentMB=2.1240234375, forceMergeDeletesPctAllowed=4.434614403032025, segmentsPerTier=38.0, maxCFSSegmentSizeMB=8.796093022207999E12, noCFSRatio=0.0
   [junit4]   2> 1390103 INFO  (TEST-TestLazyCores.testNoCommit-seed#[D821DE5AB1A8DB83]) [    x:collection3] o.a.s.s.SolrIndexSearcher Opening [Searcher@9ff12a[collection6] main]
   [junit4]   2> 1390104 INFO  (TEST-TestLazyCores.testNoCommit-seed#[D821DE5AB1A8DB83]) [    x:collection3] o.a.s.r.ManagedResourceStorage File-based storage initialized to use dir: C:\Users\jenkins\workspace\Lucene-Solr-master-Windows\solr\build\solr-core\test\J0\temp\solr.core.TestLazyCores_D821DE5AB1A8DB83-001\tempDir-001\collection6\conf
   [junit4]   2> 1390104 INFO  (TEST-TestLazyCores.testNoCommit-seed#[D821DE5AB1A8DB83]) [    x:collection3] o.a.s.h.ReplicationHandler Commits will be reserved for  10000
   [junit4]   2> 1390104 INFO  (searcherExecutor-4572-thread-1-processing-x:collection3) [    x:collection3] o.a.s.c.SolrCore [collection6] Registered new searcher Searcher@9ff12a[collection6] main{ExitableDirectoryReader(UninvertingDirectoryReader())}
   [junit4]   2> 1390105 INFO  (TEST-TestLazyCores.testNoCommit-seed#[D821DE5AB1A8DB83]) [    x:collection3] o.a.s.c.SolrCores Opening transient core collection6
   [junit4]   2> 1390141 WARN  (TEST-TestLazyCores.testNoCommit-seed#[D821DE5AB1A8DB83]) [    x:collection3] o.a.s.c.Config Beginning with Solr 5.5, <mergePolicy> is deprecated, use <mergePolicyFactory> instead.
   [junit4]   2> 1390141 INFO  (TEST-TestLazyCores.testNoCommit-seed#[D821DE5AB1A8DB83]) [    x:collection3] o.a.s.c.SolrConfig Using Lucene MatchVersion: 7.0.0
   [junit4]   2> 1390160 INFO  (TEST-TestLazyCores.testNoCommit-seed#[D821DE5AB1A8DB83]) [    x:collection3] o.a.s.s.IndexSchema [collection7] Schema name=tiny
   [junit4]   2> 1390167 INFO  (TEST-TestLazyCores.testNoCommit-seed#[D821DE5AB1A8DB83]) [    x:collection3] o.a.s.s.IndexSchema Loaded schema tiny/1.1 with uniqueid field id
   [junit4]   2> 1390179 INFO  (TEST-TestLazyCores.testNoCommit-seed#[D821DE5AB1A8DB83]) [    x:collection3] o.a.s.c.CoreContainer Creating SolrCore 'collection7' using configuration from instancedir C:\Users\jenkins\workspace\Lucene-Solr-master-Windows\solr\build\solr-core\test\J0\temp\solr.core.TestLazyCores_D821DE5AB1A8DB83-001\tempDir-001\collection7
   [junit4]   2> 1390181 INFO  (TEST-TestLazyCores.testNoCommit-seed#[D821DE5AB1A8DB83]) [    x:collection3] o.a.s.c.SolrCore [[collection7] ] Opening new SolrCore at [C:\Users\jenkins\workspace\Lucene-Solr-master-Windows\solr\build\solr-core\test\J0\temp\solr.core.TestLazyCores_D821DE5AB1A8DB83-001\tempDir-001\collection7], dataDir=[C:\Users\jenkins\workspace\Lucene-Solr-master-Windows\solr\build\solr-core\test\J0\temp\solr.core.TestLazyCores_D821DE5AB1A8DB83-001\tempDir-001\collection7\data\]
   [junit4]   2> 1390189 INFO  (TEST-TestLazyCores.testNoCommit-seed#[D821DE5AB1A8DB83]) [    x:collection3] o.a.s.u.RandomMergePolicy RandomMergePolicy wrapping class org.apache.lucene.index.LogByteSizeMergePolicy: [LogByteSizeMergePolicy: minMergeSize=1677721, mergeFactor=43, maxMergeSize=2147483648, maxMergeSizeForForcedMerge=9223372036854775807, calibrateSizeByDeletes=true, maxMergeDocs=2147483647, maxCFSSegmentSizeMB=8.796093022207999E12, noCFSRatio=0.0]
   [junit4]   2> 1390362 INFO  (TEST-TestLazyCores.testNoCommit-seed#[D821DE5AB1A8DB83]) [    x:collection3] o.a.s.u.CommitTracker Hard AutoCommit: disabled
   [junit4]   2> 1390362 INFO  (TEST-TestLazyCores.testNoCommit-seed#[D821DE5AB1A8DB83]) [    x:collection3] o.a.s.u.CommitTracker Soft AutoCommit: disabled
   [junit4]   2> 1390362 INFO  (TEST-TestLazyCores.testNoCommit-seed#[D821DE5AB1A8DB83]) [    x:collection3] o.a.s.u.RandomMergePolicy RandomMergePolicy wrapping class org.apache.lucene.index.LogByteSizeMergePolicy: [LogByteSizeMergePolicy: minMergeSize=1677721, mergeFactor=40, maxMergeSize=2147483648, maxMergeSizeForForcedMerge=9223372036854775807, calibrateSizeByDeletes=true, maxMergeDocs=2147483647, maxCFSSegmentSizeMB=8.796093022207999E12, noCFSRatio=1.0]
   [junit4]   2> 1390363 INFO  (TEST-TestLazyCores.testNoCommit-seed#[D821DE5AB1A8DB83]) [    x:collection3] o.a.s.s.SolrIndexSearcher Opening [Searcher@17bec3c[collection7] main]
   [junit4]   2> 1390364 INFO  (TEST-TestLazyCores.testNoCommit-seed#[D821DE5AB1A8DB83]) [    x:collection3] o.a.s.r.ManagedResourceStorage File-based storage initialized to use dir: C:\Users\jenkins\workspace\Lucene-Solr-master-Windows\solr\build\solr-core\test\J0\temp\solr.core.TestLazyCores_D821DE5AB1A8DB83-001\tempDir-001\collection7\conf
   [junit4]   2> 1390365 INFO  (TEST-TestLazyCores.testNoCommit-seed#[D821DE5AB1A8DB83]) [    x:collection3] o.a.s.h.ReplicationHandler Commits will be reserved for  10000
   [junit4]   2> 1390365 INFO  (searcherExecutor-4576-thread-1-processing-x:collection3) [    x:collection3] o.a.s.c.SolrCore [collection7] Registered new searcher Searcher@17bec3c[collection7] main{ExitableDirectoryReader(UninvertingDirectoryReader())}
   [junit4]   2> 1390365 INFO  (TEST-TestLazyCores.testNoCommit-seed#[D821DE5AB1A8DB83]) [    x:collection3] o.a.s.c.SolrCores Opening transient core collection7
   [junit4]   2> 1390402 WARN  (TEST-TestLazyCores.testNoCommit-seed#[D821DE5AB1A8DB83]) [    x:collection3] o.a.s.c.Config Beginning with Solr 5.5, <mergePolicy> is deprecated, use <mergePolicyFactory> instead.
   [junit4]   2> 1390402 INFO  (TEST-TestLazyCores.testNoCommit-seed#[D821DE5AB1A8DB83]) [    x:collection3] o.a.s.c.SolrConfig Using Lucene MatchVersion: 7.0.0
   [junit4]   2> 1390411 INFO  (TEST-TestLazyCores.testNoCommit-seed#[D821DE5AB1A8DB83]) [    x:collection3] o.a.s.s.IndexSchema [collection8] Schema name=tiny
   [junit4]   2> 1390417 INFO  (TEST-TestLazyCores.testNoCommit-seed#[D821DE5AB1A8DB83]) [    x:collection3] o.a.s.s.IndexSchema Loaded schema tiny/1.1 with uniqueid field id
   [junit4]   2> 1390428 INFO  (TEST-TestLazyCores.testNoCommit-seed#[D821DE5AB1A8DB83]) [    x:collection3] o.a.s.c.CoreContainer Creating SolrCore 'collection8' using configuration from instancedir C:\Users\jenkins\workspace\Lucene-Solr-master-Windows\solr\build\solr-core\test\J0\temp\solr.core.TestLazyCores_D821DE5AB1A8DB83-001\tempDir-001\collection8
   [junit4]   2> 1390428 INFO  (TEST-TestLazyCores.testNoCommit-seed#[D821DE5AB1A8DB83]) [    x:collection3] o.a.s.c.SolrCore [[collection8] ] Opening new SolrCore at [C:\Users\jenkins\workspace\Lucene-Solr-master-Windows\solr\build\solr-core\test\J0\temp\solr.core.TestLazyCores_D821DE5AB1A8DB83-001\tempDir-001\collection8], dataDir=[C:\Users\jenkins\workspace\Lucene-Solr-master-Windows\solr\build\solr-core\test\J0\temp\solr.core.TestLazyCores_D821DE5AB1A8DB83-001\tempDir-001\collection8\data\]
   [junit4]   2> 1390438 INFO  (TEST-TestLazyCores.testNoCommit-seed#[D821DE5AB1A8DB83]) [    x:collection3] o.a.s.u.RandomMergePolicy RandomMergePolicy wrapping class org.apache.lucene.index.TieredMergePolicy: [TieredMergePolicy: maxMergeAtOnce=15, maxMergeAtOnceExplicit=47, maxMergedSegmentMB=31.9677734375, floorSegmentMB=1.3408203125, forceMergeDeletesPctAllowed=8.069377779160401, segmentsPerTier=21.0, maxCFSSegmentSizeMB=8.796093022207999E12, noCFSRatio=0.19492654609649113
   [junit4]   2> 1390582 INFO  (TEST-TestLazyCores.testNoCommit-seed#[D821DE5AB1A8DB83]) [    x:collection3] o.a.s.u.CommitTracker Hard AutoCommit: disabled
   [junit4]   2> 1390583 INFO  (TEST-TestLazyCores.testNoCommit-seed#[D821DE5AB1A8DB83]) [    x:collection3] o.a.s.u.CommitTracker Soft AutoCommit: disabled
   [junit4]   2> 1390583 INFO  (TEST-TestLazyCores.testNoCommit-seed#[D821DE5AB1A8DB83]) [    x:collection3] o.a.s.u.RandomMergePolicy RandomMergePolicy wrapping class org.apache.lucene.index.LogDocMergePolicy: [LogDocMergePolicy: minMergeSize=1000, mergeFactor=40, maxMergeSize=9223372036854775807, maxMergeSizeForForcedMerge=9223372036854775807, calibrateSizeByDeletes=false, maxMergeDocs=2147483647, maxCFSSegmentSizeMB=8.796093022207999E12, noCFSRatio=1.0]
   [junit4]   2> 1390584 INFO  (TEST-TestLazyCores.testNoCommit-seed#[D821DE5AB1A8DB83]) [    x:collection3] o.a.s.s.SolrIndexSearcher Opening [Searcher@20693b[collection8] main]
   [junit4]   2> 1390585 INFO  (TEST-TestLazyCores.testNoCommit-seed#[D821DE5AB1A8DB83]) [    x:collection3] o.a.s.r.ManagedResourceStorage File-based storage initialized to use dir: C:\Users\jenkins\workspace\Lucene-Solr-master-Windows\solr\build\solr-core\test\J0\temp\solr.core.TestLazyCores_D821DE5AB1A8DB83-001\tempDir-001\collection8\conf
   [junit4]   2> 1390585 INFO  (TEST-TestLazyCores.testNoCommit-seed#[D821DE5AB1A8DB83]) [    x:collection3] o.a.s.h.ReplicationHandler Commits will be reserved for  10000
   [junit4]   2> 1390585 INFO  (searcherExecutor-4580-thread-1-processing-x:collection3) [    x:collection3] o.a.s.c.SolrCore [collection8] Registered new searcher Searcher@20693b[collection8] main{ExitableDirectoryReader(UninvertingDirectoryReader())}
   [junit4]   2> 1390586 INFO  (TEST-TestLazyCores.testNoCommit-seed#[D821DE5AB1A8DB83]) [    x:collection3] o.a.s.c.SolrCores Opening transient core collection8
   [junit4]   2> 1390586 INFO  (TEST-TestLazyCores.testNoCommit-seed#[D821DE5AB1A8DB83]) [    x:collection3] o.a.s.c.SolrCores Closing transient core [collection2]
   [junit4]   2> 1390624 WARN  (TEST-TestLazyCores.testNoCommit-seed#[D821DE5AB1A8DB83]) [    x:collection3] o.a.s.c.Config Beginning with Solr 5.5, <mergePolicy> is deprecated, use <mergePolicyFactory> instead.
   [junit4]   2> 1390625 INFO  (TEST-TestLazyCores.testNoCommit-seed#[D821DE5AB1A8DB83]) [    x:collection3] o.a.s.c.SolrConfig Using Lucene MatchVersion: 7.0.0
   [junit4]   2> 1390632 INFO  (TEST-TestLazyCores.testNoCommit-seed#[D821DE5AB1A8DB83]) [    x:collection3] o.a.s.s.IndexSchema [collection9] Schema name=tiny
   [junit4]   2> 1390640 INFO  (TEST-TestLazyCores.testNoCommit-seed#[D821DE5AB1A8DB83]) [    x:collection3] o.a.s.s.IndexSchema Loaded schema tiny/1.1 with uniqueid field id
   [junit4]   2> 1390647 INFO  (TEST-TestLazyCores.testNoCommit-seed#[D821DE5AB1A8DB83]) [    x:collection3] o.a.s.c.CoreContainer Creating SolrCore 'collection9' using configuration from instancedir C:\Users\jenkins\workspace\Lucene-Solr-master-Windows\solr\build\solr-core\test\J0\temp\solr.core.TestLazyCores_D821DE5AB1A8DB83-001\tempDir-001\collection9
   [junit4]   2> 1390647 INFO  (TEST-TestLazyCores.testNoCommit-seed#[D821DE5AB1A8DB83]) [    x:collection3] o.a.s.c.SolrCore [[collection9] ] Opening new SolrCore at [C:\Users\jenkins\workspace\Lucene-Solr-master-Windows\solr\build\solr-core\test\J0\temp\solr.core.TestLazyCores_D821DE5AB1A8DB83-001\tempDir-001\collection9], dataDir=[C:\Users\jenkins\workspace\Lucene-Solr-master-Windows\solr\build\solr-core\test\J0\temp\solr.core.TestLazyCores_D821DE5AB1A8DB83-001\tempDir-001\collection9\data\]
   [junit4]   2> 1390659 INFO  (TEST-TestLazyCores.testNoCommit-seed#[D821DE5AB1A8DB83]) [    x:collection3] o.a.s.u.RandomMergePolicy RandomMergePolicy wrapping class org.apache.lucene.index.LogByteSizeMergePolicy: [LogByteSizeMergePolicy: minMergeSize=1677721, mergeFactor=13, maxMergeSize=2147483648, maxMergeSizeForForcedMerge=9223372036854775807, calibrateSizeByDeletes=false, maxMergeDocs=2147483647, maxCFSSegmentSizeMB=8.796093022207999E12, noCFSRatio=1.0]
   [junit4]   2> 1390811 INFO  (TEST-TestLazyCores.testNoCommit-seed#[D821DE5AB1A8DB83]) [    x:collection3] o.a.s.u.CommitTracker Hard AutoCommit: disabled
   [junit4]   2> 1390811 INFO  (TEST-TestLazyCores.testNoCommit-seed#[D821DE5AB1A8DB83]) [    x:collection3] o.a.s.u.CommitTracker Soft AutoCommit: disabled
   [junit4]   2> 1390812 INFO  (TEST-TestLazyCores.testNoCommit-seed#[D821DE5AB1A8DB83]) [    x:collection3] o.a.s.u.RandomMergePolicy RandomMergePolicy wrapping class org.apache.lucene.index.TieredMergePolicy: [TieredMergePolicy: maxMergeAtOnce=44, maxMergeAtOnceExplicit=28, maxMergedSegmentMB=89.703125, floorSegmentMB=1.4453125, forceMergeDeletesPctAllowed=27.42183028429069, segmentsPerTier=26.0, maxCFSSegmentSizeMB=8.796093022207999E12, noCFSRatio=0.3124040355786719
   [junit4]   2> 1390813 INFO  (TEST-TestLazyCores.testNoCommit-seed#[D821DE5AB1A8DB83]) [    x:collection3] o.a.s.s.SolrIndexSearcher Opening [Searcher@168ed9a[collection9] main]
   [junit4]   2> 1390815 INFO  (TEST-TestLazyCores.testNoCommit-seed#[D821DE5AB1A8DB83]) [    x:collection3] o.a.s.r.ManagedResourceStorage File-based storage initialized to use dir: C:\Users\jenkins\workspace\Lucene-Solr-master-Windows\solr\build\solr-core\test\J0\temp\solr.core.TestLazyCores_D821DE5AB1A8DB83-001\tempDir-001\collection9\conf
   [junit4]   2> 1390815 INFO  (TEST-TestLazyCores.testNoCommit-seed#[D821DE5AB1A8DB83]) [    x:collection3] o.a.s.h.ReplicationHandler Commits will be reserved for  10000
   [junit4]   2> 1390815 INFO  (searcherExecutor-4584-thread-1-processing-x:collection3) [    x:collection3] o.a.s.c.SolrCore [collection9] Registered new searcher Searcher@168ed9a[collection9] main{ExitableDirectoryReader(UninvertingDirectoryReader())}
   [junit4]   2> 1390816 INFO  (TEST-TestLazyCores.testNoCommit-seed#[D821DE5AB1A8DB83]) [    x:collection3] o.a.s.c.SolrCores Opening transient core collection9
   [junit4]   2> 1390816 INFO  (TEST-TestLazyCores.testNoCommit-seed#[D821DE5AB1A8DB83]) [    x:collection3] o.a.s.c.SolrCores Closing transient core [collection3]
   [junit4]   2> 1390821 INFO  (TEST-TestLazyCores.testNoCommit-seed#[D821DE5AB1A8DB83]) [    x:collection3] o.a.s.c.SolrCore [collection2]  CLOSING SolrCore org.apache.solr.core.SolrCore@1bbcb42
   [junit4]   2> 1390826 INFO  (TEST-TestLazyCores.testNoCommit-seed#[D821DE5AB1A8DB83]) [    x:collection3] o.a.s.m.SolrMetricManager Closing metric reporters for: solr.core.collection2
   [junit4]   2> 1390826 INFO  (TEST-TestLazyCores.testNoCommit-seed#[D821DE5AB1A8DB83]) [    x:collection3] o.a.s.c.SolrCore [collection3]  CLOSING SolrCore org.apache.solr.core.SolrCore@1d01952
   [junit4]   2> 1390829 INFO  (TEST-TestLazyCores.testNoCommit-seed#[D821DE5AB1A8DB83]) [    x:collection3] o.a.s.m.SolrMetricManager Closing metric reporters for: solr.core.collection3
   [junit4]   2> 1390867 WARN  (TEST-TestLazyCores.testNoCommit-seed#[D821DE5AB1A8DB83]) [    x:collection3] o.a.s.c.Config Beginning with Solr 5.5, <mergePolicy> is deprecated, use <mergePolicyFactory> instead.
   [junit4]   2> 1390867 INFO  (TEST-TestLazyCores.testNoCommit-seed#[D821DE5AB1A8DB83]) [    x:collection3] o.a.s.c.SolrConfig Using Lucene MatchVersion: 7.0.0
   [junit4]   2> 1390874 INFO  (TEST-TestLazyCores.testNoCommit-seed#[D821DE5AB1A8DB83]) [    x:collection3] o.a.s.s.IndexSchema [collection2] Schema name=tiny
   [junit4]   2> 1390882 INFO  (TEST-TestLazyCores.testNoCommit-seed#[D821DE5AB1A8DB83]) [    x:collection3] o.a.s.s.IndexSchema Loaded schema tiny/1.1 with uniqueid field id
   [junit4]   2> 1390891 INFO  (TEST-TestLazyCores.testNoCommit-seed#[D821DE5AB1A8DB83]) [    x:collection3] o.a.s.c.CoreContainer Creating SolrCore 'collection2' using configuration from instancedir C:\Users\jenkins\workspace\Lucene-Solr-master-Windows\solr\build\solr-core\test\J0\temp\solr.core.TestLazyCores_D821DE5AB1A8DB83-001\tempDir-001\collection2
   [junit4]   2> 1390893 INFO  (TEST-TestLazyCores.testNoCommit-seed#[D821DE5AB1A8DB83]) [    x:collection3] o.a.s.c.SolrCore [[collection2] ] Opening new SolrCore at [C:\Users\jenkins\workspace\Lucene-Solr-master-Windows\solr\build\solr-core\test\J0\temp\solr.core.TestLazyCores_D821DE5AB1A8DB83-001\tempDir-001\collection2], dataDir=[C:\Users\jenkins\workspace\Lucene-Solr-master-Windows\solr\build\solr-core\test\J0\temp\solr.core.TestLazyCores_D821DE5AB1A8DB83-001\tempDir-001\collection2\data\]
   [junit4]   2> 1391079 INFO  (TEST-TestLazyCores.testNoCommit-seed#[D821DE5AB1A8DB83]) [    x:collection3] o.a.s.u.CommitTracker Hard AutoCommit: disabled
   [junit4]   2> 1391079 INFO  (TEST-TestLazyCores.testNoCommit-seed#[D821DE5AB1A8DB83]) [    x:collection3] o.a.s.u.CommitTracker Soft AutoCommit: disabled
   [junit4]   2> 1391083 INFO  (TEST-TestLazyCores.testNoCommit-seed#[D821DE5AB1A8DB83]) [    x:collection3] o.a.s.u.RandomMergePolicy RandomMergePolicy wrapping class org.apache.lucene.index.TieredMergePolicy: [TieredMergePolicy: maxMergeAtOnce=27, maxMergeAtOnceExplicit=46, maxMergedSegmentMB=40.2939453125, floorSegmentMB=0.796875, forceMergeDeletesPctAllowed=22.49936194697313, segmentsPerTier=26.0, maxCFSSegmentSizeMB=8.796093022207999E12, noCFSRatio=1.0
   [junit4]   2> 1391085 INFO  (TEST-TestLazyCores.testNoCommit-seed#[D821DE5AB1A8DB83]) [    x:collection3] o.a.s.s.SolrIndexSearcher Opening [Searcher@1c5a0ce[collection2] main]
   [junit4]   2> 1391086 INFO  (TEST-TestLazyCores.testNoCommit-seed#[D821DE5AB1A8DB83]) [    x:collection3] o.a.s.r.ManagedResourceStorage File-based storage initialized to use dir: C:\Users\jenkins\workspace\Lucene-Solr-master-Windows\solr\build\solr-core\test\J0\temp\solr.core.TestLazyCores_D821DE5AB1A8DB83-001\tempDir-001\collection2\conf
   [junit4]   2> 1391086 INFO  (TEST-TestLazyCores.testNoCommit-seed#[D821DE5AB1A8DB83]) [    x:collection3] o.a.s.h.ReplicationHandler Commits will be reserved for  10000
   [junit4]   2> 1391087 INFO  (searcherExecutor-4588-thread-1-processing-x:collection3) [    x:collection3] o.a.s.c.SolrCore [collection2] Registered new searcher Searcher@1c5a0ce[collection2] main{ExitableDirectoryReader(UninvertingDirectoryReader())}
   [junit4]   2> 1391087 INFO  (TEST-TestLazyCores.testNoCommit-seed#[D821DE5AB1A8DB83]) [    x:collection3] o.a.s.c.SolrCores Opening transient core collection2
   [junit4]   2> 1391087 INFO  (TEST-TestLazyCores.testNoCommit-seed#[D821DE5AB1A8DB83]) [    x:collection3] o.a.s.c.SolrCores Closing transient core [collection6]
   [junit4]   2> 1391087 INFO  (Thread-2458) [    ] o.a.s.c.SolrCore [collection6]  CLOSING SolrCore org.apache.solr.core.SolrCore@19a5bae
   [junit4]   2> 1391088 INFO  (TEST-TestLazyCores.testNoCommit-seed#[D821DE5AB1A8DB83]) [    x:collection3] o.a.s.c.S.Request [collection2]  webapp=null path=null params={q=*:*} hits=0 status=0 QTime=0
   [junit4]   2> 1391094 INFO  (Thread-2458) [    ] o.a.s.m.SolrMetricManager Closing metric reporters for: solr.core.collection6
   [junit4]   2> 1391100 ERROR (TEST-TestLazyCores.testNoCommit-seed#[D821DE5AB1A8DB83]) [    x:collection3] o.a.s.SolrTestCaseJ4 REQUEST FAILED: xpath=//result[@numFound='10']
   [junit4]   2> 	xml response was: <?xml version="1.0" encoding="UTF-8"?>
   [junit4]   2> <response>
   [junit4]   2> 
   [junit4]   2> <lst name="responseHeader">
   [junit4]   2>   <int name="status">0</int>
   [junit4]   2>   <int name="QTime">0</int>
   [junit4]   2>   <lst name="params">
   [junit4]   2>     <str name="q">*:*</str>
   [junit4]   2>   </lst>
   [junit4]   2> </lst>
   [junit4]   2> <result name="response" numFound="0" start="0">
   [junit4]   2> </result>
   [junit4]   2> </response>
   [junit4]   2> 
   [junit4]   2> 	request was:q=*:*
   [junit4]   2> 1391101 ERROR (TEST-TestLazyCores.testNoCommit-seed#[D821DE5AB1A8DB83]) [    x:collection3] o.a.s.SolrTestCaseJ4 REQUEST FAILED: q=*:*:java.lang.RuntimeException: REQUEST FAILED: xpath=//result[@numFound='10']
   [junit4]   2> 	xml response was: <?xml version="1.0" encoding="UTF-8"?>
   [junit4]   2> <response>
   [junit4]   2> 
   [junit4]   2> <lst name="responseHeader">
   [junit4]   2>   <int name="status">0</int>
   [junit4]   2>   <int name="QTime">0</int>
   [junit4]   2>   <lst name="params">
   [junit4]   2>     <str name="q">*:*</str>
   [junit4]   2>   </lst>
   [junit4]   2> </lst>
   [junit4]   2> <result name="response" numFound="0" start="0">
   [junit4]   2> </result>
   [junit4]   2> </response>
   [junit4]   2> 
   [junit4]   2> 	request was:q=*:*
   [junit4]   2> 	at org.apache.solr.SolrTestCaseJ4.assertQ(SolrTestCaseJ4.java:850)
   [junit4]   2> 	at org.apache.solr.core.TestLazyCores.check10(TestLazyCores.java:794)
   [junit4]   2> 	at org.apache.solr.core.TestLazyCores.testNoCommit(TestLazyCores.java:776)
   [junit4]   2> 	at sun.reflect.NativeMethodAccessorImpl.invoke0(Native Method)
   [junit4]   2> 	at sun.reflect.NativeMethodAccessorImpl.invoke(NativeMethodAccessorImpl.java:62)
   [junit4]   2> 	at sun.reflect.DelegatingMethodAccessorImpl.invoke(DelegatingMethodAccessorImpl.java:43)
   [junit4]   2> 	at java.lang.reflect.Method.invoke(Method.java:498)
   [junit4]   2> 	at com.carrotsearch.randomizedtesting.RandomizedRunner.invoke(RandomizedRunner.java:1713)
   [junit4]   2> 	at com.carrotsearch.randomizedtesting.RandomizedRunner$8.evaluate(RandomizedRunner.java:907)
   [junit4]   2> 	at com.carrotsearch.randomizedtesting.RandomizedRunner$9.evaluate(RandomizedRunner.java:943)
   [junit4]   2> 	at com.carrotsearch.randomizedtesting.RandomizedRunner$10.evaluate(RandomizedRunner.java:957)
   [junit4]   2> 	at com.carrotsearch.randomizedtesting.rules.SystemPropertiesRestoreRule$1.evaluate(SystemPropertiesRestoreRule.java:57)
   [junit4]   2> 	at org.apache.lucene.util.TestRuleSetupTeardownChained$1.evaluate(TestRuleSetupTeardownChained.java:49)
   [junit4]   2> 	at org.apache.lucene.util.AbstractBeforeAfterRule$1.evaluate(AbstractBeforeAfterRule.java:45)
   [junit4]   2> 	at org.apache.lucene.util.TestRuleThreadAndTestName$1.evaluate(TestRuleThreadAndTestName.java:48)
   [junit4]   2> 	at org.apache.lucene.util.TestRuleIgnoreAfterMaxFailures$1.evaluate(TestRuleIgnoreAfterMaxFailures.java:64)
   [junit4]   2> 	at org.apache.lucene.util.TestRuleMarkFailure$1.evaluate(TestRuleMarkFailure.java:47)
   [junit4]   2> 	at com.carrotsearch.randomizedtesting.rules.StatementAdapter.evaluate(StatementAdapter.java:36)
   [junit4]   2> 	at com.carrotsearch.randomizedtesting.ThreadLeakControl$StatementRunner.run(ThreadLeakControl.java:368)
   [junit4]   2> 	at com.carrotsearch.randomizedtesting.ThreadLeakControl.forkTimeoutingTask(ThreadLeakControl.java:817)
   [junit4]   2> 	at com.carrotsearch.randomizedtesting.ThreadLeakControl$3.evaluate(ThreadLeakControl.java:468)
   [junit4]   2> 	at com.carrotsearch.randomizedtesting.RandomizedRunner.runSingleTest(RandomizedRunner.java:916)
   [junit4]   2> 	at com.carrotsearch.randomizedtesting.RandomizedRunner$5.evaluate(RandomizedRunner.java:802)
   [junit4]   2> 	at com.carrotsearch.randomizedtesting.RandomizedRunner$6.evaluate(RandomizedRunner.java:852)
   [junit4]   2> 	at com.carrotsearch.randomizedtesting.RandomizedRunner$7.evaluate(RandomizedRunner.java:863)
   [junit4]   2> 	at com.carrotsearch.randomizedtesting.rules.StatementAdapter.evaluate(StatementAdapter.java:36)
   [junit4]   2> 	at com.carrotsearch.randomizedtesting.rules.SystemPropertiesRestoreRule$1.evaluate(SystemPropertiesRestoreRule.java:57)
   [junit4]   2> 	at org.apache.lucene.util.AbstractBeforeAfterRule$1.evaluate(AbstractBeforeAfterRule.java:45)
   [junit4]   2> 	at com.carrotsearch.randomizedtesting.rules.StatementAdapter.evaluate(StatementAdapter.java:36)
   [junit4]   2> 	at org.apache.lucene.util.TestRuleStoreClassName$1.evaluate(TestRuleStoreClassName.java:41)
   [junit4]   2> 	at com.carrotsearch.randomizedtesting.rules.NoShadowingOrOverridesOnMethodsRule$1.evaluate(NoShadowingOrOverridesOnMethodsRule.java:40)
   [junit4]   2> 	at com.carrotsearch.randomizedtesting.rules.NoShadowingOrOverridesOnMethodsRule$1.evaluate(NoShadowingOrOverridesOnMethodsRule.java:40)
   [junit4]   2> 	at com.carrotsearch.randomizedtesting.rules.StatementAdapter.evaluate(StatementAdapter.java:36)
   [junit4]   2> 	at com.carrotsearch.randomizedtesting.rules.StatementAdapter.evaluate(StatementAdapter.java:36)
   [junit4]   2> 	at com.carrotsearch.randomizedtesting.rules.StatementAdapter.evaluate(StatementAdapter.java:36)
   [junit4]   2> 	at org.apache.lucene.util.TestRuleAssertionsRequired$1.evaluate(TestRuleAssertionsRequired.java:53)
   [junit4]   2> 	at org.apache.lucene.util.TestRuleMarkFailure$1.evaluate(TestRuleMarkFailure.java:47)
   [junit4]   2> 	at org.apache.lucene.util.TestRuleIgnoreAfterMaxFailures$1.evaluate(TestRuleIgnoreAfterMaxFailures.java:64)
   [junit4]   2> 	at org.apache.lucene.util.TestRuleIgnoreTestSuites$1.evaluate(TestRuleIgnoreTestSuites.java:54)
   [junit4]   2> 	at com.carrotsearch.randomizedtesting.rules.StatementAdapter.evaluate(StatementAdapter.java:36)
   [junit4]   2> 	at com.carrotsearch.randomizedtesting.ThreadLeakControl$StatementRunner.run(ThreadLeakControl.java:368)
   [junit4]   2> 	at java.lang.Thread.run(Thread.java:745)
   [junit4]   2> 
   [junit4]   2> 1391101 INFO  (TEST-TestLazyCores.testNoCommit-seed#[D821DE5AB1A8DB83]) [    x:collection3] o.a.s.c.CoreContainer Shutting down CoreContainer instance=30349090
   [junit4]   2> 1391102 INFO  (coreCloseExecutor-4592-thread-2-processing-x:collection3) [    x:collection5] o.a.s.c.SolrCore [collection5]  CLOSING SolrCore org.apache.solr.core.SolrCore@f49634
   [junit4]   2> 1391102 INFO  (coreCloseExecutor-4592-thread-1-processing-x:collection3) [    x:collection1] o.a.s.c.SolrCore [collection1]  CLOSING SolrCore org.apache.solr.core.SolrCore@5c92d3
   [junit4]   2> 1391105 INFO  (coreCloseExecutor-4592-thread-2-processing-x:collection3) [    x:collection5] o.a.s.m.SolrMetricManager Closing metric reporters for: solr.core.collection5
   [junit4]   2> 1391105 INFO  (coreCloseExecutor-4592-thread-3-processing-x:collection3) [    x:collection7] o.a.s.c.SolrCore [collection7]  CLOSING SolrCore org.apache.solr.core.SolrCore@acc56e
   [junit4]   2> 1391107 INFO  (coreCloseExecutor-4592-thread-4-processing-x:collection3) [    x:collection8] o.a.s.c.SolrCore [collection8]  CLOSING SolrCore org.apache.solr.core.SolrCore@14035ff
   [junit4]   2> 1391108 INFO  (coreCloseExecutor-4592-thread-5-processing-x:collection3) [    x:collection9] o.a.s.c.SolrCore [collection9]  CLOSING SolrCore org.apache.solr.core.SolrCore@1065ef4
   [junit4]   2> 1391109 INFO  (coreCloseExecutor-4592-thread-1-processing-x:collection3) [    x:collection1] o.a.s.m.SolrMetricManager Closing metric reporters for: solr.core.collection1
   [junit4]   2> 1391111 INFO  (coreCloseExecutor-4592-thread-3-processing-x:collection3) [    x:collection7] o.a.s.m.SolrMetricManager Closing metric reporters for: solr.core.collection7
   [junit4]   2> 1391113 INFO  (coreCloseExecutor-4592-thread-4-processing-x:collection3) [    x:collection8] o.a.s.m.SolrMetricManager Closing metric reporters for: solr.core.collection8
   [junit4]   2> 1391114 INFO  (coreCloseExecutor-4592-thread-5-processing-x:collection3) [    x:collection9] o.a.s.m.SolrMetricManager Closing metric reporters for: solr.core.collection9
   [junit4]   2> 1391115 INFO  (TEST-TestLazyCores.testNoCommit-seed#[D821DE5AB1A8DB83]) [    x:collection3] o.a.s.m.SolrMetricManager Closing metric reporters for: solr.node
   [junit4]   2> 1391115 INFO  (TEST-TestLazyCores.testNoCommit-seed#[D821DE5AB1A8DB83]) [    x:collection3] o.a.s.SolrTestCaseJ4 ###Ending testNoCommit
   [junit4]   2> NOTE: reproduce with: ant test  -Dtestcase=TestLazyCores -Dtests.method=testNoCommit -Dtests.seed=D821DE5AB1A8DB83 -Dtests.slow=true -Dtests.locale=sr-Latn-RS -Dtests.timezone=America/Ensenada -Dtests.asserts=true -Dtests.file.encoding=UTF-8
   [junit4] ERROR   2.02s J0 | TestLazyCores.testNoCommit <<<
   [junit4]    > Throwable #1: java.lang.RuntimeException: Exception during query
   [junit4]    > 	at __randomizedtesting.SeedInfo.seed([D821DE5AB1A8DB83:7417F8B7A8FB826]:0)
   [junit4]    > 	at org.apache.solr.SolrTestCaseJ4.assertQ(SolrTestCaseJ4.java:857)
   [junit4]    > 	at org.apache.solr.core.TestLazyCores.check10(TestLazyCores.java:794)
   [junit4]    > 	at org.apache.solr.core.TestLazyCores.testNoCommit(TestLazyCores.java:776)
   [junit4]    > 	at java.lang.Thread.run(Thread.java:745)
   [junit4]    > Caused by: java.lang.RuntimeException: REQUEST FAILED: xpath=//result[@numFound='10']
   [junit4]    > 	xml response was: <?xml version="1.0" encoding="UTF-8"?>
   [junit4]    > <response>
   [junit4]    > <lst name="responseHeader">
   [junit4]    >   <int name="status">0</int>
   [junit4]    >   <int name="QTime">0</int>
   [junit4]    >   <lst name="params">
   [junit4]    >     <str name="q">*:*</str>
   [junit4]    >   </lst>
   [junit4]    > </lst>
   [junit4]    > <result name="response" numFound="0" start="0">
   [junit4]    > </result>
   [junit4]    > </response>
   [junit4]    > 	request was:q=*:*
   [junit4]    > 	at org.apache.solr.SolrTestCaseJ4.assertQ(SolrTestCaseJ4.java:850)
   [junit4]    > 	... 41 more
   [junit4]   2> 1391121 INFO  (TEST-TestLazyCores.testCreateSame-seed#[D821DE5AB1A8DB83]) [    x:collection3] o.a.s.SolrTestCaseJ4 ###Starting testCreateSame
   [junit4]   2> 1391207 INFO  (TEST-TestLazyCores.testCreateSame-seed#[D821DE5AB1A8DB83]) [    x:collection3] o.a.s.c.SolrCores Allocating transient cache for 4 transient cores
   [junit4]   2> 1391391 WARN  (coreLoadExecutor-4599-thread-2-processing-x:collection3) [    x:collection2] o.a.s.c.Config Beginning with Solr 5.5, <mergePolicy> is deprecated, use <mergePolicyFactory> instead.
   [junit4]   2> 1391391 WARN  (coreLoadExecutor-4599-thread-3-processing-x:collection3) [    x:collection5] o.a.s.c.Config Beginning with Solr 5.5, <mergePolicy> is deprecated, use <mergePolicyFactory> instead.
   [junit4]   2> 1391392 WARN  (coreLoadExecutor-4599-thread-1-processing-x:collection3) [    x:collection1] o.a.s.c.Config Beginning with Solr 5.5, <mergePolicy> is deprecated, use <mergePolicyFactory> instead.
   [junit4]   2> 1391392 INFO  (coreLoadExecutor-4599-thread-2-processing-x:collection3) [    x:collection2] o.a.s.c.SolrConfig Using Lucene MatchVersion: 7.0.0
   [junit4]   2> 1391392 INFO  (coreLoadExecutor-4599-thread-3-processing-x:collection3) [    x:collection5] o.a.s.c.SolrConfig Using Lucene MatchVersion: 7.0.0
   [junit4]   2> 1391392 INFO  (coreLoadExecutor-4599-thread-1-processing-x:collection3) [    x:collection1] o.a.s.c.SolrConfig Using Lucene MatchVersion: 7.0.0
   [junit4]   2> 1391400 INFO  (coreLoadExecutor-4599-thread-1-processing-x:collection3) [    x:collection1] o.a.s.s.IndexSchema [collection1] Schema name=tiny
   [junit4]   2> 1391400 INFO  (coreLoadExecutor-4599-thread-2-processing-x:collection3) [    x:collection2] o.a.s.s.IndexSchema [collection2] Schema name=tiny
   [junit4]   2> 1391401 INFO  (coreLoadExecutor-4599-thread-3-processing-x:collection3) [    x:collection5] o.a.s.s.IndexSchema [collection5] Schema name=tiny
   [junit4]   2> 1391411 INFO  (coreLoadExecutor-4599-thread-2-processing-x:collection3) [    x:collection2] o.a.s.s.IndexSchema Loaded schema tiny/1.1 with uniqueid field id
   [junit4]   2> 1391411 INFO  (coreLoadExecutor-4599-thread-1-processing-x:collection3) [    x:collection1] o.a.s.s.IndexSchema Loaded schema tiny/1.1 with uniqueid field id
   [junit4]   2> 1391412 INFO  (coreLoadExecutor-4599-thread-3-processing-x:collection3) [    x:collection5] o.a.s.s.IndexSchema Loaded schema tiny/1.1 with uniqueid field id
   [junit4]   2> 1391428 INFO  (coreLoadExecutor-4599-thread-1-processing-x:collection3) [    x:collection1] o.a.s.c.CoreContainer Creating SolrCore 'collection1' using configuration from instancedir C:\Users\jenkins\workspace\Lucene-Solr-master-Windows\solr\build\solr-core\test\J0\temp\solr.core.TestLazyCores_D821DE5AB1A8DB83-001\tempDir-002\collection1
   [junit4]   2> 1391428 INFO  (coreLoadExecutor-4599-thread-2-processing-x:collection3) [    x:collection2] o.a.s.c.CoreContainer Creating SolrCore 'collection2' using configuration from instancedir C:\Users\jenkins\workspace\Lucene-Solr-master-Windows\solr\build\solr-core\test\J0\temp\solr.core.TestLazyCores_D821DE5AB1A8DB83-001\tempDir-002\collection2
   [junit4]   2> 1391428 INFO  (coreLoadExecutor-4599-thread-3-processing-x:collection3) [    x:collection5] o.a.s.c.CoreContainer Creating SolrCore 'collection5' using configuration from instancedir C:\Users\jenkins\workspace\Lucene-Solr-master-Windows\solr\build\solr-core\test\J0\temp\solr.core.TestLazyCores_D821DE5AB1A8DB83-001\tempDir-002\collection5
   [junit4]   2> 1391429 INFO  (coreLoadExecutor-4599-thread-2-processing-x:collection3) [    x:collection2] o.a.s.c.SolrCore [[collection2] ] Opening new SolrCore at [C:\Users\jenkins\workspace\Lucene-Solr-master-Windows\solr\build\solr-core\test\J0\temp\solr.core.TestLazyCores_D821DE5AB1A8DB83-001\tempDir-002\collection2], dataDir=[C:\Users\jenkins\workspace\Lucene-Solr-master-Windows\solr\build\solr-core\test\J0\temp\solr.core.TestLazyCores_D821DE5AB1A8DB83-001\tempDir-002\collection2\data\]
   [junit4]   2> 1391429 INFO  (coreLoadExecutor-4599-thread-3-processing-x:collection3) [    x:collection5] o.a.s.c.SolrCore [[collection5] ] Opening new SolrCore at [C:\Users\jenkins\workspace\Lucene-Solr-master-Windows\solr\build\solr-core\test\J0\temp\solr.core.TestLazyCores_D821DE5AB1A8DB83-001\tempDir-002\collection5], dataDir=[C:\Users\jenkins\workspace\Lucene-Solr-master-Windows\solr\build\solr-core\test\J0\temp\solr.core.TestLazyCores_D821DE5AB1A8DB83-001\tempDir-002\collection5\data\]
   [junit4]   2> 1391429 INFO  (coreLoadExecutor-4599-thread-1-processing-x:collection3) [    x:collection1] o.a.s.c.SolrCore [[collection1] ] Opening new SolrCore at [C:\Users\jenkins\workspace\Lucene-Solr-master-Windows\solr\build\solr-core\test\J0\temp\solr.core.TestLazyCores_D821DE5AB1A8DB83-001\tempDir-002\collection1], dataDir=[C:\Users\jenkins\workspace\Lucene-Solr-master-Windows\solr\build\solr-core\test\J0\temp\solr.core.TestLazyCores_D821DE5AB1A8DB83-001\tempDir-002\collection1\data\]
   [junit4]   2> 1391436 INFO  (coreLoadExecutor-4599-thread-3-processing-x:collection3) [    x:collection5] o.a.s.u.RandomMergePolicy RandomMergePolicy wrapping class org.apache.lucene.index.TieredMergePolicy: [TieredMergePolicy: maxMergeAtOnce=6, maxMergeAtOnceExplicit=5, maxMergedSegmentMB=71.3193359375, floorSegmentMB=1.8857421875, forceMergeDeletesPctAllowed=19.06230029912371, segmentsPerTier=29.0, maxCFSSegmentSizeMB=8.796093022207999E12, noCFSRatio=0.7420682934276116
   [junit4]   2> 1391436 INFO  (coreLoadExecutor-4599-thread-2-processing-x:collection3) [    x:collection2] o.a.s.u.RandomMergePolicy RandomMergePolicy wrapping class org.apache.lucene.index.TieredMergePolicy: [TieredMergePolicy: maxMergeAtOnce=6, maxMergeAtOnceExplicit=5, maxMergedSegmentMB=71.3193359375, floorSegmentMB=1.8857421875, forceMergeDeletesPctAllowed=19.06230029912371, segmentsPerTier=29.0, maxCFSSegmentSizeMB=8.796093022207999E12, noCFSRatio=0.7420682934276116
   [junit4]   2> 1391437 INFO  (coreLoadExecutor-4599-thread-1-processing-x:collection3) [    x:collection1] o.a.s.u.RandomMergePolicy RandomMergePolicy wrapping class org.apache.lucene.index.TieredMergePolicy: [TieredMergePolicy: maxMergeAtOnce=6, maxMergeAtOnceExplicit=5, maxMergedSegmentMB=71.3193359375, floorSegmentMB=1.8857421875, forceMergeDeletesPctAllowed=19.06230029912371, segmentsPerTier=29.0, maxCFSSegmentSizeMB=8.796093022207999E12, noCFSRatio=0.7420682934276116
   [junit4]   2> 1391641 INFO  (coreLoadExecutor-4599-thread-2-processing-x:collection3) [    x:collection2] o.a.s.u.CommitTracker Hard AutoCommit: disabled
   [junit4]   2> 1391642 INFO  (coreLoadExecutor-4599-thread-2-processing-x:collection3) [    x:collection2] o.a.s.u.CommitTracker Soft AutoCommit: disabled
   [junit4]   2> 1391642 INFO  (coreLoadExecutor-4599-thread-2-processing-x:collection3) [    x:collection2] o.a.s.u.RandomMergePolicy RandomMergePolicy wrapping class org.apache.lucene.index.TieredMergePolicy: [TieredMergePolicy: maxMergeAtOnce=45, maxMergeAtOnceExplicit=13, maxMergedSegmentMB=39.5986328125, floorSegmentMB=1.2421875, forceMergeDeletesPctAllowed=6.569934249772057, segmentsPerTier=19.0, maxCFSSegmentSizeMB=8.796093022207999E12, noCFSRatio=0.0
   [junit4]   2> 1391643 INFO  (coreLoadExecutor-4599-thread-2-processing-x:collection3) [    x:collection2] o.a.s.s.SolrIndexSearcher Opening [Searcher@10625d7[collection2] main]
   [junit4]   2> 1391645 INFO  (coreLoadExecutor-4599-thread-2-processing-x:collection3) [    x:collection2] o.a.s.r.ManagedResourceStorage File-based storage initialized to use dir: C:\Users\jenkins\workspace\Lucene-Solr-master-Windows\solr\build\solr-core\test\J0\temp\solr.core.TestLazyCores_D821DE5AB1A8DB83-001\tempDir-002\collection2\conf
   [junit4]   2> 1391645 INFO  (coreLoadExecutor-4599-thread-2-processing-x:collection3) [    x:collection2] o.a.s.h.ReplicationHandler Commits will be reserved for  10000
   [junit4]   2> 1391646 INFO  (coreLoadExecutor-4599-thread-2-processing-x:collection3) [    x:collection2] o.a.s.c.SolrCores Opening transient core collection2
   [junit4]   2> 1391653 INFO  (coreLoadExecutor-4599-thread-1-processing-x:collection3) [    x:collection1] o.a.s.u.CommitTracker Hard AutoCommit: disabled
   [junit4]   2> 1391653 INFO  (coreLoadExecutor-4599-thread-1-processing-x:collection3) [    x:collection1] o.a.s.u.CommitTracker Soft AutoCommit: disabled
   [junit4]   2> 1391654 INFO  (coreLoadExecutor-4599-thread-1-processing-x:collection3) [    x:collection1] o.a.s.u.RandomMergePolicy RandomMergePolicy wrapping class org.apache.lucene.index.TieredMergePolicy: [TieredMergePolicy: maxMergeAtOnce=45, maxMergeAtOnceExplicit=13, maxMergedSegmentMB=39.5986328125, floorSegmentMB=1.2421875, forceMergeDeletesPctAllowed=6.569934249772057, segmentsPerTier=19.0, maxCFSSegmentSizeMB=8.796093022207999E12, noCFSRatio=0.0
   [junit4]   2> 1391654 INFO  (coreLoadExecutor-4599-thread-1-processing-x:collection3) [    x:collection1] o.a.s.s.SolrIndexSearcher Opening [Searcher@a16cfa[collection1] main]
   [junit4]   2> 1391655 INFO  (coreLoadExecutor-4599-thread-1-processing-x:collection3) [    x:collection1] o.a.s.r.ManagedResourceStorage File-based storage initialized to use dir: C:\Users\jenkins\workspace\Lucene-Solr-master-Windows\solr\build\solr-core\test\J0\temp\solr.core.TestLazyCores_D821DE5AB1A8DB83-001\tempDir-002\collection1\conf
   [junit4]   2> 1391656 INFO  (coreLoadExecutor-4599-thread-1-processing-x:collection3) [    x:collection1] o.a.s.h.ReplicationHandler Commits will be reserved for  10000
   [junit4]   2> 1391657 INFO  (searcherExecutor-4601-thread-1-processing-x:collection2) [    x:collection2] o.a.s.c.SolrCore [collection2] Registered new searcher Searcher@10625d7[collection2] main{ExitableDirectoryReader(UninvertingDirectoryReader())}
   [junit4]   2> 1391657 INFO  (searcherExecutor-4600-thread-1-processing-x:collection1) [    x:collection1] o.a.s.c.SolrCore [collection1] Registered new searcher Searcher@a16cfa[collection1] main{ExitableDirectoryReader(UninvertingDirectoryReader())}
   [junit4]   2> 1391669 INFO  (coreLoadExecutor-4599-thread-3-processing-x:collection3) [    x:collection5] o.a.s.u.CommitTracker Hard AutoCommit: disabled
   [junit4]   2> 1391669 INFO  (coreLoadExecutor-4599-thread-3-processing-x:collection3) [    x:collection5] o.a.s.u.CommitTracker Soft AutoCommit: disabled
   [junit4]   2> 1391669 INFO  (coreLoadExecutor-4599-thread-3-processing-x:collection3) [    x:collection5] o.a.s.u.RandomMergePolicy RandomMergePolicy wrapping class org.apache.lucene.index.TieredMergePolicy: [TieredMergePolicy: maxMergeAtOnce=45, maxMergeAtOnceExplicit=13, maxMergedSegmentMB=39.5986328125, floorSegmentMB=1.2421875, forceMergeDeletesPctAllowed=6.569934249772057, segmentsPerTier=19.0, maxCFSSegmentSizeMB=8.796093022207999E12, noCFSRatio=0.0
   [junit4]   2> 1391670 INFO  (coreLoadExecutor-4599-thread-3-processing-x:collection3) [    x:collection5] o.a.s.s.SolrIndexSearcher Opening [Searcher@107361a[collection5] main]
   [junit4]   2> 1391671 INFO  (coreLoadExecutor-4599-thread-3-processing-x:collection3) [    x:collection5] o.a.s.r.ManagedResourceStorage File-based storage initialized to use dir: C:\Users\jenkins\workspace\Lucene-Solr-master-Windows\solr\build\solr-core\test\J0\temp\solr.core.TestLazyCores_D821DE5AB1A8DB83-001\tempDir-002\collection5\conf
   [junit4]   2> 1391672 INFO  (coreLoadExecutor-4599-thread-3-processing-x:collection3) [    x:collection5] o.a.s.h.ReplicationHandler Commits will be reserved for  10000
   [junit4]   2> 1391672 INFO  (searcherExecutor-4602-thread-1-processing-x:collection5) [    x:collection5] o.a.s.c.SolrCore [collection5] Registered new searcher Searcher@107361a[collection5] main{ExitableDirectoryReader(UninvertingDirectoryReader())}
   [junit4]   2> 1391718 WARN  (TEST-TestLazyCores.testCreateSame-seed#[D821DE5AB1A8DB83]) [    x:collection3] o.a.s.c.Config Beginning with Solr 5.5, <mergePolicy> is deprecated, use <mergePolicyFactory> instead.
   [junit4]   2> 1391718 INFO  (TEST-TestLazyCores.testCreateSame-seed#[D821DE5AB1A8DB83]) [    x:collection3] o.a.s.c.SolrConfig Using Lucene MatchVersion: 7.0.0
   [junit4]   2> 1391726 INFO  (TEST-TestLazyCores.testCreateSame-seed#[D821DE5AB1A8DB83]) [    x:collection3] o.a.s.s.IndexSchema [collection4] Schema name=tiny
   [junit4]   2> 1391734 INFO  (TEST-TestLazyCores.testCreateSame-seed#[D821DE5AB1A8DB83]) [    x:collection3] o.a.s.s.IndexSchema Loaded schema tiny/1.1 with uniqueid field id
   [junit4]   2> 1391744 INFO  (TEST-TestLazyCores.testCreateSame-seed#[D821DE5AB1A8DB83]) [    x:collection3] o.a.s.c.CoreContainer Creating SolrCore 'collection4' using configuration from instancedir C:\Users\jenkins\workspace\Lucene-Solr-master-Windows\solr\build\solr-core\test\J0\temp\solr.core.TestLazyCores_D821DE5AB1A8DB83-001\tempDir-002\collection4
   [junit4]   2> 1391745 INFO  (TEST-TestLazyCores.testCreateSame-seed#[D821DE5AB1A8DB83]) [    x:collection3] o.a.s.c.SolrCore [[collection4] ] Opening new SolrCore at [C:\Users\jenkins\workspace\Lucene-Solr-master-Windows\solr\build\solr-core\test\J0\temp\solr.core.TestLazyCores_D821DE5AB1A8DB83-001\tempDir-002\collection4], dataDir=[C:\Users\jenkins\workspace\Lucene-Solr-master-Windows\solr\build\solr-core\test\J0\temp\solr.core.TestLazyCores_D821DE5AB1A8DB83-001\tempDir-002\collection4\data\]
   [junit4]   2> 1391754 INFO  (TEST-TestLazyCores.testCreateSame-seed#[D821DE5AB1A8DB83]) [    x:collection3] o.a.s.u.RandomMergePolicy RandomMergePolicy wrapping class org.apache.lucene.index.TieredMergePolicy: [TieredMergePolicy: maxMergeAtOnce=13, maxMergeAtOnceExplicit=32, maxMergedSegmentMB=14.9462890625, floorSegmentMB=0.4736328125, forceMergeDeletesPctAllowed=17.6685871476039, segmentsPerTier=16.0, maxCFSSegmentSizeMB=8.796093022207999E12, noCFSRatio=0.2572560251961372
   [junit4]   2> 1391902 INFO  (TEST-TestLazyCores.testCreateSame-seed#[D821DE5AB1A8DB83]) [    x:collection3] o.a.s.u.CommitTracker Hard AutoCommit: disabled
   [junit4]   2> 1391902 INFO  (TEST-TestLazyCores.testCreateSame-seed#[D821DE5AB1A8DB83]) [    x:collection3] o.a.s.u.CommitTracker Soft AutoCommit: disabled
   [junit4]   2> 1391903 INFO  (TEST-TestLazyCores.testCreateSame-seed#[D821DE5AB1A8DB83]) [    x:collection3] o.a.s.u.RandomMergePolicy RandomMergePolicy wrapping class org.apache.lucene.index.TieredMergePolicy: [TieredMergePolicy: maxMergeAtOnce=40, maxMergeAtOnceExplicit=18, maxMergedSegmentMB=14.7919921875, floorSegmentMB=2.19140625, forceMergeDeletesPctAllowed=11.195053651678137, segmentsPerTier=44.0, maxCFSSegmentSizeMB=8.796093022207999E12, noCFSRatio=0.219486957083263
   [junit4]   2> 1391904 INFO  (TEST-TestLazyCores.testCreateSame-seed#[D821DE5AB1A8DB83]) [    x:collection3] o.a.s.s.SolrIndexSearcher Opening [Searcher@30d2e6[collection4] main]
   [junit4]   2> 1391905 INFO  (TEST-TestLazyCores.testCreateSame-seed#[D821DE5AB1A8DB83]) [    x:collection3] o.a.s.r.ManagedResourceStorage File-based storage initialized to use dir: C:\Users\jenkins\workspace\Lucene-Solr-master-Windows\solr\build\solr-core\test\J0\temp\solr.core.TestLazyCores_D821DE5AB1A8DB83-001\tempDir-002\collection4\conf
   [junit4]   2> 1391906 INFO  (TEST-TestLazyCores.testCreateSame-seed#[D821DE5AB1A8DB83]) [    x:collection3] o.a.s.h.ReplicationHandler Commits will be reserved for  10000
   [junit4]   2> 1391906 INFO  (searcherExecutor-4613-thread-1-processing-x:collection3) [    x:collection3] o.a.s.c.SolrCore [collection4] Registered new searcher Searcher@30d2e6[collection4] main{ExitableDirectoryReader(UninvertingDirectoryReader())}
   [junit4]   2> 1391947 WARN  (TEST-TestLazyCores.testCreateSame-seed#[D821DE5AB1A8DB83]) [    x:collection3] o.a.s.c.Config Beginning with Solr 5.5, <mergePolicy> is deprecated, use <mergePolicyFactory> instead.
   [junit4]   2> 1391947 INFO  (TEST-TestLazyCores.testCreateSame-seed#[D821DE5AB1A8DB83]) [    x:collection3] o.a.s.c.SolrConfig Using Lucene MatchVersion: 7.0.0
   [junit4]   2> 1391955 INFO  (TEST-TestLazyCores.testCreateSame-seed#[D821DE5AB1A8DB83]) [    x:collection3] o.a.s.s.IndexSchema [collection6] Schema name=tiny
   [junit4]   2> 1391964 INFO  (TEST-TestLazyCores.testCreateSame-seed#[D821DE5AB1A8DB83]) [    x:collection3] o.a.s.s.IndexSchema Loaded schema tiny/1.1 with uniqueid field id
   [junit4]   2> 1391975 INFO  (TEST-TestLazyCores.testCreateSame-seed#[D821DE5AB1A8DB83]) [    x:collection3] o.a.s.c.CoreContainer Creating SolrCore 'collection6' using configuration from instancedir C:\Users\jenkins\workspace\Lucene-Solr-master-Windows\solr\build\solr-core\test\J0\temp\solr.core.TestLazyCores_D821DE5AB1A8DB83-001\tempDir-002\collection6
   [junit4]   2> 1391976 INFO  (TEST-TestLazyCores.testCreateSame-seed#[D821DE5AB1A8DB83]) [    x:collection3] o.a.s.c.SolrCore [[collection6] ] Opening new SolrCore at [C:\Users\jenkins\workspace\Lucene-Solr-master-Windows\solr\build\solr-core\test\J0\temp\solr.core.TestLazyCores_D821DE5AB1A8DB83-001\tempDir-002\collection6], dataDir=[C:\Users\jenkins\workspace\Lucene-Solr-master-Windows\solr\build\solr-core\test\J0\temp\solr.core.TestLazyCores_D821DE5AB1A8DB83-001\tempDir-002\collection6\data\]
   [junit4]   2> 1391985 INFO  (TEST-TestLazyCores.testCreateSame-seed#[D821DE5AB1A8DB83]) [    x:collection3] o.a.s.u.RandomMergePolicy RandomMergePolicy wrapping class org.apache.lucene.index.TieredMergePolicy: [TieredMergePolicy: maxMergeAtOnce=31, maxMergeAtOnceExplicit=21, maxMergedSegmentMB=15.255859375, floorSegmentMB=0.470703125, forceMergeDeletesPctAllowed=10.32763774075578, segmentsPerTier=45.0, maxCFSSegmentSizeMB=8.796093022207999E12, noCFSRatio=1.0
   [junit4]   2> 1392140 INFO  (TEST-TestLazyCores.testCreateSame-seed#[D821DE5AB1A8DB83]) [    x:collection3] o.a.s.u.CommitTracker Hard AutoCommit: disabled
   [junit4]   2> 1392140 INFO  (TEST-TestLazyCores.testCreateSame-seed#[D821DE5AB1A8DB83]) [    x:collection3] o.a.s.u.CommitTracker Soft AutoCommit: disabled
   [junit4]   2> 1392140 INFO  (TEST-TestLazyCores.testCreateSame-seed#[D821DE5AB1A8DB83]) [    x:collection3] o.a.s.u.RandomMergePolicy RandomMergePolicy wrapping class org.apache.lucene.index.TieredMergePolicy: [TieredMergePolicy: maxMergeAtOnce=32, maxMergeAtOnceExplicit=41, maxMergedSegmentMB=38.3203125, floorSegmentMB=1.7431640625, forceMergeDeletesPctAllowed=18.930709092464415, segmentsPerTier=45.0, maxCFSSegmentSizeMB=8.796093022207999E12, noCFSRatio=0.23820834501993338
   [junit4]   2> 1392141 INFO  (TEST-TestLazyCores.testCreateSame-seed#[D821DE5AB1A8DB83]) [    x:collection3] o.a.s.s.SolrIndexSearcher Opening [Searcher@159ed59[collection6] main]
   [junit4]   2> 1392142 INFO  (TEST-TestLazyCores.testCreateSame-seed#[D821DE5AB1A8DB83]) [    x:collection3] o.a.s.r.ManagedResourceStorage File-based storage initialized to use dir: C:\Users\jenkins\workspace\Lucene-Solr-master-Windows\solr\build\solr-core\test\J0\temp\solr.core.TestLazyCores_D821DE5AB1A8DB83-001\tempDir-002\collection6\conf
   [junit4]   2> 1392143 INFO  (TEST-TestLazyCores.testCreateSame-seed#[D821DE5AB1A8DB83]) [    x:collection3] o.a.s.h.ReplicationHandler Commits will be reserved for  10000
   [junit4]   2> 1392143 INFO  (searcherExecutor-4617-thread-1-processing-x:collection3) [    x:collection3] o.a.s.c.SolrCore [collection6] Registered new searcher Searcher@159ed59[collection6] main{ExitableDirectoryReader(UninvertingDirectoryReader())}
   [junit4]   2> 1392143 INFO  (TEST-TestLazyCores.testCreateSame-seed#[D821DE5AB1A8DB83]) [    x:collection3] o.a.s.c.SolrCores Opening transient core collection6
   [junit4]   2> 1392177 INFO  (TEST-TestLazyCores.testCreateSame-seed#[D821DE5AB1A8DB83]) [    x:collection3] o.a.s.h.a.CoreAdminOperation core create command schema=schema.xml&dataDir=t12&name=collection2&action=CREATE&config=solrconfig.xml&wt=xml
   [junit4]   2> 1392177 WARN  (TEST-TestLazyCores.testCreateSame-seed#[D821DE5AB1A8DB83]) [    x:collection3] o.a.s.c.CoreContainer Creating a core with existing name is not allowed
   [junit4]   2> 1392178 INFO  (TEST-TestLazyCores.testCreateSame-seed#[D821DE5AB1A8DB83]) [    x:collection3] o.a.s.h.a.CoreAdminOperation core create command schema=schema.xml&dataDir=t14&name=collection4&action=CREATE&config=solrconfig.xml&wt=xml
   [junit4]   2> 1392178 WARN  (TEST-TestLazyCores.testCreateSame-seed#[D821DE5AB1A8DB83]) [    x:collection3] o.a.s.c.CoreContainer Creating a core with existing name is not allowed
   [junit4]   2> 1392178 INFO  (TEST-TestLazyCores.testCreateSame-seed#[D821DE5AB1A8DB83]) [    x:collection3] o.a.s.h.a.CoreAdminOperation core create command schema=schema.xml&dataDir=t15&name=collection5&action=CREATE&config=solrconfig.xml&wt=xml
   [junit4]   2> 1392178 WARN  (TEST-TestLazyCores.testCreateSame-seed#[D821DE5AB1A8DB83]) [    x:collection3] o.a.s.c.CoreContainer Creating a core with existing name is not allowed
   [junit4]   2> 1392178 INFO  (TEST-TestLazyCores.testCreateSame-seed#[D821DE5AB1A8DB83]) [    x:collection3] o.a.s.h.a.CoreAdminOperation core create command schema=schema.xml&dataDir=t16&name=collection6&action=CREATE&config=solrconfig.xml&wt=xml
   [junit4]   2> 1392179 WARN  (TEST-TestLazyCores.testCreateSame-seed#[D821DE5AB1A8DB83]) [    x:collection3] o.a.s.c.CoreContainer Creating a core with existing name is not allowed
   [junit4]   2> 1392179 INFO  (TEST-TestLazyCores.testCreateSame-seed#[D821DE5AB1A8DB83]) [    x:collection3] o.a.s.c.CoreContainer Shutting down CoreContainer instance=33396589
   [junit4]   2> 1392179 INFO  (coreCloseExecutor-4621-thread-1-processing-x:collection3) [    x:collection1] o.a.s.c.SolrCore [collection1]  CLOSING SolrCore org.apache.solr.core.SolrCore@12b2a57
   [junit4]   2> 1392181 INFO  (coreCloseExecutor-4621-thread-2-processing-x:collection3) [    x:collection5] o.a.s.c.SolrCore [collection5]  CLOSING SolrCore org.apache.solr.core.SolrCore@1b4ba01
   [junit4]   2> 1392181 INFO  (coreCloseExecutor-4621-thread-5-processing-x:collection3) [    x:collection6] o.a.s.c.SolrCore [collection6]  CLOSING SolrCore org.apache.solr.core.SolrCore@9bf82b
   [junit4]   2> 1392181 INFO  (coreCloseExecutor-4621-thread-4-processing-x:collection3) [    x:collection2] o.a.s.c.SolrCore [collection2]  CLOSING SolrCore org.apache.solr.core.SolrCore@1e4df98
   [junit4]   2> 1392181 INFO  (coreCloseExecutor-4621-thread-3-processing-x:collection3) [    x:collection4] o.a.s.c.SolrCore [collection4]  CLOSING SolrCore org.apache.solr.core.SolrCore@bda30f
   [junit4]   2> 1392184 INFO  (coreCloseExecutor-4621-thread-1-processing-x:collection3) [    x:collection1] o.a.s.m.SolrMetricManager Closing metric reporters for: solr.core.collection1
   [junit4]   2> 1392185 INFO  (coreCloseExecutor-4621-thread-2-processing-x:collection3) [    x:collection5] o.a.s.m.SolrMetricManager Closing metric reporters for: solr.core.collection5
   [junit4]   2> 1392185 INFO  (coreCloseExecutor-4621-thread-4-processing-x:collection3) [    x:collection2] o.a.s.m.SolrMetricManager Closing metric reporters for: solr.core.collection2
   [junit4]   2> 1392185 INFO  (coreCloseExecutor-4621-thread-3-processing-x:collection3) [    x:collection4] o.a.s.m.SolrMetricManager Closing metric reporters for: solr.core.collection4
   [junit4]   2> 1392185 INFO  (coreCloseExecutor-4621-thread-5-processing-x:collection3) [    x:collection6] o.a.s.m.SolrMetricManager Closing metric reporters for: solr.core.collection6
   [junit4]   2> 1392186 INFO  (TEST-TestLazyCores.testCreateSame-seed#[D821DE5AB1A8DB83]) [    x:collection3] o.a.s.m.SolrMetricManager Closing metric reporters for: solr.node
   [junit4]   2> 1392186 INFO  (TEST-TestLazyCores.testCreateSame-seed#[D821DE5AB1A8DB83]) [    x:collection3] o.a.s.SolrTestCaseJ4 ###Ending testCreateSame
   [junit4]   2> 1392188 INFO  (TEST-TestLazyCores.testLazyLoad-seed#[D821DE5AB1A8DB83]) [    x:collection3] o.a.s.SolrTestCaseJ4 ###Starting testLazyLoad
   [junit4]   2> 1392312 INFO  (TEST-TestLazyCores.testLazyLoad-seed#[D821DE5AB1A8DB83]) [    x:collection3] o.a.s.c.SolrCores Allocating transient cache for 4 transient cores
   [junit4]   2> 1392505 WARN  (coreLoadExecutor-4628-thread-1-processing-x:collection3) [    x:collection1] o.a.s.c.Config Beginning with Solr 5.5, <mergePolicy> is deprecated, use <mergePolicyFactory> instead.
   [junit4]   2> 1392505 WARN  (coreLoadExecutor-4628-thread-2-processing-x:collection3) [    x:collection2] o.a.s.c.Config Beginning with Solr 5.5, <mergePolicy> is deprecated, use <mergePolicyFactory> instead.
   [junit4]   2> 1392505 INFO  (coreLoadExecutor-4628-thread-1-processing-x:collection3) [    x:collection1] o.a.s.c.SolrConfig Using Lucene MatchVersion: 7.0.0
   [junit4]   2> 1392506 INFO  (coreLoadExecutor-4628-thread-2-processing-x:collection3) [    x:collection2] o.a.s.c.SolrConfig Using Lucene MatchVersion: 7.0.0
   [junit4]   2> 1392512 WARN  (coreLoadExecutor-4628-thread-3-processing-x:collection3) [    x:collection5] o.a.s.c.Config Beginning with Solr 5.5, <mergePolicy> is deprecated, use <mergePolicyFactory> instead.
   [junit4]   2> 1392513 INFO  (coreLoadExecutor-4628-thread-3-processing-x:collection3) [    x:collection5] o.a.s.c.SolrConfig Using Lucene MatchVersion: 7.0.0
   [junit4]   2> 1392514 INFO  (coreLoadExecutor-4628-thread-2-processing-x:collection3) [    x:collection2] o.a.s.s.IndexSchema [collection2] Schema name=tiny
   [junit4]   2> 1392521 INFO  (coreLoadExecutor-4628-thread-1-processing-x:collection3) [    x:collection1] o.a.s.s.IndexSchema [collection1] Schema name=tiny
   [junit4]   2> 1392522 INFO  (coreLoadExecutor-4628-thread-3-processing-x:collection3) [    x:collection5] o.a.s.s.IndexSchema [collection5] Schema name=tiny
   [junit4]   2> 1392526 INFO  (coreLoadExecutor-4628-thread-1-processing-x:collection3) [    x:collection1] o.a.s.s.IndexSchema Loaded schema tiny/1.1 with uniqueid field id
   [junit4]   2> 1392526 INFO  (coreLoadExecutor-4628-thread-2-processing-x:collection3) [    x:collection2] o.a.s.s.IndexSchema Loaded schema tiny/1.1 with uniqueid field id
   [junit4]   2> 1392526 INFO  (coreLoadExecutor-4628-thread-3-processing-x:collection3) [    x:collection5] o.a.s.s.IndexSchema Loaded schema tiny/1.1 with uniqueid field id
   [junit4]   2> 1392539 INFO  (coreLoadExecutor-4628-thread-2-processing-x:collection3) [    x:collection2] o.a.s.c.CoreContainer Creating SolrCore 'collection2' using configuration from instancedir C:\Users\jenkins\workspace\Lucene-Solr-master-Windows\solr\build\solr-core\test\J0\temp\solr.core.TestLazyCores_D821DE5AB1A8DB83-001\tempDir-003\collection2
   [junit4]   2> 1392539 INFO  (coreLoadExecutor-4628-thread-3-processing-x:collection3) [    x:collection5] o.a.s.c.CoreContainer Creating SolrCore 'collection5' using configuration from instancedir C:\Users\jenkins\workspace\Lucene-Solr-master-Windows\solr\build\solr-core\test\J0\temp\solr.core.TestLazyCores_D821DE5AB1A8DB83-001\tempDir-003\collection5
   [junit4]   2> 1392539 INFO  (coreLoadExecutor-4628-thread-1-processing-x:collection3) [    x:collection1] o.a.s.c.CoreContainer Creating SolrCore 'collection1' using configuration from instancedir C:\Users\jenkins\workspace\Lucene-Solr-master-Windows\solr\build\solr-core\test\J0\temp\solr.core.TestLazyCores_D821DE5AB1A8DB83-001\tempDir-003\collection1
   [junit4]   2> 1392539 INFO  (coreLoadExecutor-4628-thread-3-processing-x:collection3) [    x:collection5] o.a.s.c.SolrCore [[collection5] ] Opening new SolrCore at [C:\Users\jenkins\workspace\Lucene-Solr-master-Windows\solr\build\solr-core\test\J0\temp\solr.core.TestLazyCores_D821DE5AB1A8DB83-001\tempDir-003\collection5], dataDir=[C:\Users\jenkins\workspace\Lucene-Solr-master-Windows\solr\build\solr-core\test\J0\temp\solr.core.TestLazyCores_D821DE5AB1A8DB83-001\tempDir-003\collection5\data\]
   [junit4]   2> 1392539 INFO  (coreLoadExecutor-4628-thread-2-processing-x:collection3) [    x:collection2] o.a.s.c.SolrCore [[collection2] ] Opening new SolrCore at [C:\Users\jenkins\workspace\Lucene-Solr-master-Windows\solr\build\solr-core\test\J0\temp\solr.core.TestLazyCores_D821DE5AB1A8DB83-001\tempDir-003\collection2], dataDir=[C:\Users\jenkins\workspace\Lucene-Solr-master-Windows\solr\build\solr-core\test\J0\temp\solr.core.TestLazyCores_D821DE5AB1A8DB83-001\tempDir-003\collection2\data\]
   [junit4]   2> 1392539 INFO  (coreLoadExecutor-4628-thread-1-processing-x:collection3) [    x:collection1] o.a.s.c.SolrCore [[collection1] ] Opening new SolrCore at [C:\Users\jenkins\workspace\Lucene-Solr-master-Windows\solr\build\solr-core\test\J0\temp\solr.core.TestLazyCores_D821DE5AB1A8DB83-001\tempDir-003\collection1], dataDir=[C:\Users\jenkins\workspace\Lucene-Solr-master-Windows\solr\build\solr-core\test\J0\temp\solr.core.TestLazyCores_D821DE5AB1A8DB83-001\tempDir-003\collection1\data\]
   [junit4]   2> 1392548 INFO  (coreLoadExecutor-4628-thread-3-processing-x:collection3) [    x:collection5] o.a.s.u.RandomMergePolicy RandomMergePolicy wrapping class org.apache.lucene.index.TieredMergePolicy: [TieredMergePolicy: maxMergeAtOnce=6, maxMergeAtOnceExplicit=5, maxMergedSegmentMB=71.3193359375, floorSegmentMB=1.8857421875, forceMergeDeletesPctAllowed=19.06230029912371, segmentsPerTier=29.0, maxCFSSegmentSizeMB=8.796093022207999E12, noCFSRatio=0.7420682934276116
   [junit4]   2> 1392548 INFO  (coreLoadExecutor-4628-thread-1-processing-x:collection3) [    x:collection1] o.a.s.u.RandomMergePolicy RandomMergePolicy wrapping class org.apache.lucene.index.TieredMergePolicy: [TieredMergePolicy: maxMergeAtOnce=6, maxMergeAtOnceExplicit=5, maxMergedSegmentMB=71.3193359375, floorSegmentMB=1.8857421875, forceMergeDeletesPctAllowed=19.06230029912371, segmentsPerTier=29.0, maxCFSSegmentSizeMB=8.796093022207999E12, noCFSRatio=0.7420682934276116
   [junit4]   2> 1392548 INFO  (coreLoadExecutor-4628-thread-2-processing-x:collection3) [    x:collection2] o.a.s.u.RandomMergePolicy RandomMergePolicy wrapping class org.apache.lucene.index.TieredMergePolicy: [TieredMergePolicy: maxMergeAtOnce=6, maxMergeAtOnceExplicit=5, maxMergedSegmentMB=71.3193359375, floorSegmentMB=1.8857421875, forceMergeDeletesPctAllowed=19.06230029912371, segmentsPerTier=29.0, maxCFSSegmentSizeMB=8.796093022207999E12, noCFSRatio=0.7420682934276116
   [junit4]   2> 1392723 INFO  (coreLoadExecutor-4628-thread-2-processing-x:collection3) [    x:collection2] o.a.s.u.CommitTracker Hard AutoCommit: disabled
   [junit4]   2> 1392724 INFO  (coreLoadExecutor-4628-thread-3-processing-x:collection3) [    x:collection5] o.a.s.u.CommitTracker Hard AutoCommit: disabled
   [junit4]   2> 1392724 INFO  (coreLoadExecutor-4628-thread-1-processing-x:collection3) [    x:collection1] o.a.s.u.CommitTracker Hard AutoCommit: disabled
   [junit4]   2> 1392724 INFO  (coreLoadExecutor-4628-thread-3-processing-x:collection3) [    x:collection5] o.a.s.u.CommitTracker Soft AutoCommit: disabled
   [junit4]   2> 1392724 INFO  (coreLoadExecutor-4628-thread-2-processing-x:collection3) [    x:collection2] o.a.s.u.CommitTracker Soft AutoCommit: disabled
   [junit4]   2> 1392724 INFO  (coreLoadExecutor-4628-thread-1-processing-x:collection3) [    x:collection1] o.a.s.u.CommitTracker Soft AutoCommit: disabled
   [junit4]   2> 1392725 INFO  (coreLoadExecutor-4628-thread-3-processing-x:collection3) [    x:collection5] o.a.s.u.RandomMergePolicy RandomMergePolicy wrapping class org.apache.lucene.index.TieredMergePolicy: [TieredMergePolicy: maxMergeAtOnce=45, maxMergeAtOnceExplicit=13, maxMergedSegmentMB=39.5986328125, floorSegmentMB=1.2421875, forceMergeDeletesPctAllowed=6.569934249772057, segmentsPerTier=19.0, maxCFSSegmentSizeMB=8.796093022207999E12, noCFSRatio=0.0
   [junit4]   2> 1392725 INFO  (coreLoadExecutor-4628-thread-1-processing-x:collection3) [    x:collection1] o.a.s.u.RandomMergePolicy RandomMergePolicy wrapping class org.apache.lucene.index.TieredMergePolicy: [TieredMergePolicy: maxMergeAtOnce=45, maxMergeAtOnceExplicit=13, maxMergedSegmentMB=39.5986328125, floorSegmentMB=1.2421875, forceMergeDeletesPctAllowed=6.569934249772057, segmentsPerTier=19.0, maxCFSSegmentSizeMB=8.796093022207999E12, noCFSRatio=0.0
   [junit4]   2> 1392725 INFO  (coreLoadExecutor-4628-thread-2-processing-x:collection3) [    x:collection2] o.a.s.u.RandomMergePolicy RandomMergePolicy wrapping class org.apache.lucene.index.TieredMergePolicy: [TieredMergePolicy: maxMergeAtOnce=45, maxMergeAtOnceExplicit=13, maxMergedSegmentMB=39.5986328125, floorSegmentMB=1.2421875, forceMergeDeletesPctAllowed=6.569934249772057, segmentsPerTier=19.0, maxCFSSegmentSizeMB=8.796093022207999E12, noCFSRatio=0.0
   [junit4]   2> 1392726 INFO  (coreLoadExecutor-4628-thread-1-processing-x:collection3) [    x:collection1] o.a.s.s.SolrIndexSearcher Opening [Searcher@1a53bfa[collection1] main]
   [junit4]   2> 1392726 INFO  (coreLoadExecutor-4628-thread-2-processing-x:collection3) [    x:collection2] o.a.s.s.SolrIndexSearcher Opening [Searcher@1b1bdf4[collection2] main]
   [junit4]   2> 1392726 INFO  (coreLoadExecutor-4628-thread-3-processing-x:collection3) [    x:collection5] o.a.s.s.SolrIndexSearcher Opening [Searcher@62ab43[collection5] main]
   [junit4]   2> 1392727 INFO  (coreLoadExecutor-4628-thread-1-processing-x:collection3) [    x:collection1] o.a.s.r.ManagedResourceStorage File-based storage initialized to use dir: C:\Users\jenkins\workspace\Lucene-Solr-master-Windows\solr\build\solr-core\test\J0\temp\solr.core.TestLazyCores_D821DE5AB1A8DB83-001\tempDir-003\collection1\conf
   [junit4]   2> 1392727 INFO  (coreLoadExecutor-4628-thread-2-processing-x:collection3) [    x:collection2] o.a.s.r.ManagedResourceStorage File-based storage initialized to use dir: C:\Users\jenkins\workspace\Lucene-Solr-master-Windows\solr\build\solr-core\test\J0\temp\solr.core.TestLazyCores_D821DE5AB1A8DB83-001\tempDir-003\collection2\conf
   [junit4]   2> 1392728 INFO  (coreLoadExecutor-4628-thread-1-processing-x:collection3) [    x:collection1] o.a.s.h.ReplicationHandler Commits will be reserved for  10000
   [junit4]   2> 1392728 INFO  (coreLoadExecutor-4628-thread-2-processing-x:collection3) [    x:collection2] o.a.s.h.ReplicationHandler Commits will be reserved for  10000
   [junit4]   2> 1392728 INFO  (coreLoadExecutor-4628-thread-2-processing-x:collection3) [    x:collection2] o.a.s.c.SolrCores Opening transient core collection2
   [junit4]   2> 1392729 INFO  (coreLoadExecutor-4628-thread-3-processing-x:collection3) [    x:collection5] o.a.s.r.ManagedResourceStorage File-based storage initialized to use dir: C:\Users\jenkins\workspace\Lucene-Solr-master-Windows\solr

[...truncated too long message...]

SolrCore [collection2]  CLOSING SolrCore org.apache.solr.core.SolrCore@1ab2ee2
   [junit4]   2> 1403011 INFO  (coreCloseExecutor-4876-thread-2-processing-x:collection3) [    x:collection1] o.a.s.m.SolrMetricManager Closing metric reporters for: solr.core.collection1
   [junit4]   2> 1403011 INFO  (coreCloseExecutor-4876-thread-3-processing-x:collection3) [    x:collection2] o.a.s.m.SolrMetricManager Closing metric reporters for: solr.core.collection2
   [junit4]   2> 1403011 INFO  (coreCloseExecutor-4876-thread-4-processing-x:collection3) [    x:collection3] o.a.s.c.SolrCore [collection3]  CLOSING SolrCore org.apache.solr.core.SolrCore@845310
   [junit4]   2> 1403013 INFO  (coreCloseExecutor-4876-thread-1-processing-x:collection3) [    x:collection5] o.a.s.m.SolrMetricManager Closing metric reporters for: solr.core.collection5
   [junit4]   2> 1403013 INFO  (coreCloseExecutor-4876-thread-4-processing-x:collection3) [    x:collection3] o.a.s.m.SolrMetricManager Closing metric reporters for: solr.core.collection3
   [junit4]   2> 1403013 INFO  (TEST-TestLazyCores.testRace-seed#[D821DE5AB1A8DB83]) [    x:collection3] o.a.s.m.SolrMetricManager Closing metric reporters for: solr.node
   [junit4]   2> 1403013 INFO  (TEST-TestLazyCores.testRace-seed#[D821DE5AB1A8DB83]) [    x:collection3] o.a.s.SolrTestCaseJ4 ###Ending testRace
   [junit4]   2> 1403014 INFO  (SUITE-TestLazyCores-seed#[D821DE5AB1A8DB83]-worker) [    x:collection3] o.a.s.SolrTestCaseJ4 ###deleteCore
   [junit4]   2> 1403014 INFO  (SUITE-TestLazyCores-seed#[D821DE5AB1A8DB83]-worker) [    x:collection3] o.a.s.c.CoreContainer Shutting down CoreContainer instance=30015925
   [junit4]   2> 1403014 INFO  (SUITE-TestLazyCores-seed#[D821DE5AB1A8DB83]-worker) [    x:collection3] o.a.s.m.SolrMetricManager Closing metric reporters for: solr.node
   [junit4]   2> NOTE: leaving temporary files on disk at: C:\Users\jenkins\workspace\Lucene-Solr-master-Windows\solr\build\solr-core\test\J0\temp\solr.core.TestLazyCores_D821DE5AB1A8DB83-001
   [junit4]   2> Feb 06, 2017 10:42:24 AM com.carrotsearch.randomizedtesting.ThreadLeakControl checkThreadLeaks
   [junit4]   2> WARNING: Will linger awaiting termination of 1 leaked thread(s).
   [junit4]   2> Feb 06, 2017 10:42:44 AM com.carrotsearch.randomizedtesting.ThreadLeakControl checkThreadLeaks
   [junit4]   2> SEVERE: 1 thread leaked from SUITE scope at org.apache.solr.core.TestLazyCores: 
   [junit4]   2>    1) Thread[id=10501, name=searcherExecutor-4588-thread-1, state=WAITING, group=TGRP-TestLazyCores]
   [junit4]   2>         at sun.misc.Unsafe.park(Native Method)
   [junit4]   2>         at java.util.concurrent.locks.LockSupport.park(LockSupport.java:175)
   [junit4]   2>         at java.util.concurrent.locks.AbstractQueuedSynchronizer$ConditionObject.await(AbstractQueuedSynchronizer.java:2039)
   [junit4]   2>         at java.util.concurrent.LinkedBlockingQueue.take(LinkedBlockingQueue.java:442)
   [junit4]   2>         at java.util.concurrent.ThreadPoolExecutor.getTask(ThreadPoolExecutor.java:1067)
   [junit4]   2>         at java.util.concurrent.ThreadPoolExecutor.runWorker(ThreadPoolExecutor.java:1127)
   [junit4]   2>         at java.util.concurrent.ThreadPoolExecutor$Worker.run(ThreadPoolExecutor.java:617)
   [junit4]   2>         at java.lang.Thread.run(Thread.java:745)
   [junit4]   2> Feb 06, 2017 10:42:44 AM com.carrotsearch.randomizedtesting.ThreadLeakControl tryToInterruptAll
   [junit4]   2> INFO: Starting to interrupt leaked threads:
   [junit4]   2>    1) Thread[id=10501, name=searcherExecutor-4588-thread-1, state=WAITING, group=TGRP-TestLazyCores]
   [junit4]   2> Feb 06, 2017 10:42:47 AM com.carrotsearch.randomizedtesting.ThreadLeakControl tryToInterruptAll
   [junit4]   2> SEVERE: There are still zombie threads that couldn't be terminated:
   [junit4]   2>    1) Thread[id=10501, name=searcherExecutor-4588-thread-1, state=WAITING, group=TGRP-TestLazyCores]
   [junit4]   2>         at sun.misc.Unsafe.park(Native Method)
   [junit4]   2>         at java.util.concurrent.locks.LockSupport.park(LockSupport.java:175)
   [junit4]   2>         at java.util.concurrent.locks.AbstractQueuedSynchronizer$ConditionObject.await(AbstractQueuedSynchronizer.java:2039)
   [junit4]   2>         at java.util.concurrent.LinkedBlockingQueue.take(LinkedBlockingQueue.java:442)
   [junit4]   2>         at java.util.concurrent.ThreadPoolExecutor.getTask(ThreadPoolExecutor.java:1067)
   [junit4]   2>         at java.util.concurrent.ThreadPoolExecutor.runWorker(ThreadPoolExecutor.java:1127)
   [junit4]   2>         at java.util.concurrent.ThreadPoolExecutor$Worker.run(ThreadPoolExecutor.java:617)
   [junit4]   2>         at java.lang.Thread.run(Thread.java:745)
   [junit4]   2> NOTE: test params are: codec=Lucene70, sim=RandomSimilarity(queryNorm=true): {}, locale=sr-Latn-RS, timezone=America/Ensenada
   [junit4]   2> NOTE: Windows 10 10.0 x86/Oracle Corporation 1.8.0_121 (32-bit)/cpus=3,threads=2,free=75394496,total=536870912
   [junit4]   2> NOTE: All tests run in this JVM: [ForceLeaderTest, CloudMLTQParserTest, DistributedSpellCheckComponentTest, CollectionTooManyReplicasTest, NumericFieldsTest, CollectionReloadTest, TestCryptoKeys, TestCloudRecovery, DocValuesMultiTest, TestPostingsSolrHighlighter, TestNonDefinedSimilarityFactory, OverseerCollectionConfigSetProcessorTest, TestPKIAuthenticationPlugin, DeleteShardTest, SharedFSAutoReplicaFailoverUtilsTest, TestMergePolicyConfig, TestFieldCacheSortRandom, TestSearcherReuse, FullHLLTest, ZkStateReaderTest, CreateCollectionCleanupTest, IndexSchemaRuntimeFieldTest, HdfsChaosMonkeyNothingIsSafeTest, TestLRUCache, HdfsRecoverLeaseTest, TestConfigOverlay, SecurityConfHandlerTest, XmlUpdateRequestHandlerTest, DateFieldTest, PingRequestHandlerTest, TestTolerantSearch, TermsComponentTest, BasicDistributedZkTest, CleanupOldIndexTest, OverseerRolesTest, SolrMetricsIntegrationTest, DistributedVersionInfoTest, SimpleFacetsTest, TestTestInjection, TestOnReconnectListenerSupport, SolrCoreTest, TestJmxIntegration, RequiredFieldsTest, SearchHandlerTest, BlockCacheTest, TestFunctionQuery, AddSchemaFieldsUpdateProcessorFactoryTest, TestTrieFacet, TestManagedSchema, TestXmlQParserPlugin, TestSolrQueryParserResource, TestCollectionAPIs, DirectSolrSpellCheckerTest, TestSchemaNameResource, TestSegmentSorting, TestHashPartitioner, TestIBSimilarityFactory, TestCoreAdminApis, TestFastLRUCache, TestOrdValues, V2ApiIntegrationTest, TestHighlightDedupGrouping, DistribCursorPagingTest, SolrPluginUtilsTest, DistributedFacetPivotLargeTest, LeaderElectionTest, DeleteInactiveReplicaTest, TestRandomDVFaceting, UniqFieldsUpdateProcessorFactoryTest, TestTrackingShardHandlerFactory, TestSmileRequest, TestBulkSchemaAPI, HdfsLockFactoryTest, UpdateLogTest, TestCharFilters, DistributedExpandComponentTest, DocValuesMissingTest, ChangedSchemaMergeTest, TestRTimerTree, DistributedQueryComponentOptimizationTest, OverseerTest, TestSolrCloudSnapshots, ShardSplitTest, AnalysisAfterCoreReloadTest, TestSolrQueryResponse, TestSolrCloudWithKerberosAlt, TestDistributedSearch, JvmMetricsTest, FileUtilsTest, CursorPagingTest, TestRandomRequestDistribution, FastVectorHighlighterTest, TestExactStatsCache, QueryElevationComponentTest, SampleTest, TestLazyCores]
   [junit4]   2> NOTE: reproduce with: ant test  -Dtestcase=TestLazyCores -Dtests.seed=D821DE5AB1A8DB83 -Dtests.slow=true -Dtests.locale=sr-Latn-RS -Dtests.timezone=America/Ensenada -Dtests.asserts=true -Dtests.file.encoding=UTF-8
   [junit4] ERROR   0.00s J0 | TestLazyCores (suite) <<<
   [junit4]    > Throwable #1: com.carrotsearch.randomizedtesting.ThreadLeakError: 1 thread leaked from SUITE scope at org.apache.solr.core.TestLazyCores: 
   [junit4]    >    1) Thread[id=10501, name=searcherExecutor-4588-thread-1, state=WAITING, group=TGRP-TestLazyCores]
   [junit4]    >         at sun.misc.Unsafe.park(Native Method)
   [junit4]    >         at java.util.concurrent.locks.LockSupport.park(LockSupport.java:175)
   [junit4]    >         at java.util.concurrent.locks.AbstractQueuedSynchronizer$ConditionObject.await(AbstractQueuedSynchronizer.java:2039)
   [junit4]    >         at java.util.concurrent.LinkedBlockingQueue.take(LinkedBlockingQueue.java:442)
   [junit4]    >         at java.util.concurrent.ThreadPoolExecutor.getTask(ThreadPoolExecutor.java:1067)
   [junit4]    >         at java.util.concurrent.ThreadPoolExecutor.runWorker(ThreadPoolExecutor.java:1127)
   [junit4]    >         at java.util.concurrent.ThreadPoolExecutor$Worker.run(ThreadPoolExecutor.java:617)
   [junit4]    >         at java.lang.Thread.run(Thread.java:745)
   [junit4]    > 	at __randomizedtesting.SeedInfo.seed([D821DE5AB1A8DB83]:0)Throwable #2: com.carrotsearch.randomizedtesting.ThreadLeakError: There are still zombie threads that couldn't be terminated:
   [junit4]    >    1) Thread[id=10501, name=searcherExecutor-4588-thread-1, state=WAITING, group=TGRP-TestLazyCores]
   [junit4]    >         at sun.misc.Unsafe.park(Native Method)
   [junit4]    >         at java.util.concurrent.locks.LockSupport.park(LockSupport.java:175)
   [junit4]    >         at java.util.concurrent.locks.AbstractQueuedSynchronizer$ConditionObject.await(AbstractQueuedSynchronizer.java:2039)
   [junit4]    >         at java.util.concurrent.LinkedBlockingQueue.take(LinkedBlockingQueue.java:442)
   [junit4]    >         at java.util.concurrent.ThreadPoolExecutor.getTask(ThreadPoolExecutor.java:1067)
   [junit4]    >         at java.util.concurrent.ThreadPoolExecutor.runWorker(ThreadPoolExecutor.java:1127)
   [junit4]    >         at java.util.concurrent.ThreadPoolExecutor$Worker.run(ThreadPoolExecutor.java:617)
   [junit4]    >         at java.lang.Thread.run(Thread.java:745)
   [junit4]    > 	at __randomizedtesting.SeedInfo.seed([D821DE5AB1A8DB83]:0)
   [junit4] Completed [273/693 (1!)] on J0 in 37.09s, 9 tests, 3 errors <<< FAILURES!

[...truncated 55988 lines...]


Mime
View raw message