lucene-dev mailing list archives

Site index · List index
Message view « Date » · « Thread »
Top « Date » · « Thread »
From Policeman Jenkins Server <jenk...@thetaphi.de>
Subject [JENKINS] Lucene-Solr-master-MacOSX (64bit/jdk1.8.0) - Build # 3825 - Still Failing!
Date Sat, 11 Feb 2017 12:22:41 GMT
Build: https://jenkins.thetaphi.de/job/Lucene-Solr-master-MacOSX/3825/
Java: 64bit/jdk1.8.0 -XX:+UseCompressedOops -XX:+UseSerialGC

1 tests failed.
FAILED:  org.apache.solr.cloud.CustomCollectionTest.testRouteFieldForHashRouter

Error Message:
Collection not found: routeFieldColl

Stack Trace:
org.apache.solr.common.SolrException: Collection not found: routeFieldColl
	at __randomizedtesting.SeedInfo.seed([167C8A2C2AD6C4E3:BE4A14F1B5B72FB9]:0)
	at org.apache.solr.client.solrj.impl.CloudSolrClient.getCollectionNames(CloudSolrClient.java:1376)
	at org.apache.solr.client.solrj.impl.CloudSolrClient.requestWithRetryOnStaleState(CloudSolrClient.java:1072)
	at org.apache.solr.client.solrj.impl.CloudSolrClient.request(CloudSolrClient.java:1042)
	at org.apache.solr.client.solrj.SolrRequest.process(SolrRequest.java:160)
	at org.apache.solr.client.solrj.request.UpdateRequest.commit(UpdateRequest.java:232)
	at org.apache.solr.cloud.CustomCollectionTest.testRouteFieldForHashRouter(CustomCollectionTest.java:166)
	at sun.reflect.NativeMethodAccessorImpl.invoke0(Native Method)
	at sun.reflect.NativeMethodAccessorImpl.invoke(NativeMethodAccessorImpl.java:62)
	at sun.reflect.DelegatingMethodAccessorImpl.invoke(DelegatingMethodAccessorImpl.java:43)
	at java.lang.reflect.Method.invoke(Method.java:498)
	at com.carrotsearch.randomizedtesting.RandomizedRunner.invoke(RandomizedRunner.java:1713)
	at com.carrotsearch.randomizedtesting.RandomizedRunner$8.evaluate(RandomizedRunner.java:907)
	at com.carrotsearch.randomizedtesting.RandomizedRunner$9.evaluate(RandomizedRunner.java:943)
	at com.carrotsearch.randomizedtesting.RandomizedRunner$10.evaluate(RandomizedRunner.java:957)
	at com.carrotsearch.randomizedtesting.rules.SystemPropertiesRestoreRule$1.evaluate(SystemPropertiesRestoreRule.java:57)
	at org.apache.lucene.util.TestRuleSetupTeardownChained$1.evaluate(TestRuleSetupTeardownChained.java:49)
	at org.apache.lucene.util.AbstractBeforeAfterRule$1.evaluate(AbstractBeforeAfterRule.java:45)
	at org.apache.lucene.util.TestRuleThreadAndTestName$1.evaluate(TestRuleThreadAndTestName.java:48)
	at org.apache.lucene.util.TestRuleIgnoreAfterMaxFailures$1.evaluate(TestRuleIgnoreAfterMaxFailures.java:64)
	at org.apache.lucene.util.TestRuleMarkFailure$1.evaluate(TestRuleMarkFailure.java:47)
	at com.carrotsearch.randomizedtesting.rules.StatementAdapter.evaluate(StatementAdapter.java:36)
	at com.carrotsearch.randomizedtesting.ThreadLeakControl$StatementRunner.run(ThreadLeakControl.java:368)
	at com.carrotsearch.randomizedtesting.ThreadLeakControl.forkTimeoutingTask(ThreadLeakControl.java:817)
	at com.carrotsearch.randomizedtesting.ThreadLeakControl$3.evaluate(ThreadLeakControl.java:468)
	at com.carrotsearch.randomizedtesting.RandomizedRunner.runSingleTest(RandomizedRunner.java:916)
	at com.carrotsearch.randomizedtesting.RandomizedRunner$5.evaluate(RandomizedRunner.java:802)
	at com.carrotsearch.randomizedtesting.RandomizedRunner$6.evaluate(RandomizedRunner.java:852)
	at com.carrotsearch.randomizedtesting.RandomizedRunner$7.evaluate(RandomizedRunner.java:863)
	at com.carrotsearch.randomizedtesting.rules.StatementAdapter.evaluate(StatementAdapter.java:36)
	at com.carrotsearch.randomizedtesting.rules.SystemPropertiesRestoreRule$1.evaluate(SystemPropertiesRestoreRule.java:57)
	at org.apache.lucene.util.AbstractBeforeAfterRule$1.evaluate(AbstractBeforeAfterRule.java:45)
	at com.carrotsearch.randomizedtesting.rules.StatementAdapter.evaluate(StatementAdapter.java:36)
	at org.apache.lucene.util.TestRuleStoreClassName$1.evaluate(TestRuleStoreClassName.java:41)
	at com.carrotsearch.randomizedtesting.rules.NoShadowingOrOverridesOnMethodsRule$1.evaluate(NoShadowingOrOverridesOnMethodsRule.java:40)
	at com.carrotsearch.randomizedtesting.rules.NoShadowingOrOverridesOnMethodsRule$1.evaluate(NoShadowingOrOverridesOnMethodsRule.java:40)
	at com.carrotsearch.randomizedtesting.rules.StatementAdapter.evaluate(StatementAdapter.java:36)
	at com.carrotsearch.randomizedtesting.rules.StatementAdapter.evaluate(StatementAdapter.java:36)
	at com.carrotsearch.randomizedtesting.rules.StatementAdapter.evaluate(StatementAdapter.java:36)
	at org.apache.lucene.util.TestRuleAssertionsRequired$1.evaluate(TestRuleAssertionsRequired.java:53)
	at org.apache.lucene.util.TestRuleMarkFailure$1.evaluate(TestRuleMarkFailure.java:47)
	at org.apache.lucene.util.TestRuleIgnoreAfterMaxFailures$1.evaluate(TestRuleIgnoreAfterMaxFailures.java:64)
	at org.apache.lucene.util.TestRuleIgnoreTestSuites$1.evaluate(TestRuleIgnoreTestSuites.java:54)
	at com.carrotsearch.randomizedtesting.rules.StatementAdapter.evaluate(StatementAdapter.java:36)
	at com.carrotsearch.randomizedtesting.ThreadLeakControl$StatementRunner.run(ThreadLeakControl.java:368)
	at java.lang.Thread.run(Thread.java:745)




Build Log:
[...truncated 12332 lines...]
   [junit4] Suite: org.apache.solr.cloud.CustomCollectionTest
   [junit4]   2> Creating dataDir: /Users/jenkins/workspace/Lucene-Solr-master-MacOSX/solr/build/solr-core/test/J1/temp/solr.cloud.CustomCollectionTest_167C8A2C2AD6C4E3-001/init-core-data-001
   [junit4]   2> 2361042 INFO  (SUITE-CustomCollectionTest-seed#[167C8A2C2AD6C4E3]-worker) [    ] o.a.s.SolrTestCaseJ4 Using PointFields
   [junit4]   2> 2361043 INFO  (SUITE-CustomCollectionTest-seed#[167C8A2C2AD6C4E3]-worker) [    ] o.a.s.SolrTestCaseJ4 Randomized ssl (false) and clientAuth (false) via: @org.apache.solr.util.RandomizeSSL(reason=, value=NaN, ssl=NaN, clientAuth=NaN) w/ MAC_OS_X supressed clientAuth
   [junit4]   2> 2361044 INFO  (SUITE-CustomCollectionTest-seed#[167C8A2C2AD6C4E3]-worker) [    ] o.a.s.c.MiniSolrCloudCluster Starting cluster of 4 servers in /Users/jenkins/workspace/Lucene-Solr-master-MacOSX/solr/build/solr-core/test/J1/temp/solr.cloud.CustomCollectionTest_167C8A2C2AD6C4E3-001/tempDir-001
   [junit4]   2> 2361044 INFO  (SUITE-CustomCollectionTest-seed#[167C8A2C2AD6C4E3]-worker) [    ] o.a.s.c.ZkTestServer STARTING ZK TEST SERVER
   [junit4]   2> 2361045 INFO  (Thread-3217) [    ] o.a.s.c.ZkTestServer client port:0.0.0.0/0.0.0.0:0
   [junit4]   2> 2361045 INFO  (Thread-3217) [    ] o.a.s.c.ZkTestServer Starting server
   [junit4]   2> 2361147 INFO  (SUITE-CustomCollectionTest-seed#[167C8A2C2AD6C4E3]-worker) [    ] o.a.s.c.ZkTestServer start zk server on port:63796
   [junit4]   2> 2361165 INFO  (jetty-launcher-2359-thread-1) [    ] o.e.j.s.Server jetty-9.3.14.v20161028
   [junit4]   2> 2361165 INFO  (jetty-launcher-2359-thread-2) [    ] o.e.j.s.Server jetty-9.3.14.v20161028
   [junit4]   2> 2361165 INFO  (jetty-launcher-2359-thread-3) [    ] o.e.j.s.Server jetty-9.3.14.v20161028
   [junit4]   2> 2361166 INFO  (jetty-launcher-2359-thread-4) [    ] o.e.j.s.Server jetty-9.3.14.v20161028
   [junit4]   2> 2361169 INFO  (jetty-launcher-2359-thread-2) [    ] o.e.j.s.h.ContextHandler Started o.e.j.s.ServletContextHandler@42f9fddd{/solr,null,AVAILABLE}
   [junit4]   2> 2361170 INFO  (jetty-launcher-2359-thread-4) [    ] o.e.j.s.h.ContextHandler Started o.e.j.s.ServletContextHandler@12a19f46{/solr,null,AVAILABLE}
   [junit4]   2> 2361171 INFO  (jetty-launcher-2359-thread-2) [    ] o.e.j.s.AbstractConnector Started ServerConnector@6bc8c0a9{HTTP/1.1,[http/1.1]}{127.0.0.1:63798}
   [junit4]   2> 2361171 INFO  (jetty-launcher-2359-thread-2) [    ] o.e.j.s.Server Started @2366429ms
   [junit4]   2> 2361171 INFO  (jetty-launcher-2359-thread-2) [    ] o.a.s.c.s.e.JettySolrRunner Jetty properties: {hostContext=/solr, hostPort=63798}
   [junit4]   2> 2361171 ERROR (jetty-launcher-2359-thread-2) [    ] o.a.s.s.StartupLoggingUtils Missing Java Option solr.log.dir. Logging may be missing or incomplete.
   [junit4]   2> 2361172 INFO  (jetty-launcher-2359-thread-2) [    ] o.a.s.s.SolrDispatchFilter  ___      _       Welcome to Apache Solr? version 7.0.0
   [junit4]   2> 2361172 INFO  (jetty-launcher-2359-thread-4) [    ] o.e.j.s.AbstractConnector Started ServerConnector@7d606966{HTTP/1.1,[http/1.1]}{127.0.0.1:63799}
   [junit4]   2> 2361172 INFO  (jetty-launcher-2359-thread-2) [    ] o.a.s.s.SolrDispatchFilter / __| ___| |_ _   Starting in cloud mode on port null
   [junit4]   2> 2361172 INFO  (jetty-launcher-2359-thread-4) [    ] o.e.j.s.Server Started @2366430ms
   [junit4]   2> 2361172 INFO  (jetty-launcher-2359-thread-2) [    ] o.a.s.s.SolrDispatchFilter \__ \/ _ \ | '_|  Install dir: null
   [junit4]   2> 2361172 INFO  (jetty-launcher-2359-thread-4) [    ] o.a.s.c.s.e.JettySolrRunner Jetty properties: {hostContext=/solr, hostPort=63799}
   [junit4]   2> 2361172 INFO  (jetty-launcher-2359-thread-2) [    ] o.a.s.s.SolrDispatchFilter |___/\___/_|_|    Start time: 2017-02-11T11:33:57.388Z
   [junit4]   2> 2361172 ERROR (jetty-launcher-2359-thread-4) [    ] o.a.s.s.StartupLoggingUtils Missing Java Option solr.log.dir. Logging may be missing or incomplete.
   [junit4]   2> 2361172 INFO  (jetty-launcher-2359-thread-4) [    ] o.a.s.s.SolrDispatchFilter  ___      _       Welcome to Apache Solr? version 7.0.0
   [junit4]   2> 2361172 INFO  (jetty-launcher-2359-thread-4) [    ] o.a.s.s.SolrDispatchFilter / __| ___| |_ _   Starting in cloud mode on port null
   [junit4]   2> 2361173 INFO  (jetty-launcher-2359-thread-4) [    ] o.a.s.s.SolrDispatchFilter \__ \/ _ \ | '_|  Install dir: null
   [junit4]   2> 2361173 INFO  (jetty-launcher-2359-thread-4) [    ] o.a.s.s.SolrDispatchFilter |___/\___/_|_|    Start time: 2017-02-11T11:33:57.389Z
   [junit4]   2> 2361173 INFO  (jetty-launcher-2359-thread-3) [    ] o.e.j.s.h.ContextHandler Started o.e.j.s.ServletContextHandler@4191455{/solr,null,AVAILABLE}
   [junit4]   2> 2361174 INFO  (jetty-launcher-2359-thread-3) [    ] o.e.j.s.AbstractConnector Started ServerConnector@23484329{HTTP/1.1,[http/1.1]}{127.0.0.1:63800}
   [junit4]   2> 2361174 INFO  (jetty-launcher-2359-thread-3) [    ] o.e.j.s.Server Started @2366432ms
   [junit4]   2> 2361174 INFO  (jetty-launcher-2359-thread-3) [    ] o.a.s.c.s.e.JettySolrRunner Jetty properties: {hostContext=/solr, hostPort=63800}
   [junit4]   2> 2361174 ERROR (jetty-launcher-2359-thread-3) [    ] o.a.s.s.StartupLoggingUtils Missing Java Option solr.log.dir. Logging may be missing or incomplete.
   [junit4]   2> 2361175 INFO  (jetty-launcher-2359-thread-3) [    ] o.a.s.s.SolrDispatchFilter  ___      _       Welcome to Apache Solr? version 7.0.0
   [junit4]   2> 2361175 INFO  (jetty-launcher-2359-thread-3) [    ] o.a.s.s.SolrDispatchFilter / __| ___| |_ _   Starting in cloud mode on port null
   [junit4]   2> 2361175 INFO  (jetty-launcher-2359-thread-3) [    ] o.a.s.s.SolrDispatchFilter \__ \/ _ \ | '_|  Install dir: null
   [junit4]   2> 2361175 INFO  (jetty-launcher-2359-thread-3) [    ] o.a.s.s.SolrDispatchFilter |___/\___/_|_|    Start time: 2017-02-11T11:33:57.391Z
   [junit4]   2> 2361176 INFO  (jetty-launcher-2359-thread-1) [    ] o.e.j.s.h.ContextHandler Started o.e.j.s.ServletContextHandler@540c4a5d{/solr,null,AVAILABLE}
   [junit4]   2> 2361176 INFO  (jetty-launcher-2359-thread-2) [    ] o.a.s.s.SolrDispatchFilter solr.xml found in ZooKeeper. Loading...
   [junit4]   2> 2361177 INFO  (jetty-launcher-2359-thread-4) [    ] o.a.s.s.SolrDispatchFilter solr.xml found in ZooKeeper. Loading...
   [junit4]   2> 2361178 INFO  (jetty-launcher-2359-thread-1) [    ] o.e.j.s.AbstractConnector Started ServerConnector@4d205557{HTTP/1.1,[http/1.1]}{127.0.0.1:63803}
   [junit4]   2> 2361178 INFO  (jetty-launcher-2359-thread-1) [    ] o.e.j.s.Server Started @2366436ms
   [junit4]   2> 2361178 INFO  (jetty-launcher-2359-thread-1) [    ] o.a.s.c.s.e.JettySolrRunner Jetty properties: {hostContext=/solr, hostPort=63803}
   [junit4]   2> 2361179 ERROR (jetty-launcher-2359-thread-1) [    ] o.a.s.s.StartupLoggingUtils Missing Java Option solr.log.dir. Logging may be missing or incomplete.
   [junit4]   2> 2361179 INFO  (jetty-launcher-2359-thread-1) [    ] o.a.s.s.SolrDispatchFilter  ___      _       Welcome to Apache Solr? version 7.0.0
   [junit4]   2> 2361179 INFO  (jetty-launcher-2359-thread-1) [    ] o.a.s.s.SolrDispatchFilter / __| ___| |_ _   Starting in cloud mode on port null
   [junit4]   2> 2361179 INFO  (jetty-launcher-2359-thread-1) [    ] o.a.s.s.SolrDispatchFilter \__ \/ _ \ | '_|  Install dir: null
   [junit4]   2> 2361179 INFO  (jetty-launcher-2359-thread-1) [    ] o.a.s.s.SolrDispatchFilter |___/\___/_|_|    Start time: 2017-02-11T11:33:57.395Z
   [junit4]   2> 2361182 INFO  (jetty-launcher-2359-thread-3) [    ] o.a.s.s.SolrDispatchFilter solr.xml found in ZooKeeper. Loading...
   [junit4]   2> 2361187 INFO  (jetty-launcher-2359-thread-1) [    ] o.a.s.s.SolrDispatchFilter solr.xml found in ZooKeeper. Loading...
   [junit4]   2> 2361192 INFO  (jetty-launcher-2359-thread-3) [    ] o.a.s.c.ZkContainer Zookeeper client=127.0.0.1:63796/solr
   [junit4]   2> 2361196 INFO  (jetty-launcher-2359-thread-1) [    ] o.a.s.c.ZkContainer Zookeeper client=127.0.0.1:63796/solr
   [junit4]   2> 2361200 INFO  (jetty-launcher-2359-thread-4) [    ] o.a.s.c.ZkContainer Zookeeper client=127.0.0.1:63796/solr
   [junit4]   2> 2361203 INFO  (jetty-launcher-2359-thread-2) [    ] o.a.s.c.ZkContainer Zookeeper client=127.0.0.1:63796/solr
   [junit4]   2> 2361236 INFO  (jetty-launcher-2359-thread-3) [n:127.0.0.1:63800_solr    ] o.a.s.c.OverseerElectionContext I am going to be the leader 127.0.0.1:63800_solr
   [junit4]   2> 2361237 INFO  (jetty-launcher-2359-thread-1) [n:127.0.0.1:63803_solr    ] o.a.s.c.ZkController Register node as live in ZooKeeper:/live_nodes/127.0.0.1:63803_solr
   [junit4]   2> 2361239 INFO  (jetty-launcher-2359-thread-3) [n:127.0.0.1:63800_solr    ] o.a.s.c.Overseer Overseer (id=97439766102867974-127.0.0.1:63800_solr-n_0000000000) starting
   [junit4]   2> 2361240 INFO  (zkCallback-2376-thread-1-processing-n:127.0.0.1:63803_solr) [n:127.0.0.1:63803_solr    ] o.a.s.c.c.ZkStateReader Updated live nodes from ZooKeeper... (0) -> (1)
   [junit4]   2> 2361240 INFO  (zkCallback-2372-thread-1-processing-n:127.0.0.1:63800_solr) [n:127.0.0.1:63800_solr    ] o.a.s.c.c.ZkStateReader Updated live nodes from ZooKeeper... (0) -> (1)
   [junit4]   2> 2361262 INFO  (jetty-launcher-2359-thread-3) [n:127.0.0.1:63800_solr    ] o.a.s.c.ZkController Register node as live in ZooKeeper:/live_nodes/127.0.0.1:63800_solr
   [junit4]   2> 2361265 INFO  (zkCallback-2376-thread-1-processing-n:127.0.0.1:63803_solr) [n:127.0.0.1:63803_solr    ] o.a.s.c.c.ZkStateReader Updated live nodes from ZooKeeper... (1) -> (2)
   [junit4]   2> 2361265 INFO  (zkCallback-2372-thread-1-processing-n:127.0.0.1:63800_solr) [n:127.0.0.1:63800_solr    ] o.a.s.c.c.ZkStateReader Updated live nodes from ZooKeeper... (1) -> (2)
   [junit4]   2> 2361270 INFO  (jetty-launcher-2359-thread-2) [n:127.0.0.1:63798_solr    ] o.a.s.c.c.ZkStateReader Updated live nodes from ZooKeeper... (0) -> (2)
   [junit4]   2> 2361300 INFO  (jetty-launcher-2359-thread-2) [n:127.0.0.1:63798_solr    ] o.a.s.c.ZkController Register node as live in ZooKeeper:/live_nodes/127.0.0.1:63798_solr
   [junit4]   2> 2361303 INFO  (zkCallback-2372-thread-2-processing-n:127.0.0.1:63800_solr) [n:127.0.0.1:63800_solr    ] o.a.s.c.c.ZkStateReader Updated live nodes from ZooKeeper... (2) -> (3)
   [junit4]   2> 2361303 INFO  (zkCallback-2376-thread-1-processing-n:127.0.0.1:63803_solr) [n:127.0.0.1:63803_solr    ] o.a.s.c.c.ZkStateReader Updated live nodes from ZooKeeper... (2) -> (3)
   [junit4]   2> 2361304 INFO  (zkCallback-2380-thread-1-processing-n:127.0.0.1:63798_solr) [n:127.0.0.1:63798_solr    ] o.a.s.c.c.ZkStateReader Updated live nodes from ZooKeeper... (2) -> (3)
   [junit4]   2> 2361308 INFO  (jetty-launcher-2359-thread-4) [n:127.0.0.1:63799_solr    ] o.a.s.c.c.ZkStateReader Updated live nodes from ZooKeeper... (0) -> (3)
   [junit4]   2> 2361319 INFO  (jetty-launcher-2359-thread-4) [n:127.0.0.1:63799_solr    ] o.a.s.c.ZkController Register node as live in ZooKeeper:/live_nodes/127.0.0.1:63799_solr
   [junit4]   2> 2361323 INFO  (zkCallback-2380-thread-1-processing-n:127.0.0.1:63798_solr) [n:127.0.0.1:63798_solr    ] o.a.s.c.c.ZkStateReader Updated live nodes from ZooKeeper... (3) -> (4)
   [junit4]   2> 2361324 INFO  (zkCallback-2379-thread-1-processing-n:127.0.0.1:63799_solr) [n:127.0.0.1:63799_solr    ] o.a.s.c.c.ZkStateReader Updated live nodes from ZooKeeper... (3) -> (4)
   [junit4]   2> 2361329 INFO  (zkCallback-2376-thread-1-processing-n:127.0.0.1:63803_solr) [n:127.0.0.1:63803_solr    ] o.a.s.c.c.ZkStateReader Updated live nodes from ZooKeeper... (3) -> (4)
   [junit4]   2> 2361329 INFO  (zkCallback-2372-thread-1-processing-n:127.0.0.1:63800_solr) [n:127.0.0.1:63800_solr    ] o.a.s.c.c.ZkStateReader Updated live nodes from ZooKeeper... (3) -> (4)
   [junit4]   2> 2362016 INFO  (jetty-launcher-2359-thread-4) [n:127.0.0.1:63799_solr    ] o.a.s.c.CorePropertiesLocator Found 0 core definitions underneath /Users/jenkins/workspace/Lucene-Solr-master-MacOSX/solr/build/solr-core/test/J1/temp/solr.cloud.CustomCollectionTest_167C8A2C2AD6C4E3-001/tempDir-001/node4/.
   [junit4]   2> 2362016 INFO  (jetty-launcher-2359-thread-2) [n:127.0.0.1:63798_solr    ] o.a.s.c.CorePropertiesLocator Found 0 core definitions underneath /Users/jenkins/workspace/Lucene-Solr-master-MacOSX/solr/build/solr-core/test/J1/temp/solr.cloud.CustomCollectionTest_167C8A2C2AD6C4E3-001/tempDir-001/node2/.
   [junit4]   2> 2362017 INFO  (jetty-launcher-2359-thread-3) [n:127.0.0.1:63800_solr    ] o.a.s.c.CorePropertiesLocator Found 0 core definitions underneath /Users/jenkins/workspace/Lucene-Solr-master-MacOSX/solr/build/solr-core/test/J1/temp/solr.cloud.CustomCollectionTest_167C8A2C2AD6C4E3-001/tempDir-001/node3/.
   [junit4]   2> 2362018 INFO  (jetty-launcher-2359-thread-1) [n:127.0.0.1:63803_solr    ] o.a.s.c.CorePropertiesLocator Found 0 core definitions underneath /Users/jenkins/workspace/Lucene-Solr-master-MacOSX/solr/build/solr-core/test/J1/temp/solr.cloud.CustomCollectionTest_167C8A2C2AD6C4E3-001/tempDir-001/node1/.
   [junit4]   2> 2364380 INFO  (SUITE-CustomCollectionTest-seed#[167C8A2C2AD6C4E3]-worker) [    ] o.a.s.c.c.ZkStateReader Updated live nodes from ZooKeeper... (0) -> (4)
   [junit4]   2> 2364383 INFO  (SUITE-CustomCollectionTest-seed#[167C8A2C2AD6C4E3]-worker) [    ] o.a.s.c.s.i.ZkClientClusterStateProvider Cluster at 127.0.0.1:63796/solr ready
   [junit4]   2> 2364474 INFO  (TEST-CustomCollectionTest.testCustomCollectionsAPI-seed#[167C8A2C2AD6C4E3]) [    ] o.a.s.SolrTestCaseJ4 ###Starting testCustomCollectionsAPI
   [junit4]   2> 2364476 INFO  (TEST-CustomCollectionTest.testCustomCollectionsAPI-seed#[167C8A2C2AD6C4E3]) [    ] o.a.s.c.c.ZkStateReader Updated live nodes from ZooKeeper... (0) -> (4)
   [junit4]   2> 2364482 INFO  (qtp1731405362-14308) [n:127.0.0.1:63799_solr    ] o.a.s.h.a.CollectionsHandler Invoked Collection Action :create with params shards=a,b,c&replicationFactor=4&collection.configName=conf&maxShardsPerNode=5&name=implicitcoll&router.name=implicit&action=CREATE&wt=javabin&version=2 and sendToOCPQueue=true
   [junit4]   2> 2364486 INFO  (OverseerThreadFactory-7617-thread-1-processing-n:127.0.0.1:63800_solr) [n:127.0.0.1:63800_solr    ] o.a.s.c.CreateCollectionCmd Create collection implicitcoll
   [junit4]   2> 2364608 INFO  (qtp1731405362-14314) [n:127.0.0.1:63799_solr    ] o.a.s.h.a.CoreAdminOperation core create command qt=/admin/cores&collection.configName=conf&newCollection=true&name=implicitcoll_b_replica3&action=CREATE&numShards=3&collection=implicitcoll&shard=b&wt=javabin&version=2
   [junit4]   2> 2364611 INFO  (qtp1731405362-14315) [n:127.0.0.1:63799_solr    ] o.a.s.h.a.CoreAdminOperation core create command qt=/admin/cores&collection.configName=conf&newCollection=true&name=implicitcoll_a_replica3&action=CREATE&numShards=3&collection=implicitcoll&shard=a&wt=javabin&version=2
   [junit4]   2> 2364611 INFO  (qtp1731405362-14316) [n:127.0.0.1:63799_solr    ] o.a.s.h.a.CoreAdminOperation core create command qt=/admin/cores&collection.configName=conf&newCollection=true&name=implicitcoll_c_replica3&action=CREATE&numShards=3&collection=implicitcoll&shard=c&wt=javabin&version=2
   [junit4]   2> 2364614 INFO  (qtp1433610066-14309) [n:127.0.0.1:63803_solr    ] o.a.s.h.a.CoreAdminOperation core create command qt=/admin/cores&collection.configName=conf&newCollection=true&name=implicitcoll_a_replica4&action=CREATE&numShards=3&collection=implicitcoll&shard=a&wt=javabin&version=2
   [junit4]   2> 2364614 INFO  (qtp1433610066-14323) [n:127.0.0.1:63803_solr    ] o.a.s.h.a.CoreAdminOperation core create command qt=/admin/cores&collection.configName=conf&newCollection=true&name=implicitcoll_b_replica4&action=CREATE&numShards=3&collection=implicitcoll&shard=b&wt=javabin&version=2
   [junit4]   2> 2364615 INFO  (qtp1433610066-14317) [n:127.0.0.1:63803_solr    ] o.a.s.h.a.CoreAdminOperation core create command qt=/admin/cores&collection.configName=conf&newCollection=true&name=implicitcoll_c_replica4&action=CREATE&numShards=3&collection=implicitcoll&shard=c&wt=javabin&version=2
   [junit4]   2> 2364619 INFO  (qtp686265105-14298) [n:127.0.0.1:63798_solr    ] o.a.s.h.a.CoreAdminOperation core create command qt=/admin/cores&collection.configName=conf&newCollection=true&name=implicitcoll_c_replica2&action=CREATE&numShards=3&collection=implicitcoll&shard=c&wt=javabin&version=2
   [junit4]   2> 2364619 INFO  (qtp686265105-14302) [n:127.0.0.1:63798_solr    ] o.a.s.h.a.CoreAdminOperation core create command qt=/admin/cores&collection.configName=conf&newCollection=true&name=implicitcoll_b_replica2&action=CREATE&numShards=3&collection=implicitcoll&shard=b&wt=javabin&version=2
   [junit4]   2> 2364620 INFO  (qtp686265105-14303) [n:127.0.0.1:63798_solr    ] o.a.s.h.a.CoreAdminOperation core create command qt=/admin/cores&collection.configName=conf&newCollection=true&name=implicitcoll_a_replica2&action=CREATE&numShards=3&collection=implicitcoll&shard=a&wt=javabin&version=2
   [junit4]   2> 2364621 INFO  (qtp767238905-14313) [n:127.0.0.1:63800_solr    ] o.a.s.h.a.CoreAdminOperation core create command qt=/admin/cores&collection.configName=conf&newCollection=true&name=implicitcoll_c_replica1&action=CREATE&numShards=3&collection=implicitcoll&shard=c&wt=javabin&version=2
   [junit4]   2> 2364621 INFO  (qtp767238905-14320) [n:127.0.0.1:63800_solr    ] o.a.s.h.a.CoreAdminOperation core create command qt=/admin/cores&collection.configName=conf&newCollection=true&name=implicitcoll_a_replica1&action=CREATE&numShards=3&collection=implicitcoll&shard=a&wt=javabin&version=2
   [junit4]   2> 2364621 INFO  (qtp767238905-14326) [n:127.0.0.1:63800_solr    ] o.a.s.h.a.CoreAdminOperation core create command qt=/admin/cores&collection.configName=conf&newCollection=true&name=implicitcoll_b_replica1&action=CREATE&numShards=3&collection=implicitcoll&shard=b&wt=javabin&version=2
   [junit4]   2> 2364772 INFO  (zkCallback-2376-thread-1-processing-n:127.0.0.1:63803_solr) [n:127.0.0.1:63803_solr    ] o.a.s.c.c.ZkStateReader A cluster state change: [WatchedEvent state:SyncConnected type:NodeDataChanged path:/collections/implicitcoll/state.json] for collection [implicitcoll] has occurred - updating... (live nodes size: [4])
   [junit4]   2> 2364772 INFO  (zkCallback-2372-thread-1-processing-n:127.0.0.1:63800_solr) [n:127.0.0.1:63800_solr    ] o.a.s.c.c.ZkStateReader A cluster state change: [WatchedEvent state:SyncConnected type:NodeDataChanged path:/collections/implicitcoll/state.json] for collection [implicitcoll] has occurred - updating... (live nodes size: [4])
   [junit4]   2> 2364772 INFO  (zkCallback-2380-thread-1-processing-n:127.0.0.1:63798_solr) [n:127.0.0.1:63798_solr    ] o.a.s.c.c.ZkStateReader A cluster state change: [WatchedEvent state:SyncConnected type:NodeDataChanged path:/collections/implicitcoll/state.json] for collection [implicitcoll] has occurred - updating... (live nodes size: [4])
   [junit4]   2> 2364772 INFO  (zkCallback-2379-thread-1-processing-n:127.0.0.1:63799_solr) [n:127.0.0.1:63799_solr    ] o.a.s.c.c.ZkStateReader A cluster state change: [WatchedEvent state:SyncConnected type:NodeDataChanged path:/collections/implicitcoll/state.json] for collection [implicitcoll] has occurred - updating... (live nodes size: [4])
   [junit4]   2> 2365654 INFO  (qtp1731405362-14316) [n:127.0.0.1:63799_solr c:implicitcoll s:c  x:implicitcoll_c_replica3] o.a.s.c.SolrConfig Using Lucene MatchVersion: 7.0.0
   [junit4]   2> 2365655 INFO  (qtp1731405362-14314) [n:127.0.0.1:63799_solr c:implicitcoll s:b  x:implicitcoll_b_replica3] o.a.s.c.SolrConfig Using Lucene MatchVersion: 7.0.0
   [junit4]   2> 2365655 INFO  (qtp1731405362-14315) [n:127.0.0.1:63799_solr c:implicitcoll s:a  x:implicitcoll_a_replica3] o.a.s.c.SolrConfig Using Lucene MatchVersion: 7.0.0
   [junit4]   2> 2365662 INFO  (qtp1433610066-14317) [n:127.0.0.1:63803_solr c:implicitcoll s:c  x:implicitcoll_c_replica4] o.a.s.c.SolrConfig Using Lucene MatchVersion: 7.0.0
   [junit4]   2> 2365662 INFO  (qtp1433610066-14323) [n:127.0.0.1:63803_solr c:implicitcoll s:b  x:implicitcoll_b_replica4] o.a.s.c.SolrConfig Using Lucene MatchVersion: 7.0.0
   [junit4]   2> 2365761 INFO  (qtp1433610066-14309) [n:127.0.0.1:63803_solr c:implicitcoll s:a  x:implicitcoll_a_replica4] o.a.s.c.SolrConfig Using Lucene MatchVersion: 7.0.0
   [junit4]   2> 2365763 INFO  (qtp767238905-14326) [n:127.0.0.1:63800_solr c:implicitcoll s:b  x:implicitcoll_b_replica1] o.a.s.c.SolrConfig Using Lucene MatchVersion: 7.0.0
   [junit4]   2> 2365767 INFO  (qtp686265105-14298) [n:127.0.0.1:63798_solr c:implicitcoll s:c  x:implicitcoll_c_replica2] o.a.s.c.SolrConfig Using Lucene MatchVersion: 7.0.0
   [junit4]   2> 2365769 INFO  (qtp767238905-14320) [n:127.0.0.1:63800_solr c:implicitcoll s:a  x:implicitcoll_a_replica1] o.a.s.c.SolrConfig Using Lucene MatchVersion: 7.0.0
   [junit4]   2> 2365777 INFO  (qtp767238905-14326) [n:127.0.0.1:63800_solr c:implicitcoll s:b  x:implicitcoll_b_replica1] o.a.s.s.IndexSchema [implicitcoll_b_replica1] Schema name=cloud-dynamic
   [junit4]   2> 2365779 INFO  (qtp1433610066-14309) [n:127.0.0.1:63803_solr c:implicitcoll s:a  x:implicitcoll_a_replica4] o.a.s.s.IndexSchema [implicitcoll_a_replica4] Schema name=cloud-dynamic
   [junit4]   2> 2365785 INFO  (qtp686265105-14298) [n:127.0.0.1:63798_solr c:implicitcoll s:c  x:implicitcoll_c_replica2] o.a.s.s.IndexSchema [implicitcoll_c_replica2] Schema name=cloud-dynamic
   [junit4]   2> 2365786 INFO  (qtp767238905-14320) [n:127.0.0.1:63800_solr c:implicitcoll s:a  x:implicitcoll_a_replica1] o.a.s.s.IndexSchema [implicitcoll_a_replica1] Schema name=cloud-dynamic
   [junit4]   2> 2365847 INFO  (qtp1731405362-14315) [n:127.0.0.1:63799_solr c:implicitcoll s:a  x:implicitcoll_a_replica3] o.a.s.s.IndexSchema [implicitcoll_a_replica3] Schema name=cloud-dynamic
   [junit4]   2> 2365850 INFO  (qtp1731405362-14314) [n:127.0.0.1:63799_solr c:implicitcoll s:b  x:implicitcoll_b_replica3] o.a.s.s.IndexSchema [implicitcoll_b_replica3] Schema name=cloud-dynamic
   [junit4]   2> 2365847 INFO  (qtp1731405362-14316) [n:127.0.0.1:63799_solr c:implicitcoll s:c  x:implicitcoll_c_replica3] o.a.s.s.IndexSchema [implicitcoll_c_replica3] Schema name=cloud-dynamic
   [junit4]   2> 2365904 INFO  (qtp686265105-14302) [n:127.0.0.1:63798_solr c:implicitcoll s:b  x:implicitcoll_b_replica2] o.a.s.c.SolrConfig Using Lucene MatchVersion: 7.0.0
   [junit4]   2> 2365904 INFO  (qtp686265105-14303) [n:127.0.0.1:63798_solr c:implicitcoll s:a  x:implicitcoll_a_replica2] o.a.s.c.SolrConfig Using Lucene MatchVersion: 7.0.0
   [junit4]   2> 2365904 INFO  (qtp767238905-14313) [n:127.0.0.1:63800_solr c:implicitcoll s:c  x:implicitcoll_c_replica1] o.a.s.c.SolrConfig Using Lucene MatchVersion: 7.0.0
   [junit4]   2> 2365912 INFO  (qtp1433610066-14317) [n:127.0.0.1:63803_solr c:implicitcoll s:c  x:implicitcoll_c_replica4] o.a.s.s.IndexSchema [implicitcoll_c_replica4] Schema name=cloud-dynamic
   [junit4]   2> 2365982 WARN  (qtp767238905-14320) [n:127.0.0.1:63800_solr c:implicitcoll s:a  x:implicitcoll_a_replica1] o.a.s.s.IndexSchema [implicitcoll_a_replica1] default search field in schema is text. WARNING: Deprecated, please use 'df' on request instead.
   [junit4]   2> 2365983 INFO  (qtp767238905-14313) [n:127.0.0.1:63800_solr c:implicitcoll s:c  x:implicitcoll_c_replica1] o.a.s.s.IndexSchema [implicitcoll_c_replica1] Schema name=cloud-dynamic
   [junit4]   2> 2365983 INFO  (qtp767238905-14320) [n:127.0.0.1:63800_solr c:implicitcoll s:a  x:implicitcoll_a_replica1] o.a.s.s.IndexSchema Loaded schema cloud-dynamic/1.6 with uniqueid field id
   [junit4]   2> 2365983 INFO  (qtp1433610066-14323) [n:127.0.0.1:63803_solr c:implicitcoll s:b  x:implicitcoll_b_replica4] o.a.s.s.IndexSchema [implicitcoll_b_replica4] Schema name=cloud-dynamic
   [junit4]   2> 2365984 INFO  (qtp686265105-14303) [n:127.0.0.1:63798_solr c:implicitcoll s:a  x:implicitcoll_a_replica2] o.a.s.s.IndexSchema [implicitcoll_a_replica2] Schema name=cloud-dynamic
   [junit4]   2> 2365985 WARN  (qtp767238905-14326) [n:127.0.0.1:63800_solr c:implicitcoll s:b  x:implicitcoll_b_replica1] o.a.s.s.IndexSchema [implicitcoll_b_replica1] default search field in schema is text. WARNING: Deprecated, please use 'df' on request instead.
   [junit4]   2> 2365985 INFO  (qtp767238905-14326) [n:127.0.0.1:63800_solr c:implicitcoll s:b  x:implicitcoll_b_replica1] o.a.s.s.IndexSchema Loaded schema cloud-dynamic/1.6 with uniqueid field id
   [junit4]   2> 2365988 INFO  (qtp686265105-14302) [n:127.0.0.1:63798_solr c:implicitcoll s:b  x:implicitcoll_b_replica2] o.a.s.s.IndexSchema [implicitcoll_b_replica2] Schema name=cloud-dynamic
   [junit4]   2> 2365993 WARN  (qtp1433610066-14317) [n:127.0.0.1:63803_solr c:implicitcoll s:c  x:implicitcoll_c_replica4] o.a.s.s.IndexSchema [implicitcoll_c_replica4] default search field in schema is text. WARNING: Deprecated, please use 'df' on request instead.
   [junit4]   2> 2365994 INFO  (qtp1433610066-14317) [n:127.0.0.1:63803_solr c:implicitcoll s:c  x:implicitcoll_c_replica4] o.a.s.s.IndexSchema Loaded schema cloud-dynamic/1.6 with uniqueid field id
   [junit4]   2> 2365994 INFO  (qtp767238905-14326) [n:127.0.0.1:63800_solr c:implicitcoll s:b  x:implicitcoll_b_replica1] o.a.s.c.CoreContainer Creating SolrCore 'implicitcoll_b_replica1' using configuration from collection implicitcoll
   [junit4]   2> 2365994 INFO  (qtp767238905-14326) [n:127.0.0.1:63800_solr c:implicitcoll s:b  x:implicitcoll_b_replica1] o.a.s.c.SolrCore [[implicitcoll_b_replica1] ] Opening new SolrCore at [/Users/jenkins/workspace/Lucene-Solr-master-MacOSX/solr/build/solr-core/test/J1/temp/solr.cloud.CustomCollectionTest_167C8A2C2AD6C4E3-001/tempDir-001/node3/implicitcoll_b_replica1], dataDir=[/Users/jenkins/workspace/Lucene-Solr-master-MacOSX/solr/build/solr-core/test/J1/temp/solr.cloud.CustomCollectionTest_167C8A2C2AD6C4E3-001/tempDir-001/node3/./implicitcoll_b_replica1/data/]
   [junit4]   2> 2365995 INFO  (qtp1433610066-14317) [n:127.0.0.1:63803_solr c:implicitcoll s:c  x:implicitcoll_c_replica4] o.a.s.c.CoreContainer Creating SolrCore 'implicitcoll_c_replica4' using configuration from collection implicitcoll
   [junit4]   2> 2366001 INFO  (qtp1433610066-14317) [n:127.0.0.1:63803_solr c:implicitcoll s:c  x:implicitcoll_c_replica4] o.a.s.c.SolrCore [[implicitcoll_c_replica4] ] Opening new SolrCore at [/Users/jenkins/workspace/Lucene-Solr-master-MacOSX/solr/build/solr-core/test/J1/temp/solr.cloud.CustomCollectionTest_167C8A2C2AD6C4E3-001/tempDir-001/node1/implicitcoll_c_replica4], dataDir=[/Users/jenkins/workspace/Lucene-Solr-master-MacOSX/solr/build/solr-core/test/J1/temp/solr.cloud.CustomCollectionTest_167C8A2C2AD6C4E3-001/tempDir-001/node1/./implicitcoll_c_replica4/data/]
   [junit4]   2> 2366008 WARN  (qtp767238905-14313) [n:127.0.0.1:63800_solr c:implicitcoll s:c  x:implicitcoll_c_replica1] o.a.s.s.IndexSchema [implicitcoll_c_replica1] default search field in schema is text. WARNING: Deprecated, please use 'df' on request instead.
   [junit4]   2> 2366010 INFO  (qtp767238905-14313) [n:127.0.0.1:63800_solr c:implicitcoll s:c  x:implicitcoll_c_replica1] o.a.s.s.IndexSchema Loaded schema cloud-dynamic/1.6 with uniqueid field id
   [junit4]   2> 2366012 INFO  (qtp767238905-14313) [n:127.0.0.1:63800_solr c:implicitcoll s:c  x:implicitcoll_c_replica1] o.a.s.c.CoreContainer Creating SolrCore 'implicitcoll_c_replica1' using configuration from collection implicitcoll
   [junit4]   2> 2366012 INFO  (qtp767238905-14313) [n:127.0.0.1:63800_solr c:implicitcoll s:c  x:implicitcoll_c_replica1] o.a.s.c.SolrCore [[implicitcoll_c_replica1] ] Opening new SolrCore at [/Users/jenkins/workspace/Lucene-Solr-master-MacOSX/solr/build/solr-core/test/J1/temp/solr.cloud.CustomCollectionTest_167C8A2C2AD6C4E3-001/tempDir-001/node3/implicitcoll_c_replica1], dataDir=[/Users/jenkins/workspace/Lucene-Solr-master-MacOSX/solr/build/solr-core/test/J1/temp/solr.cloud.CustomCollectionTest_167C8A2C2AD6C4E3-001/tempDir-001/node3/./implicitcoll_c_replica1/data/]
   [junit4]   2> 2366024 INFO  (qtp767238905-14320) [n:127.0.0.1:63800_solr c:implicitcoll s:a  x:implicitcoll_a_replica1] o.a.s.c.CoreContainer Creating SolrCore 'implicitcoll_a_replica1' using configuration from collection implicitcoll
   [junit4]   2> 2366024 INFO  (qtp767238905-14320) [n:127.0.0.1:63800_solr c:implicitcoll s:a  x:implicitcoll_a_replica1] o.a.s.c.SolrCore [[implicitcoll_a_replica1] ] Opening new SolrCore at [/Users/jenkins/workspace/Lucene-Solr-master-MacOSX/solr/build/solr-core/test/J1/temp/solr.cloud.CustomCollectionTest_167C8A2C2AD6C4E3-001/tempDir-001/node3/implicitcoll_a_replica1], dataDir=[/Users/jenkins/workspace/Lucene-Solr-master-MacOSX/solr/build/solr-core/test/J1/temp/solr.cloud.CustomCollectionTest_167C8A2C2AD6C4E3-001/tempDir-001/node3/./implicitcoll_a_replica1/data/]
   [junit4]   2> 2366075 WARN  (qtp686265105-14303) [n:127.0.0.1:63798_solr c:implicitcoll s:a  x:implicitcoll_a_replica2] o.a.s.s.IndexSchema [implicitcoll_a_replica2] default search field in schema is text. WARNING: Deprecated, please use 'df' on request instead.
   [junit4]   2> 2366076 INFO  (qtp686265105-14303) [n:127.0.0.1:63798_solr c:implicitcoll s:a  x:implicitcoll_a_replica2] o.a.s.s.IndexSchema Loaded schema cloud-dynamic/1.6 with uniqueid field id
   [junit4]   2> 2366078 WARN  (qtp1731405362-14315) [n:127.0.0.1:63799_solr c:implicitcoll s:a  x:implicitcoll_a_replica3] o.a.s.s.IndexSchema [implicitcoll_a_replica3] default search field in schema is text. WARNING: Deprecated, please use 'df' on request instead.
   [junit4]   2> 2366079 INFO  (qtp1731405362-14315) [n:127.0.0.1:63799_solr c:implicitcoll s:a  x:implicitcoll_a_replica3] o.a.s.s.IndexSchema Loaded schema cloud-dynamic/1.6 with uniqueid field id
   [junit4]   2> 2366079 WARN  (qtp1731405362-14316) [n:127.0.0.1:63799_solr c:implicitcoll s:c  x:implicitcoll_c_replica3] o.a.s.s.IndexSchema [implicitcoll_c_replica3] default search field in schema is text. WARNING: Deprecated, please use 'df' on request instead.
   [junit4]   2> 2366080 WARN  (qtp1433610066-14309) [n:127.0.0.1:63803_solr c:implicitcoll s:a  x:implicitcoll_a_replica4] o.a.s.s.IndexSchema [implicitcoll_a_replica4] default search field in schema is text. WARNING: Deprecated, please use 'df' on request instead.
   [junit4]   2> 2366080 INFO  (qtp1731405362-14316) [n:127.0.0.1:63799_solr c:implicitcoll s:c  x:implicitcoll_c_replica3] o.a.s.s.IndexSchema Loaded schema cloud-dynamic/1.6 with uniqueid field id
   [junit4]   2> 2366080 INFO  (qtp686265105-14303) [n:127.0.0.1:63798_solr c:implicitcoll s:a  x:implicitcoll_a_replica2] o.a.s.c.CoreContainer Creating SolrCore 'implicitcoll_a_replica2' using configuration from collection implicitcoll
   [junit4]   2> 2366081 INFO  (qtp1433610066-14309) [n:127.0.0.1:63803_solr c:implicitcoll s:a  x:implicitcoll_a_replica4] o.a.s.s.IndexSchema Loaded schema cloud-dynamic/1.6 with uniqueid field id
   [junit4]   2> 2366081 WARN  (qtp686265105-14298) [n:127.0.0.1:63798_solr c:implicitcoll s:c  x:implicitcoll_c_replica2] o.a.s.s.IndexSchema [implicitcoll_c_replica2] default search field in schema is text. WARNING: Deprecated, please use 'df' on request instead.
   [junit4]   2> 2366081 INFO  (qtp1731405362-14315) [n:127.0.0.1:63799_solr c:implicitcoll s:a  x:implicitcoll_a_replica3] o.a.s.c.CoreContainer Creating SolrCore 'implicitcoll_a_replica3' using configuration from collection implicitcoll
   [junit4]   2> 2366082 INFO  (qtp1433610066-14309) [n:127.0.0.1:63803_solr c:implicitcoll s:a  x:implicitcoll_a_replica4] o.a.s.c.CoreContainer Creating SolrCore 'implicitcoll_a_replica4' using configuration from collection implicitcoll
   [junit4]   2> 2366082 INFO  (qtp1731405362-14315) [n:127.0.0.1:63799_solr c:implicitcoll s:a  x:implicitcoll_a_replica3] o.a.s.c.SolrCore [[implicitcoll_a_replica3] ] Opening new SolrCore at [/Users/jenkins/workspace/Lucene-Solr-master-MacOSX/solr/build/solr-core/test/J1/temp/solr.cloud.CustomCollectionTest_167C8A2C2AD6C4E3-001/tempDir-001/node4/implicitcoll_a_replica3], dataDir=[/Users/jenkins/workspace/Lucene-Solr-master-MacOSX/solr/build/solr-core/test/J1/temp/solr.cloud.CustomCollectionTest_167C8A2C2AD6C4E3-001/tempDir-001/node4/./implicitcoll_a_replica3/data/]
   [junit4]   2> 2366082 INFO  (qtp686265105-14298) [n:127.0.0.1:63798_solr c:implicitcoll s:c  x:implicitcoll_c_replica2] o.a.s.s.IndexSchema Loaded schema cloud-dynamic/1.6 with uniqueid field id
   [junit4]   2> 2366082 INFO  (qtp1433610066-14309) [n:127.0.0.1:63803_solr c:implicitcoll s:a  x:implicitcoll_a_replica4] o.a.s.c.SolrCore [[implicitcoll_a_replica4] ] Opening new SolrCore at [/Users/jenkins/workspace/Lucene-Solr-master-MacOSX/solr/build/solr-core/test/J1/temp/solr.cloud.CustomCollectionTest_167C8A2C2AD6C4E3-001/tempDir-001/node1/implicitcoll_a_replica4], dataDir=[/Users/jenkins/workspace/Lucene-Solr-master-MacOSX/solr/build/solr-core/test/J1/temp/solr.cloud.CustomCollectionTest_167C8A2C2AD6C4E3-001/tempDir-001/node1/./implicitcoll_a_replica4/data/]
   [junit4]   2> 2366083 INFO  (qtp686265105-14303) [n:127.0.0.1:63798_solr c:implicitcoll s:a  x:implicitcoll_a_replica2] o.a.s.c.SolrCore [[implicitcoll_a_replica2] ] Opening new SolrCore at [/Users/jenkins/workspace/Lucene-Solr-master-MacOSX/solr/build/solr-core/test/J1/temp/solr.cloud.CustomCollectionTest_167C8A2C2AD6C4E3-001/tempDir-001/node2/implicitcoll_a_replica2], dataDir=[/Users/jenkins/workspace/Lucene-Solr-master-MacOSX/solr/build/solr-core/test/J1/temp/solr.cloud.CustomCollectionTest_167C8A2C2AD6C4E3-001/tempDir-001/node2/./implicitcoll_a_replica2/data/]
   [junit4]   2> 2366084 INFO  (qtp686265105-14298) [n:127.0.0.1:63798_solr c:implicitcoll s:c  x:implicitcoll_c_replica2] o.a.s.c.CoreContainer Creating SolrCore 'implicitcoll_c_replica2' using configuration from collection implicitcoll
   [junit4]   2> 2366084 INFO  (qtp1731405362-14316) [n:127.0.0.1:63799_solr c:implicitcoll s:c  x:implicitcoll_c_replica3] o.a.s.c.CoreContainer Creating SolrCore 'implicitcoll_c_replica3' using configuration from collection implicitcoll
   [junit4]   2> 2366084 INFO  (qtp686265105-14298) [n:127.0.0.1:63798_solr c:implicitcoll s:c  x:implicitcoll_c_replica2] o.a.s.c.SolrCore [[implicitcoll_c_replica2] ] Opening new SolrCore at [/Users/jenkins/workspace/Lucene-Solr-master-MacOSX/solr/build/solr-core/test/J1/temp/solr.cloud.CustomCollectionTest_167C8A2C2AD6C4E3-001/tempDir-001/node2/implicitcoll_c_replica2], dataDir=[/Users/jenkins/workspace/Lucene-Solr-master-MacOSX/solr/build/solr-core/test/J1/temp/solr.cloud.CustomCollectionTest_167C8A2C2AD6C4E3-001/tempDir-001/node2/./implicitcoll_c_replica2/data/]
   [junit4]   2> 2366084 INFO  (qtp1731405362-14316) [n:127.0.0.1:63799_solr c:implicitcoll s:c  x:implicitcoll_c_replica3] o.a.s.c.SolrCore [[implicitcoll_c_replica3] ] Opening new SolrCore at [/Users/jenkins/workspace/Lucene-Solr-master-MacOSX/solr/build/solr-core/test/J1/temp/solr.cloud.CustomCollectionTest_167C8A2C2AD6C4E3-001/tempDir-001/node4/implicitcoll_c_replica3], dataDir=[/Users/jenkins/workspace/Lucene-Solr-master-MacOSX/solr/build/solr-core/test/J1/temp/solr.cloud.CustomCollectionTest_167C8A2C2AD6C4E3-001/tempDir-001/node4/./implicitcoll_c_replica3/data/]
   [junit4]   2> 2366084 WARN  (qtp1731405362-14314) [n:127.0.0.1:63799_solr c:implicitcoll s:b  x:implicitcoll_b_replica3] o.a.s.s.IndexSchema [implicitcoll_b_replica3] default search field in schema is text. WARNING: Deprecated, please use 'df' on request instead.
   [junit4]   2> 2366085 INFO  (qtp1731405362-14314) [n:127.0.0.1:63799_solr c:implicitcoll s:b  x:implicitcoll_b_replica3] o.a.s.s.IndexSchema Loaded schema cloud-dynamic/1.6 with uniqueid field id
   [junit4]   2> 2366091 WARN  (qtp1433610066-14323) [n:127.0.0.1:63803_solr c:implicitcoll s:b  x:implicitcoll_b_replica4] o.a.s.s.IndexSchema [implicitcoll_b_replica4] default search field in schema is text. WARNING: Deprecated, please use 'df' on request instead.
   [junit4]   2> 2366092 INFO  (qtp1433610066-14323) [n:127.0.0.1:63803_solr c:implicitcoll s:b  x:implicitcoll_b_replica4] o.a.s.s.IndexSchema Loaded schema cloud-dynamic/1.6 with uniqueid field id
   [junit4]   2> 2366093 INFO  (qtp1433610066-14323) [n:127.0.0.1:63803_solr c:implicitcoll s:b  x:implicitcoll_b_replica4] o.a.s.c.CoreContainer Creating SolrCore 'implicitcoll_b_replica4' using configuration from collection implicitcoll
   [junit4]   2> 2366094 INFO  (qtp1433610066-14323) [n:127.0.0.1:63803_solr c:implicitcoll s:b  x:implicitcoll_b_replica4] o.a.s.c.SolrCore [[implicitcoll_b_replica4] ] Opening new SolrCore at [/Users/jenkins/workspace/Lucene-Solr-master-MacOSX/solr/build/solr-core/test/J1/temp/solr.cloud.CustomCollectionTest_167C8A2C2AD6C4E3-001/tempDir-001/node1/implicitcoll_b_replica4], dataDir=[/Users/jenkins/workspace/Lucene-Solr-master-MacOSX/solr/build/solr-core/test/J1/temp/solr.cloud.CustomCollectionTest_167C8A2C2AD6C4E3-001/tempDir-001/node1/./implicitcoll_b_replica4/data/]
   [junit4]   2> 2366095 WARN  (qtp686265105-14302) [n:127.0.0.1:63798_solr c:implicitcoll s:b  x:implicitcoll_b_replica2] o.a.s.s.IndexSchema [implicitcoll_b_replica2] default search field in schema is text. WARNING: Deprecated, please use 'df' on request instead.
   [junit4]   2> 2366095 INFO  (qtp1731405362-14314) [n:127.0.0.1:63799_solr c:implicitcoll s:b  x:implicitcoll_b_replica3] o.a.s.c.CoreContainer Creating SolrCore 'implicitcoll_b_replica3' using configuration from collection implicitcoll
   [junit4]   2> 2366095 INFO  (qtp1731405362-14314) [n:127.0.0.1:63799_solr c:implicitcoll s:b  x:implicitcoll_b_replica3] o.a.s.c.SolrCore [[implicitcoll_b_replica3] ] Opening new SolrCore at [/Users/jenkins/workspace/Lucene-Solr-master-MacOSX/solr/build/solr-core/test/J1/temp/solr.cloud.CustomCollectionTest_167C8A2C2AD6C4E3-001/tempDir-001/node4/implicitcoll_b_replica3], dataDir=[/Users/jenkins/workspace/Lucene-Solr-master-MacOSX/solr/build/solr-core/test/J1/temp/solr.cloud.CustomCollectionTest_167C8A2C2AD6C4E3-001/tempDir-001/node4/./implicitcoll_b_replica3/data/]
   [junit4]   2> 2366095 INFO  (qtp686265105-14302) [n:127.0.0.1:63798_solr c:implicitcoll s:b  x:implicitcoll_b_replica2] o.a.s.s.IndexSchema Loaded schema cloud-dynamic/1.6 with uniqueid field id
   [junit4]   2> 2366096 INFO  (qtp686265105-14302) [n:127.0.0.1:63798_solr c:implicitcoll s:b  x:implicitcoll_b_replica2] o.a.s.c.CoreContainer Creating SolrCore 'implicitcoll_b_replica2' using configuration from collection implicitcoll
   [junit4]   2> 2366097 INFO  (qtp686265105-14302) [n:127.0.0.1:63798_solr c:implicitcoll s:b  x:implicitcoll_b_replica2] o.a.s.c.SolrCore [[implicitcoll_b_replica2] ] Opening new SolrCore at [/Users/jenkins/workspace/Lucene-Solr-master-MacOSX/solr/build/solr-core/test/J1/temp/solr.cloud.CustomCollectionTest_167C8A2C2AD6C4E3-001/tempDir-001/node2/implicitcoll_b_replica2], dataDir=[/Users/jenkins/workspace/Lucene-Solr-master-MacOSX/solr/build/solr-core/test/J1/temp/solr.cloud.CustomCollectionTest_167C8A2C2AD6C4E3-001/tempDir-001/node2/./implicitcoll_b_replica2/data/]
   [junit4]   2> 2366322 INFO  (qtp767238905-14326) [n:127.0.0.1:63800_solr c:implicitcoll s:b  x:implicitcoll_b_replica1] o.a.s.u.UpdateHandler Using UpdateLog implementation: org.apache.solr.update.UpdateLog
   [junit4]   2> 2366322 INFO  (qtp767238905-14326) [n:127.0.0.1:63800_solr c:implicitcoll s:b  x:implicitcoll_b_replica1] o.a.s.u.UpdateLog Initializing UpdateLog: dataDir=null defaultSyncLevel=FLUSH numRecordsToKeep=100 maxNumLogsToKeep=10 numVersionBuckets=65536
   [junit4]   2> 2366324 INFO  (qtp767238905-14326) [n:127.0.0.1:63800_solr c:implicitcoll s:b  x:implicitcoll_b_replica1] o.a.s.u.CommitTracker Hard AutoCommit: disabled
   [junit4]   2> 2366324 INFO  (qtp767238905-14326) [n:127.0.0.1:63800_solr c:implicitcoll s:b  x:implicitcoll_b_replica1] o.a.s.u.CommitTracker Soft AutoCommit: disabled
   [junit4]   2> 2366325 INFO  (qtp1433610066-14317) [n:127.0.0.1:63803_solr c:implicitcoll s:c  x:implicitcoll_c_replica4] o.a.s.u.UpdateHandler Using UpdateLog implementation: org.apache.solr.update.UpdateLog
   [junit4]   2> 2366325 INFO  (qtp1433610066-14317) [n:127.0.0.1:63803_solr c:implicitcoll s:c  x:implicitcoll_c_replica4] o.a.s.u.UpdateLog Initializing UpdateLog: dataDir=null defaultSyncLevel=FLUSH numRecordsToKeep=100 maxNumLogsToKeep=10 numVersionBuckets=65536
   [junit4]   2> 2366362 INFO  (qtp767238905-14326) [n:127.0.0.1:63800_solr c:implicitcoll s:b  x:implicitcoll_b_replica1] o.a.s.s.SolrIndexSearcher Opening [Searcher@2e4a98cd[implicitcoll_b_replica1] main]
   [junit4]   2> 2366373 INFO  (qtp767238905-14326) [n:127.0.0.1:63800_solr c:implicitcoll s:b  x:implicitcoll_b_replica1] o.a.s.r.ManagedResourceStorage Configured ZooKeeperStorageIO with znodeBase: /configs/conf
   [junit4]   2> 2366374 INFO  (qtp767238905-14326) [n:127.0.0.1:63800_solr c:implicitcoll s:b  x:implicitcoll_b_replica1] o.a.s.r.ManagedResourceStorage Loaded null at path _rest_managed.json using ZooKeeperStorageIO:path=/configs/conf
   [junit4]   2> 2366374 INFO  (qtp767238905-14326) [n:127.0.0.1:63800_solr c:implicitcoll s:b  x:implicitcoll_b_replica1] o.a.s.h.ReplicationHandler Commits will be reserved for  10000
   [junit4]   2> 2366375 INFO  (searcherExecutor-7626-thread-1-processing-n:127.0.0.1:63800_solr x:implicitcoll_b_replica1 s:b c:implicitcoll) [n:127.0.0.1:63800_solr c:implicitcoll s:b  x:implicitcoll_b_replica1] o.a.s.c.SolrCore [implicitcoll_b_replica1] Registered new searcher Searcher@2e4a98cd[implicitcoll_b_replica1] main{ExitableDirectoryReader(UninvertingDirectoryReader())}
   [junit4]   2> 2366375 INFO  (qtp767238905-14326) [n:127.0.0.1:63800_solr c:implicitcoll s:b  x:implicitcoll_b_replica1] o.a.s.u.UpdateLog Could not find max version in index or recent updates, using new clock 1559036263232700416
   [junit4]   2> 2366390 INFO  (qtp1433610066-14323) [n:127.0.0.1:63803_solr c:implicitcoll s:b  x:implicitcoll_b_replica4] o.a.s.u.UpdateHandler Using UpdateLog implementation: org.apache.solr.update.UpdateLog
   [junit4]   2> 2366390 INFO  (qtp1433610066-14323) [n:127.0.0.1:63803_solr c:implicitcoll s:b  x:implicitcoll_b_replica4] o.a.s.u.UpdateLog Initializing UpdateLog: dataDir=null defaultSyncLevel=FLUSH numRecordsToKeep=100 maxNumLogsToKeep=10 numVersionBuckets=65536
   [junit4]   2> 2366392 INFO  (qtp1433610066-14323) [n:127.0.0.1:63803_solr c:implicitcoll s:b  x:implicitcoll_b_replica4] o.a.s.u.CommitTracker Hard AutoCommit: disabled
   [junit4]   2> 2366392 INFO  (qtp1433610066-14323) [n:127.0.0.1:63803_solr c:implicitcoll s:b  x:implicitcoll_b_replica4] o.a.s.u.CommitTracker Soft AutoCommit: disabled
   [junit4]   2> 2366404 INFO  (qtp767238905-14320) [n:127.0.0.1:63800_solr c:implicitcoll s:a  x:implicitcoll_a_replica1] o.a.s.u.UpdateHandler Using UpdateLog implementation: org.apache.solr.update.UpdateLog
   [junit4]   2> 2366404 INFO  (qtp767238905-14320) [n:127.0.0.1:63800_solr c:implicitcoll s:a  x:implicitcoll_a_replica1] o.a.s.u.UpdateLog Initializing UpdateLog: dataDir=null defaultSyncLevel=FLUSH numRecordsToKeep=100 maxNumLogsToKeep=10 numVersionBuckets=65536
   [junit4]   2> 2366406 INFO  (qtp767238905-14320) [n:127.0.0.1:63800_solr c:implicitcoll s:a  x:implicitcoll_a_replica1] o.a.s.u.CommitTracker Hard AutoCommit: disabled
   [junit4]   2> 2366406 INFO  (qtp767238905-14320) [n:127.0.0.1:63800_solr c:implicitcoll s:a  x:implicitcoll_a_replica1] o.a.s.u.CommitTracker Soft AutoCommit: disabled
   [junit4]   2> 2366408 INFO  (qtp686265105-14298) [n:127.0.0.1:63798_solr c:implicitcoll s:c  x:implicitcoll_c_replica2] o.a.s.u.UpdateHandler Using UpdateLog implementation: org.apache.solr.update.UpdateLog
   [junit4]   2> 2366408 INFO  (qtp686265105-14298) [n:127.0.0.1:63798_solr c:implicitcoll s:c  x:implicitcoll_c_replica2] o.a.s.u.UpdateLog Initializing UpdateLog: dataDir=null defaultSyncLevel=FLUSH numRecordsToKeep=100 maxNumLogsToKeep=10 numVersionBuckets=65536
   [junit4]   2> 2366410 INFO  (qtp686265105-14298) [n:127.0.0.1:63798_solr c:implicitcoll s:c  x:implicitcoll_c_replica2] o.a.s.u.CommitTracker Hard AutoCommit: disabled
   [junit4]   2> 2366410 INFO  (qtp686265105-14298) [n:127.0.0.1:63798_solr c:implicitcoll s:c  x:implicitcoll_c_replica2] o.a.s.u.CommitTracker Soft AutoCommit: disabled
   [junit4]   2> 2366413 INFO  (qtp767238905-14326) [n:127.0.0.1:63800_solr c:implicitcoll s:b  x:implicitcoll_b_replica1] o.a.s.c.ShardLeaderElectionContext Waiting until we see more replicas up for shard b: total=4 found=1 timeoutin=9999ms
   [junit4]   2> 2366415 INFO  (zkCallback-2376-thread-1-processing-n:127.0.0.1:63803_solr) [n:127.0.0.1:63803_solr    ] o.a.s.c.c.ZkStateReader A cluster state change: [WatchedEvent state:SyncConnected type:NodeDataChanged path:/collections/implicitcoll/state.json] for collection [implicitcoll] has occurred - updating... (live nodes size: [4])
   [junit4]   2> 2366415 INFO  (zkCallback-2379-thread-1-processing-n:127.0.0.1:63799_solr) [n:127.0.0.1:63799_solr    ] o.a.s.c.c.ZkStateReader A cluster state change: [WatchedEvent state:SyncConnected type:NodeDataChanged path:/collections/implicitcoll/state.json] for collection [implicitcoll] has occurred - updating... (live nodes size: [4])
   [junit4]   2> 2366415 INFO  (zkCallback-2372-thread-2-processing-n:127.0.0.1:63800_solr) [n:127.0.0.1:63800_solr    ] o.a.s.c.c.ZkStateReader A cluster state change: [WatchedEvent state:SyncConnected type:NodeDataChanged path:/collections/implicitcoll/state.json] for collection [implicitcoll] has occurred - updating... (live nodes size: [4])
   [junit4]   2> 2366416 INFO  (zkCallback-2380-thread-1-processing-n:127.0.0.1:63798_solr) [n:127.0.0.1:63798_solr    ] o.a.s.c.c.ZkStateReader A cluster state change: [WatchedEvent state:SyncConnected type:NodeDataChanged path:/collections/implicitcoll/state.json] for collection [implicitcoll] has occurred - updating... (live nodes size: [4])
   [junit4]   2> 2366417 INFO  (qtp1433610066-14323) [n:127.0.0.1:63803_solr c:implicitcoll s:b  x:implicitcoll_b_replica4] o.a.s.s.SolrIndexSearcher Opening [Searcher@e2d3aa9[implicitcoll_b_replica4] main]
   [junit4]   2> 2366423 INFO  (qtp1433610066-14323) [n:127.0.0.1:63803_solr c:implicitcoll s:b  x:implicitcoll_b_replica4] o.a.s.r.ManagedResourceStorage Configured ZooKeeperStorageIO with znodeBase: /configs/conf
   [junit4]   2> 2366424 INFO  (qtp1433610066-14323) [n:127.0.0.1:63803_solr c:implicitcoll s:b  x:implicitcoll_b_replica4] o.a.s.r.ManagedResourceStorage Loaded null at path _rest_managed.json using ZooKeeperStorageIO:path=/configs/conf
   [junit4]   2> 2366424 INFO  (qtp1433610066-14323) [n:127.0.0.1:63803_solr c:implicitcoll s:b  x:implicitcoll_b_replica4] o.a.s.h.ReplicationHandler Commits will be reserved for  10000
   [junit4]   2> 2366424 INFO  (searcherExecutor-7635-thread-1-processing-n:127.0.0.1:63803_solr x:implicitcoll_b_replica4 s:b c:implicitcoll) [n:127.0.0.1:63803_solr c:implicitcoll s:b  x:implicitcoll_b_replica4] o.a.s.c.SolrCore [implicitcoll_b_replica4] Registered new searcher Searcher@e2d3aa9[implicitcoll_b_replica4] main{ExitableDirectoryReader(UninvertingDirectoryReader())}
   [junit4]   2> 2366424 INFO  (qtp1433610066-14323) [n:127.0.0.1:63803_solr c:implicitcoll s:b  x:implicitcoll_b_replica4] o.a.s.u.UpdateLog Could not find max version in index or recent updates, using new clock 1559036263284080640
   [junit4]   2> 2366430 INFO  (qtp767238905-14320) [n:127.0.0.1:63800_solr c:implicitcoll s:a  x:implicitcoll_a_replica1] o.a.s.s.SolrIndexSearcher Opening [Searcher@18334a14[implicitcoll_a_replica1] main]
   [junit4]   2> 2366433 INFO  (qtp767238905-14313) [n:127.0.0.1:63800_solr c:implicitcoll s:c  x:implicitcoll_c_replica1] o.a.s.u.UpdateHandler Using UpdateLog implementation: org.apache.solr.update.UpdateLog
   [junit4]   2> 2366433 INFO  (qtp767238905-14313) [n:127.0.0.1:63800_solr c:implicitcoll s:c  x:implicitcoll_c_replica1] o.a.s.u.UpdateLog Initializing UpdateLog: dataDir=null defaultSyncLevel=FLUSH numRecordsToKeep=100 maxNumLogsToKeep=10 numVersionBuckets=65536
   [junit4]   2> 2366435 INFO  (qtp767238905-14313) [n:127.0.0.1:63800_solr c:implicitcoll s:c  x:implicitcoll_c_replica1] o.a.s.u.CommitTracker Hard AutoCommit: disabled
   [junit4]   2> 2366435 INFO  (qtp767238905-14313) [n:127.0.0.1:63800_solr c:implicitcoll s:c  x:implicitcoll_c_replica1] o.a.s.u.CommitTracker Soft AutoCommit: disabled
   [junit4]   2> 2366440 INFO  (qtp1433610066-14317) [n:127.0.0.1:63803_solr c:implicitcoll s:c  x:implicitcoll_c_replica4] o.a.s.u.CommitTracker Hard AutoCommit: disabled
   [junit4]   2> 2366440 INFO  (qtp1433610066-14317) [n:127.0.0.1:63803_solr c:implicitcoll s:c  x:implicitcoll_c_replica4] o.a.s.u.CommitTracker Soft AutoCommit: disabled
   [junit4]   2> 2366451 INFO  (qtp1731405362-14316) [n:127.0.0.1:63799_solr c:implicitcoll s:c  x:implicitcoll_c_replica3] o.a.s.u.UpdateHandler Using UpdateLog implementation: org.apache.solr.update.UpdateLog
   [junit4]   2> 2366451 INFO  (qtp1731405362-14316) [n:127.0.0.1:63799_solr c:implicitcoll s:c  x:implicitcoll_c_replica3] o.a.s.u.UpdateLog Initializing UpdateLog: dataDir=null defaultSyncLevel=FLUSH numRecordsToKeep=100 maxNumLogsToKeep=10 numVersionBuckets=65536
   [junit4]   2> 2366451 INFO  (qtp1731405362-14315) [n:127.0.0.1:63799_solr c:implicitcoll s:a  x:implicitcoll_a_replica3] o.a.s.u.UpdateHandler Using UpdateLog implementation: org.apache.solr.update.UpdateLog
   [junit4]   2> 2366451 INFO  (qtp1731405362-14315) [n:127.0.0.1:63799_solr c:implicitcoll s:a  x:implicitcoll_a_replica3] o.a.s.u.UpdateLog Initializing UpdateLog: dataDir=null defaultSyncLevel=FLUSH numRecordsToKeep=100 maxNumLogsToKeep=10 numVersionBuckets=65536
   [junit4]   2> 2366451 INFO  (qtp1433610066-14309) [n:127.0.0.1:63803_solr c:implicitcoll s:a  x:implicitcoll_a_replica4] o.a.s.u.UpdateHandler Using UpdateLog implementation: org.apache.solr.update.UpdateLog
   [junit4]   2> 2366451 INFO  (qtp1433610066-14309) [n:127.0.0.1:63803_solr c:implicitcoll s:a  x:implicitcoll_a_replica4] o.a.s.u.UpdateLog Initializing UpdateLog: dataDir=null defaultSyncLevel=FLUSH numRecordsToKeep=100 maxNumLogsToKeep=10 numVersionBuckets=65536
   [junit4]   2> 2366456 INFO  (qtp1433610066-14309) [n:127.0.0.1:63803_solr c:implicitcoll s:a  x:implicitcoll_a_replica4] o.a.s.u.CommitTracker Hard AutoCommit: disabled
   [junit4]   2> 2366456 INFO  (qtp1433610066-14309) [n:127.0.0.1:63803_solr c:implicitcoll s:a  x:implicitcoll_a_replica4] o.a.s.u.CommitTracker Soft AutoCommit: disabled
   [junit4]   2> 2366457 INFO  (qtp1731405362-14316) [n:127.0.0.1:63799_solr c:implicitcoll s:c  x:implicitcoll_c_replica3] o.a.s.u.CommitTracker Hard AutoCommit: disabled
   [junit4]   2> 2366457 INFO  (qtp1731405362-14316) [n:127.0.0.1:63799_solr c:implicitcoll s:c  x:implicitcoll_c_replica3] o.a.s.u.CommitTracker Soft AutoCommit: disabled
   [junit4]   2> 2366459 INFO  (qtp686265105-14298) [n:127.0.0.1:63798_solr c:implicitcoll s:c  x:implicitcoll_c_replica2] o.a.s.s.SolrIndexSearcher Opening [Searcher@e9c2729[implicitcoll_c_replica2] main]
   [junit4]   2> 2366460 INFO  (qtp1731405362-14315) [n:127.0.0.1:63799_solr c:implicitcoll s:a  x:implicitcoll_a_replica3] o.a.s.u.CommitTracker Hard AutoCommit: disabled
   [junit4]   2> 2366460 INFO  (qtp1731405362-14315) [n:127.0.0.1:63799_solr c:implicitcoll s:a  x:implicitcoll_a_replica3] o.a.s.u.CommitTracker Soft AutoCommit: disabled
   [junit4]   2> 2366462 INFO  (qtp1433610066-14317) [n:127.0.0.1:63803_solr c:implicitcoll s:c  x:implicitcoll_c_replica4] o.a.s.s.SolrIndexSearcher Opening [Searcher@6d7baf29[implicitcoll_c_replica4] main]
   [junit4]   2> 2366464 INFO  (qtp1433610066-14317) [n:127.0.0.1:63803_solr c:implicitcoll s:c  x:implicitcoll_c_replica4] o.a.s.r.ManagedResourceStorage Configured ZooKeeperStorageIO with znodeBase: /configs/conf
   [junit4]   2> 2366465 INFO  (qtp1433610066-14317) [n:127.0.0.1:63803_solr c:implicitcoll s:c  x:implicitcoll_c_replica4] o.a.s.r.ManagedResourceStorage Loaded null at path _rest_managed.json using ZooKeeperStorageIO:path=/configs/conf
   [junit4]   2> 2366465 INFO  (qtp1433610066-14317) [n:127.0.0.1:63803_solr c:implicitcoll s:c  x:implicitcoll_c_replica4] o.a.s.h.ReplicationHandler Commits will be reserved for  10000
   [junit4]   2> 2366465 INFO  (searcherExecutor-7627-thread-1-processing-n:127.0.0.1:63803_solr x:implicitcoll_c_replica4 s:c c:implicitcoll) [n:127.0.0.1:63803_solr c:implicitcoll s:c  x:implicitcoll_c_replica4] o.a.s.c.SolrCore [implicitcoll_c_replica4] Registered new searcher Searcher@6d7baf29[implicitcoll_c_replica4] main{ExitableDirectoryReader(UninvertingDirectoryReader())}
   [junit4]   2> 2366465 INFO  (qtp1433610066-14317) [n:127.0.0.1:63803_solr c:implicitcoll s:c  x:implicitcoll_c_replica4] o.a.s.u.UpdateLog Could not find max version in index or recent updates, using new clock 1559036263327072256
   [junit4]   2> 2366466 INFO  (qtp686265105-14302) [n:127.0.0.1:63798_solr c:implicitcoll s:b  x:implicitcoll_b_replica2] o.a.s.u.UpdateHandler Using UpdateLog implementation: org.apache.solr.update.UpdateLog
   [junit4]   2> 2366466 INFO  (qtp686265105-14302) [n:127.0.0.1:63798_solr c:implicitcoll s:b  x:implicitcoll_b_replica2] o.a.s.u.UpdateLog Initializing UpdateLog: dataDir=null defaultSyncLevel=FLUSH numRecordsToKeep=100 maxNumLogsToKeep=10 numVersionBuckets=65536
   [junit4]   2> 2366470 INFO  (qtp686265105-14302) [n:127.0.0.1:63798_solr c:implicitcoll s:b  x:implicitcoll_b_replica2] o.a.s.u.CommitTracker Hard AutoCommit: disabled
   [junit4]   2> 2366471 INFO  (qtp686265105-14302) [n:127.0.0.1:63798_solr c:implicitcoll s:b  x:implicitcoll_b_replica2] o.a.s.u.CommitTracker Soft AutoCommit: disabled
   [junit4]   2> 2366471 INFO  (qtp1731405362-14314) [n:127.0.0.1:63799_solr c:implicitcoll s:b  x:implicitcoll_b_replica3] o.a.s.u.UpdateHandler Using UpdateLog implementation: org.apache.solr.update.UpdateLog
   [junit4]   2> 2366471 INFO  (qtp1731405362-14314) [n:127.0.0.1:63799_solr c:implicitcoll s:b  x:implicitcoll_b_replica3] o.a.s.u.UpdateLog Initializing UpdateLog: dataDir=null defaultSyncLevel=FLUSH numRecordsToKeep=100 maxNumLogsToKeep=10 numVersionBuckets=65536
   [junit4]   2> 2366473 INFO  (qtp686265105-14298) [n:127.0.0.1:63798_solr c:implicitcoll s:c  x:implicitcoll_c_replica2] o.a.s.r.ManagedResourceStorage Configured ZooKeeperStorageIO with znodeBase: /configs/conf
   [junit4]   2> 2366473 INFO  (qtp1731405362-14314) [n:127.0.0.1:63799_solr c:implicitcoll s:b  x:implicitcoll_b_replica3] o.a.s.u.CommitTracker Hard AutoCommit: disabled
   [junit4]   2> 2366473 INFO  (qtp1731405362-14314) [n:127.0.0.1:63799_solr c:implicitcoll s:b  x:implicitcoll_b_replica3] o.a.s.u.CommitTracker Soft AutoCommit: disabled
   [junit4]   2> 2366474 INFO  (qtp767238905-14320) [n:127.0.0.1:63800_solr c:implicitcoll s:a  x:implicitcoll_a_replica1] o.a.s.r.ManagedResourceStorage Configured ZooKeeperStorageIO with znodeBase: /configs/conf
   [junit4]   2> 2366474 INFO  (qtp686265105-14298) [n:127.0.0.1:63798_solr c:implicitcoll s:c  x:implicitcoll_c_replica2] o.a.s.r.ManagedResourceStorage Loaded null at path _rest_managed.json using ZooKeeperStorageIO:path=/configs/conf
   [junit4]   2> 2366475 INFO  (qtp686265105-14298) [n:127.0.0.1:63798_solr c:implicitcoll s:c  x:implicitcoll_c_replica2] o.a.s.h.ReplicationHandler Commits will be reserved for  10000
   [junit4]   2> 2366475 INFO  (searcherExecutor-7633-thread-1-processing-n:127.0.0.1:63798_solr x:implicitcoll_c_replica2 s:c c:implicitcoll) [n:127.0.0.1:63798_solr c:implicitcoll s:c  x:implicitcoll_c_replica2] o.a.s.c.SolrCore [implicitcoll_c_replica2] Registered new searcher Searcher@e9c2729[implicitcoll_c_replica2] main{ExitableDirectoryReader(UninvertingDirectoryReader())}
   [junit4]   2> 2366475 INFO  (qtp686265105-14298) [n:127.0.0.1:63798_solr c:implicitcoll s:c  x:implicitcoll_c_replica2] o.a.s.u.UpdateLog Could not find max version in index or recent updates, using new clock 1559036263337558016
   [junit4]   2> 2366476 INFO  (qtp1433610066-14317) [n:127.0.0.1:63803_solr c:implicitcoll s:c  x:implicitcoll_c_replica4] o.a.s.c.ShardLeaderElectionContext Waiting until we see more replicas up for shard c: total=4 found=1 timeoutin=9999ms
   [junit4]   2> 2366476 INFO  (qtp767238905-14313) [n:127.0.0.1:63800_solr c:implicitcoll s:c  x:implicitcoll_c_replica1] o.a.s.s.SolrIndexSearcher Opening [Searcher@311135db[implicitcoll_c_replica1] main]
   [junit4]   2> 2366478 INFO  (qtp1731405362-14316) [n:127.0.0.1:63799_solr c:implicitcoll s:c  x:implicitcoll_c_replica3] o.a.s.s.SolrIndexSearcher Opening [Searcher@421522b2[implicitcoll_c_replica3] main]
   [junit4]   2> 2366479 INFO  (qtp1731405362-14316) [n:127.0.0.1:63799_solr c:implicitcoll s:c  x:implicitcoll_c_replica3] o.a.s.r.ManagedResourceStorage Configured ZooKeeperStorageIO with znodeBase: /configs/conf
   [junit4]   2> 2366480 INFO  (qtp1731405362-14316) [n:127.0.0.1:63799_solr c:implicitcoll s:c  x:implicitcoll_c_replica3] o.a.s.r.ManagedResourceStorage Loaded null at path _rest_managed.json using ZooKeeperStorageIO:path=/configs/conf
   [junit4]   2> 2366480 INFO  (qtp1731405362-14316) [n:127.0.0.1:63799_solr c:implicitcoll s:c  x:implicitcoll_c_replica3] o.a.s.h.ReplicationHandler Commits will be reserved for  10000
   [junit4]   2> 2366480 INFO  (qtp1731405362-14316) [n:127.0.0.1:63799_solr c:implicitcoll s:c  x:implicitcoll_c_replica3] o.a.s.u.UpdateLog Could not find max version in index or recent updates, using new clock 1559036263342800896
   [junit4]   2> 2366480 INFO  (searcherExecutor-7634-thread-1-processing-n:127.0.0.1:63799_solr x:implicitcoll_c_replica3 s:c c:implicitcoll) [n:127.0.0.1:63799_solr c:implicitcoll s:c  x:implicitcoll_c_replica3] o.a.s.c.SolrCore [implicitcoll_c_replica3] Registered new searcher Searcher@421522b2[implicitcoll_c_replica3] main{ExitableDirectoryReader(UninvertingDirectoryReader())}
   [junit4]   2> 2366481 INFO  (qtp1433610066-14309) [n:127.0.0.1:63803_solr c:implicitcoll s:a  x:implicitcoll_a_replica4] o.a.s.s.SolrIndexSearcher Opening [Searcher@30551271[implicitcoll_a_replica4] main]
   [junit4]   2> 2366482 INFO  (qtp686265105-14303) [n:127.0.0.1:63798_solr c:implicitcoll s:a  x:implicitcoll_a_replica2] o.a.s.u.UpdateHandler Using UpdateLog implementation: org.apache.solr.update.UpdateLog
   [junit4]   2> 2366482 INFO  (qtp686265105-14303) [n:127.0.0.1:63798_solr c:implicitcoll s:a  x:implicitcoll_a_replica2] o.a.s.u.UpdateLog Initializing UpdateLog: dataDir=null defaultSyncLevel=FLUSH numRecordsToKeep=100 maxNumLogsToKeep=10 numVersionBuckets=65536
   [junit4]   2> 2366484 INFO  (qtp1433610066-14309) [n:127.0.0.1:63803_solr c:implicitcoll s:a  x:implicitcoll_a_replica4] o.a.s.r.ManagedResourceStorage Configured ZooKeeperStorageIO with znodeBase: /configs/conf
   [junit4]   2> 2366485 INFO  (qtp1433610066-14309) [n:127.0.0.1:63803_solr c:implicitcoll s:a  x:implicitcoll_a_replica4] o.a.s.r.ManagedResourceStorage Loaded null at path _rest_managed.json using ZooKeeperStorageIO:path=/configs/conf
   [junit4]   2> 2366485 INFO  (qtp1433610066-14309) [n:127.0.0.1:63803_solr c:implicitcoll s:a  x:implicitcoll_a_replica4] o.a.s.h.ReplicationHandler Commits will be reserved for  10000
   [junit4]   2> 2366485 INFO  (qtp1433610066-14309) [n:127.0.0.1:63803_solr c:implicitcoll s:a  x:implicitcoll_a_replica4] o.a.s.u.UpdateLog Could not find max version in index or recent updates, using new clock 1559036263348043776
   [junit4]   2> 2366485 INFO  (searcherExecutor-7632-thread-1-processing-n:127.0.0.1:63803_solr x:implicitcoll_a_replica4 s:a c:implicitcoll) [n:127.0.0.1:63803_solr c:implicitcoll s:a  x:implicitcoll_a_replica4] o.a.s.c.SolrCore [implicitcoll_a_replica4] Registered new searcher Searcher@30551271[implicitcoll_a_replica4] main{ExitableDirectoryReader(UninvertingDirectoryReader())}
   [junit4]   2> 2366486 INFO  (qtp686265105-14303) [n:127.0.0.1:63798_solr c:implicitcoll s:a  x:implicitcoll_a_replica2] o.a.s.u.CommitTracker Hard AutoCommit: disabled
   [junit4]   2> 2366486 INFO  (qtp686265105-14303) [n:127.0.0.1:63798_solr c:implicitcoll s:a  x:implicitcoll_a_replica2] o.a.s.u.CommitTracker Soft AutoCommit: disabled
   [junit4]   2> 2366487 INFO  (qtp767238905-14313) [n:127.0.0.1:63800_solr c:implicitcoll s:c  x:implicitcoll_c_replica1] o.a.s.r.ManagedResourceStorage Configured ZooKeeperStorageIO with znodeBase: /configs/conf
   [junit4]   2> 2366487 INFO  (qtp767238905-14320) [n:127.0.0.1:63800_solr c:implicitcoll s:a  x:implicitcoll_a_replica1] o.a.s.r.ManagedResourceStorage Loaded null at path _rest_managed.json using ZooKeeperStorageIO:path=/configs/conf
   [junit4]   2> 2366487 INFO  (qtp767238905-14320) [n:127.0.0.1:63800_solr c:implicitcoll s:a  x:implicitcoll_a_replica1] o.a.s.h.ReplicationHandler Commits will be reserved for  10000
   [junit4]   2> 2366488 INFO  (qtp767238905-14313) [n:127.0.0.1:63800_solr c:implicitcoll s:c  x:implicitcoll_c_replica1] o.a.s.r.ManagedResourceStorage Loaded null at path _rest_managed.json using ZooKeeperStorageIO:path=/configs/conf
   [junit4]   2> 2366488 INFO  (qtp767238905-14313) [n:127.0.0.1:63800_solr c:implicitcoll s:c  x:implicitcoll_c_replica1] o.a.s.h.ReplicationHandler Commits will be reserved for  10000
   [junit4]   2> 2366488 INFO  (qtp767238905-14313) [n:127.0.0.1:63800_solr c:implicitcoll s:c  x:implicitcoll_c_replica1] o.a.s.u.UpdateLog Could not find max version in index or recent updates, using new clock 1559036263351189504
   [junit4]   2> 2366488 INFO  (searcherExecutor-7628-thread-1-processing-n:127.0.0.1:63800_solr x:implicitcoll_c_replica1 s:c c:implicitcoll) [n:127.0.0.1:63800_solr c:implicitcoll s:c  x:implicitcoll_c_replica1] o.a.s.c.SolrCore [implicitcoll_c_replica1] Registered new searcher Searcher@311135db[implicitcoll_c_replica1] main{ExitableDirectoryReader(UninvertingDirectoryReader())}
   [junit4]   2> 2366490 INFO  (qtp1731405362-14315) [n:127.0.0.1:63799_solr c:implicitcoll s:a  x:implicitcoll_a_replica3] o.a.s.s.SolrIndexSearcher Opening [Searcher@7730a229[implicitcoll_a_replica3] main]
   [junit4]   2> 2366492 INFO  (qtp1731405362-14315) [n:127.0.0.1:63799_solr c:implicitcoll s:a  x:implicitcoll_a_replica3] o.a.s.r.ManagedResourceStorage Configured ZooKeeperStorageIO with znodeBase: /configs/conf
   [junit4]   2> 2366492 INFO  (qtp686265105-14302) [n:127.0.0.1:63798_solr c:implicitcoll s:b  x:implicitcoll_b_replica2] o.a.s.s.SolrIndexSearcher Opening [Searcher@4a039fb1[implicitcoll_b_replica2] main]
   [junit4]   2> 2366493 INFO  (qtp1731405362-14315) [n:127.0.0.1:63799_solr c:implicitcoll s:a  x:implicitcoll_a_replica3] o.a.s.r.ManagedResourceStorage Loaded null at path _rest_managed.json using ZooKeeperStorageIO:path=/configs/conf
   [junit4]   2> 2366493 INFO  (qtp1731405362-14315) [n:127.0.0.1:63799_solr c:implicitcoll s:a  x:implicitcoll_a_replica3] o.a.s.h.ReplicationHandler Commits will be reserved for  10000
   [junit4]   2> 2366493 INFO  (searcherExecutor-7631-thread-1-processing-n:127.0.0.1:63799_solr x:implicitcoll_a_replica3 s:a c:implicitcoll) [n:127.0.0.1:63799_solr c:implicitcoll s:a  x:implicitcoll_a_replica3] o.a.s.c.SolrCore [implicitcoll_a_replica3] Registered new searcher Searcher@7730a229[implicitcoll_a_replica3] main{ExitableDirectoryReader(UninvertingDirectoryReader())}
   [junit4]   2> 2366493 INFO  (qtp1731405362-14315) [n:127.0.0.1:63799_solr c:implicitcoll s:a  x:implicitcoll_a_replica3] o.a.s.u.UpdateLog Could not find max version in index or recent updates, using new clock 1559036263356432384
   [junit4]   2> 2366494 INFO  (qtp686265105-14302) [n:127.0.0.1:63798_solr c:implicitcoll s:b  x:implicitcoll_b_replica2] o.a.s.r.ManagedResourceStorage Configured ZooKeeperStorageIO with znodeBase: /configs/conf
   [junit4]   2> 2366494 INFO  (qtp1731405362-14314) [n:127.0.0.1:63799_solr c:implicitcoll s:b  x:implicitcoll_b_replica3] o.a.s.s.SolrIndexSearcher Opening [Searcher@7fe359a4[implicitcoll_b_replica3] main]
   [junit4]   2> 2366495 INFO  (qtp686265105-14302) [n:127.0.0.1:63798_solr c:implicitcoll s:b  x:implicitcoll_b_replica2] o.a.s.r.ManagedResourceStorage Loaded null at path _rest_managed.json using ZooKeeperStorageIO:path=/configs/conf
   [junit4]   2> 2366495 INFO  (qtp686265105-14302) [n:127.0.0.1:63798_solr c:implicitcoll s:b  x:implicitcoll_b_replica2] o.a.s.h.ReplicationHandler Commits will be reserved for  10000
   [junit4]   2> 2366495 INFO  (qtp686265105-14302) [n:127.0.0.1:63798_solr c:implicitcoll s:b  x:implicitcoll_b_replica2] o.a.s.u.UpdateLog Could not find max version in index or recent updates, using new clock 1559036263358529536
   [junit4]   2> 2366496 INFO  (qtp1731405362-14314) [n:127.0.0.1:63799_solr c:implicitcoll s:b  x:implicitcoll_b_replica3] o.a.s.r.ManagedResourceStorage Configured ZooKeeperStorageIO with znodeBase: /configs/conf
   [junit4]   2> 2366495 INFO  (searcherExecutor-7637-thread-1-processing-n:127.0.0.1:63798_solr x:implicitcoll_b_replica2 s:b c:implicitcoll) [n:127.0.0.1:63798_solr c:implicitcoll s:b  x:implicitcoll_b_replica2] o.a.s.c.SolrCore [implicitcoll_b_replica2] Registered new searcher Searcher@4a039fb1[implicitcoll_b_replica2] main{ExitableDirectoryReader(UninvertingDirectoryReader())}
   [junit4]   2> 2366496 INFO  (qtp1731405362-14314) [n:127.0.0.1:63799_solr c:implicitcoll s:b  x:implicitcoll_b_replica3] o.a.s.r.ManagedResourceStorage Loaded null at path _rest_managed.json using ZooKeeperStorageIO:path=/configs/conf
   [junit4]   2> 2366497 INFO  (qtp1731405362-14314) [n:127.0.0.1:63799_solr c:implicitcoll s:b  x:implicitcoll_b_replica3] o.a.s.h.ReplicationHandler Commits will be reserved for  10000
   [junit4]   2> 2366497 INFO  (searcherExecutor-7636-thread-1-processing-n:127.0.0.1:63799_solr x:implicitcoll_b_replica3 s:b c:implicitcoll) [n:127.0.0.1:63799_solr c:implicitcoll s:b  x:implicitcoll_b_replica3] o.a.s.c.SolrCore [implicitcoll_b_replica3] Registered new searcher Searcher@7fe359a4[implicitcoll_b_replica3] main{ExitableDirectoryReader(UninvertingDirectoryReader())}
   [junit4]   2> 2366497 INFO  (qtp1731405362-14314) [n:127.0.0.1:63799_solr c:implicitcoll s:b  x:implicitcoll_b_replica3] o.a.s.u.UpdateLog Could not find max version in index or recent updates, using new clock 1559036263360626688
   [junit4]   2> 2366501 INFO  (qtp1433610066-14309) [n:127.0.0.1:63803_solr c:implicitcoll s:a  x:implicitcoll_a_replica4] o.a.s.c.ShardLeaderElectionContext Waiting until we see more replicas up for shard a: total=4 found=1 timeoutin=9998ms
   [junit4]   2> 2366503 INFO  (searcherExecutor-7629-thread-1-processing-n:127.0.0.1:63800_solr x:implicitcoll_a_replica1 s:a c:implicitcoll) [n:127.0.0.1:63800_solr c:implicitcoll s:a  x:implicitcoll_a_replica1] o.a.s.c.SolrCore [implicitcoll_a_replica1] Registered new searcher Searcher@18334a14[implicitcoll_a_replica1] main{ExitableDirectoryReader(UninvertingDirectoryReader())}
   [junit4]   2> 2366503 INFO  (qtp767238905-14320) [n:127.0.0.1:63800_solr c:implicitcoll s:a  x:implicitcoll_a_replica1] o.a.s.u.UpdateLog Could not find max version in index or recent updates, using new clock 1559036263366918144
   [junit4]   2> 2366507 INFO  (qtp686265105-14303) [n:127.0.0.1:63798_solr c:implicitcoll s:a  x:implicitcoll_a_replica2] o.a.s.s.SolrIndexSearcher Opening [Searcher@353dc10e[implicitcoll_a_replica2] main]
   [junit4]   2> 2366508 INFO  (qtp686265105-14303) [n:127.0.0.1:63798_solr c:implicitcoll s:a  x:implicitcoll_a_replica2] o.a.s.r.ManagedResourceStorage Configured ZooKeeperStorageIO with znodeBase: /configs/conf
   [junit4]   2> 2366509 INFO  (qtp686265105-14303) [n:127.0.0.1:63798_solr c:implicitcoll s:a  x:implicitcoll_a_replica2] o.a.s.r.ManagedResourceStorage Loaded null at path _rest_managed.json using ZooKeeperStorageIO:path=/configs/conf
   [junit4]   2> 2366509 INFO  (qtp686265105-14303) [n:127.0.0.1:63798_solr c:implicitcoll s:a  x:implicitcoll_a_replica2] o.a.s.h.ReplicationHandler Commits will be reserved for  10000
   [junit4]   2> 2366509 INFO  (qtp686265105-14303) [n:127.0.0.1:63798_solr c:implicitcoll s:a  x:implicitcoll_a_replica2] o.a.s.u.UpdateLog Could not find max version in index or recent updates, using new clock 1559036263373209600
   [junit4]   2> 2366509 INFO  (searcherExecutor-7630-thread-1-processing-n:127.0.0.1:63798_solr x:implicitcoll_a_replica2 s:a c:implicitcoll) [n:127.0.0.1:63798_solr c:implicitcoll s:a  x:implicitcoll_a_replica2] o.a.s.c.SolrCore [implicitcoll_a_replica2] Registered new searcher Searcher@353dc10e[implicitcoll_a_replica2] main{ExitableDirectoryReader(UninvertingDirectoryReader())}
   [junit4]   2> 2366600 INFO  (zkCallback-2379-thread-1-processing-n:127.0.0.1:63799_solr) [n:127.0.0.1:63799_solr    ] o.a.s.c.c.ZkStateReader A cluster state change: [WatchedEvent state:SyncConnected type:NodeDataChanged path:/collections/implicitcoll/state.json] for collection [implicitcoll] has occurred - updating... (live nodes size: [4])
   [junit4]   2> 2366600 INFO  (zkCallback-2380-thread-1-processing-n:127.0.0.1:63798_solr) [n:127.0.0.1:63798_solr    ] o.a.s.c.c.ZkStateReader A cluster state change: [WatchedEvent state:SyncConnected type:NodeDataChanged path:/collections/implicitcoll/state.json] for collection [implicitcoll] has occurred - updating... (live nodes size: [4])
   [junit4]   2> 2366600 INFO  (zkCallback-2372-thread-2-processing-n:127.0.0.1:63800_solr) [n:127.0.0.1:63800_solr    ] o.a.s.c.c.ZkStateReader A cluster state change: [WatchedEvent state:SyncConnected type:NodeDataChanged path:/collections/implicitcoll/state.json] for collection [implicitcoll] has occurred - updating... (live nodes size: [4])
   [junit4]   2> 2366600 INFO  (zkCallback-2376-thread-1-processing-n:127.0.0.1:63803_solr) [n:127.0.0.1:63803_solr    ] o.a.s.c.c.ZkStateReader A cluster state change: [WatchedEvent state:SyncConnected type:NodeDataChanged path:/collections/implicitcoll/state.json] for collection [implicitcoll] has occurred - updating... (live nodes size: [4])
   [junit4]   2> 2366922 INFO  (qtp767238905-14326) [n:127.0.0.1:63800_solr c:implicitcoll s:b  x:implicitcoll_b_replica1] o.a.s.c.ShardLeaderElectionContext Enough replicas found to continue.
   [junit4]   2> 2366922 INFO  (qtp767238905-14326) [n:127.0.0.1:63800_solr c:implicitcoll s:b  x:implicitcoll_b_replica1] o.a.s.c.ShardLeaderElectionContext I may be the new leader - try and sync
   [junit4]   2> 2366922 INFO  (qtp767238905-14326) [n:127.0.0.1:63800_solr c:implicitcoll s:b  x:implicitcoll_b_replica1] o.a.s.c.SyncStrategy Sync replicas to http://127.0.0.1:63800/solr/implicitcoll_b_replica1/
   [junit4]   2> 2366923 INFO  (qtp767238905-14326) [n:127.0.0.1:63800_solr c:implicitcoll s:b  x:implicitcoll_b_replica1] o.a.s.u.PeerSync PeerSync: core=implicitcoll_b_replica1 url=http://127.0.0.1:63800/solr START replicas=[http://127.0.0.1:63799/solr/implicitcoll_b_replica3/, http://127.0.0.1:63803/solr/implicitcoll_b_replica4/, http://127.0.0.1:63798/solr/implicitcoll_b_replica2/] nUpdates=100
   [junit4]   2> 2366924 INFO  (qtp767238905-14326) [n:127.0.0.1:63800_solr c:implicitcoll s:b  x:implicitcoll_b_replica1] o.a.s.u.PeerSync PeerSync: core=implicitcoll_b_replica1 url=http://127.0.0.1:63800/solr DONE.  We have no versions.  sync failed.
   [junit4]   2> 2366926 INFO  (qtp1731405362-14319) [n:127.0.0.1:63799_solr c:implicitcoll s:b r:core_node1 x:implicitcoll_b_replica3] o.a.s.c.S.Request [implicitcoll_b_replica3]  webapp=/solr path=/get params={distrib=false&qt=/get&fingerprint=false&getVersions=100&wt=javabin&version=2} status=0 QTime=0
   [junit4]   2> 2366926 INFO  (qtp686265105-14304) [n:127.0.0.1:63798_solr c:implicitcoll s:b r:core_node8 x:implicitcoll_b_replica2] o.a.s.c.S.Request [implicitcoll_b_replica2]  webapp=/solr path=/get params={distrib=false&qt=/get&fingerprint=false&getVersions=100&wt=javabin&version=2} status=0 QTime=0
   [junit4]   2> 2366926 INFO  (qtp1433610066-14324) [n:127.0.0.1:63803_solr c:implicitcoll s:b r:core_node5 x:implicitcoll_b_replica4] o.a.s.c.S.Request [implicitcoll_b_replica4]  webapp=/solr path=/get params={distrib=false&qt=/get&fingerprint=false&getVersions=100&wt=javabin&version=2} status=0 QTime=0
   [junit4]   2> 2366927 INFO  (qtp767238905-14326) [n:127.0.0.1:63800_solr c:implicitcoll s:b  x:implicitcoll_b_replica1] o.a.s.c.SyncStrategy Leader's attempt to sync with shard failed, moving to the next candidate
   [junit4]   2> 2366927 INFO  (qtp767238905-14326) [n:127.0.0.1:63800_solr c:implicitcoll s:b  x:implicitcoll_b_replica1] o.a.s.c.ShardLeaderElectionContext We failed sync, but we have no versions - we can't sync in that case - we were active before, so become leader anyway
   [junit4]   2> 2366935 INFO  (qtp767238905-14326) [n:127.0.0.1:63800_solr c:implicitcoll s:b  x:implicitcoll_b_replica1] o.a.s.c.ShardLeaderElectionContext I am the new leader: http://127.0.0.1:63800/solr/implicitcoll_b_replica1/ b
   [junit4]   2> 2366977 INFO  (qtp1433610066-14317) [n:127.0.0.1:63803_solr c:implicitcoll s:c  x:implicitcoll_c_replica4] o.a.s.c.ShardLeaderElectionContext Enough replicas found to continue.
   [junit4]   2> 2366977 INFO  (qtp1433610066-14317) [n:127.0.0.1:63803_solr c:implicitcoll s:c  x:implicitcoll_c_replica4] o.a.s.c.ShardLeaderElectionContext I may be the new leader - try and sync
   [junit4]   2> 2366977 INFO  (qtp1433610066-14317) [n:127.0.0.1:63803_solr c:implicitcoll s:c  x:implicitcoll_c_replica4] o.a.s.c.SyncStrategy Sync replicas to http://127.0.0.1:63803/solr/implicitcoll_c_replica4/
   [junit4]   2> 2366978 INFO  (qtp1433610066-14317) [n:127.0.0.1:63803_solr c:implicitcoll s:c  x:implicitcoll_c_replica4] o.a.s.u.PeerSync PeerSync: core=implicitcoll_c_replica4 url=http://127.0.0.1:63803/solr START replicas=[http://127.0.0.1:63799/solr/implicitcoll_c_replica3/, http://127.0.0.1:63798/solr/implicitcoll_c_replica2/, http://127.0.0.1:63800/solr/implicitcoll_c_replica1/] nUpdates=100
   [junit4]   2> 2366979 INFO  (qtp1433610066-14317) [n:127.0.0.1:63803_solr c:implicitcoll s:c  x:implicitcoll_c_replica4] o.a.s.u.PeerSync PeerSync: core=implicitcoll_c_replica4 url=http://127.0.0.1:63803/solr DONE.  We have no versions.  sync failed.
   [junit4]   2> 2366984 INFO  (qtp686265105-14304) [n:127.0.0.1:63798_solr c:implicitcoll s:c r:core_node7 x:implicitcoll_c_replica2] o.a.s.c.S.Request [implicitcoll_c_replica2]  webapp=/solr path=/get params={distrib=false&qt=/get&fingerprint=false&getVersions=100&wt=javabin&version=2} status=0 QTime=0
   [junit4]   2> 2366984 INFO  (qtp767238905-14327) [n:127.0.0.1:63800_solr c:implicitcoll s:c r:core_node10 x:implicitcoll_c_replica1] o.a.s.c.S.Request [implicitcoll_c_replica1]  webapp=/solr path=/get params={distrib=false&qt=/get&fingerprint=false&getVersions=100&wt=javabin&version=2} status=0 QTime=0
   [junit4]   2> 2366986 INFO  (qtp1731405362-14321) [n:127.0.0.1:63799_solr c:implicitcoll s:c r:core_node4 x:implicitcoll_c_replica3] o.a.s.c.S.Request [implicitcoll_c_replica3]  webapp=/solr path=/get params={distrib=false&qt=/get&fingerprint=false&getVersions=100&wt=javabin&version=2} status=0 QTime=0
   [junit4]   2> 2366986 INFO  (qtp1433610066-14317) [n:127.0.0.1:63803_solr c:implicitcoll s:c  x:implicitcoll_c_replica4] o.a.s.c.SyncStrategy Leader's attempt to sync with shard failed, moving to the next candidate
   [junit4]   2> 2366986 INFO  (qtp1433610066-14317) [n:127.0.0.1:63803_solr c:implicitcoll s:c  x:implicitcoll_c_replica4] o.a.s.c.ShardLeaderElectionContext We failed sync, but we have no versions - we can't sync in that case - we were active before, so become leader anyway
   [junit4]   2> 2366998 INFO  (qtp1433610066-14317) [n:127.0.0.1:63803_solr c:implicitcoll s:c  x:implicitcoll_c_replica4] o.a.s.c.ShardLeaderElectionContext I am the new leader: http://127.0.0.1:63803/solr/implicitcoll_c_replica4/ c
   [junit4]   2> 2367002 INFO  (qtp1433610066-14309) [n:127.0.0.1:63803_solr c:implicitcoll s:a  x:implicitcoll_a_replica4] o.a.s.c.ShardLeaderElectionContext Enough replicas found to continue.
   [junit4]   2> 2367003 INFO  (qtp1433610066-14309) [n:127.0.0.1:63803_solr c:implicitcoll s:a  x:implicitcoll_a_replica4] o.a.s.c.ShardLeaderElectionContext I may be the new leader - try and sync
   [junit4]   2> 2367003 INFO  (qtp1433610066-14309) [n:127.0.0.1:63803_solr c:implicitcoll s:a  x:implicitcoll_a_replica4] o.a.s.c.SyncStrategy Sync replicas to http://127.0.0.1:63803/solr/implicitcoll_a_replica4/
   [junit4]   2> 2367003 INFO  (qtp1433610066-14309) [n:127.0.0.1:63803_solr c:implicitcoll s:a  x:implicitcoll_a_replica4] o.a.s.u.PeerSync PeerSync: core=implicitcoll_a_replica4 url=http://127.0.0.1:63803/solr START replicas=[http://127.0.0.1:63799/solr/implicitcoll_a_replica3/, http://127.0.0.1:63798/solr/implicitcoll_a_replica2/, http://127.0.0.1:63800/solr/implicitcoll_a_replica1/] nUpdates=100
   [junit4]   2> 2367004 INFO  (qtp1433610066-14309) [n:127.0.0.1:63803_solr c:implicitcoll s:a  x:implicitcoll_a_replica4] o.a.s.u.PeerSync PeerSync: core=implicitcoll_a_replica4 url=http://127.0.0.1:63803/solr DONE.  We have no versions.  sync failed.
   [junit4]   2> 2367004 INFO  (qtp1731405362-14305) [n:127.0.0.1:63799_solr c:implicitcoll s:a r:core_node2 x:implicitcoll_a_replica3] o.a.s.c.S.Request [implicitcoll_a_replica3]  webapp=/solr path=/get params={distrib=false&qt=/get&fingerprint=false&getVersions=100&wt=javabin&version=2} status=0 QTime=0
   [junit4]   2> 2367004 INFO  (qtp686265105-14304) [n:127.0.0.1:63798_solr c:implicitcoll s:a r:core_node9 x:implicitcoll_a_replica2] o.a.s.c.S.Request [implicitcoll_a_replica2]  webapp=/solr path=/get params={distrib=false&qt=/get&fingerprint=false&getVersions=100&wt=javabin&version=2} status=0 QTime=0
   [junit4]   2> 2367004 INFO  (qtp767238905-14327) [n:127.0.0.1:63800_solr c:implicitcoll s:a r:core_node11 x:implicitcoll_a_replica1] o.a.s.c.S.Request [implicitcoll_a_replica1]  webapp=/solr path=/get params={distrib=false&qt=/get&fingerprint=false&getVersions=100&wt=javabin&version=2} status=0 QTime=0
   [junit4]   2> 2367005 INFO  (qtp1433610066-14309) [n:127.0.0.1:63803_solr c:implicitcoll s:a  x:implicitcoll_a_replica4] o.a.s.c.SyncStrategy Leader's attempt to sync with shard failed, moving to the next candidate
   [junit4]   2> 2367005 INFO  (qtp1433610066-14309) [n:127.0.0.1:63803_solr c:implicitcoll s:a  x:implicitcoll_a_replica4] o.a.s.c.ShardLeaderElectionContext We failed sync, but we have no versions - we can't sync in that case - we were active before, so become leader anyway
   [junit4]   2> 2367015 INFO  (qtp1433610066-14309) [n:127.0.0.1:63803_solr c:implicitcoll s:a  x:implicitcoll_a_replica4] o.a.s.c.ShardLeaderElectionContext I am the new leader: http://127.0.0.1:63803/solr/implicitcoll_a_replica4/ a
   [junit4]   2> 2367123 INFO  (zkCallback-2376-thread-1-processing-n:127.0.0.1:63803_solr) [n:127.0.0.1:63803_solr    ] o.a.s.c.c.ZkStateReader A cluster state change: [WatchedEvent state:SyncConnected type:NodeDataChanged path:/collections/implicitcoll/state.json] for collection [implicitcoll] has occurred - updating... (live nodes size: [4])
   [junit4]   2> 2367123 INFO  (zkCallback-2372-thread-3-processing-n:127.0.0.1:63800_solr) [n:127.0.0.1:63800_solr    ] o.a.s.c.c.ZkStateReader A cluster state change: [WatchedEvent state:SyncConnected type:NodeDataChanged path:/collections/implicitcoll/state.json] for collection [implicitcoll] has occurred - updating... (live nodes size: [4])
   [junit4]   2> 2367123 INFO  (zkCallback-2380-thread-1-processing-n:127.0.0.1:63798_solr) [n:127.0.0.1:63798_solr    ] o.a.s.c.c.ZkStateReader A cluster state change: [WatchedEvent state:SyncConnected type:NodeDataChanged path:/collections/implicitcoll/state.json] for collection [implicitcoll] has occurred - updating... (live nodes size: [4])
   [junit4]   2> 2367123 INFO  (zkCallback-2379-thread-1-processing-n:127.0.0.1:63799_solr) [n:127.0.0.1:63799_solr    ] o.a.s.c.c.ZkStateReader A cluster state change: [WatchedEvent state:SyncConnected type:NodeDataChanged path:/collections/implicitcoll/state.json] for collection [implicitcoll] has occurred - updating... (live nodes size: [4])
   [junit4]   2> 2367149 INFO  (qtp767238905-14326) [n:127.0.0.1:63800_solr c:implicitcoll s:b  x:implicitcoll_b_replica1] o.a.s.c.ZkController I am the leader, no recovery necessary
   [junit4]   2> 2367154 INFO  (qtp767238905-14326) [n:127.0.0.1:63800_solr c:implicitcoll s:b  x:implicitcoll_b_replica1] o.a.s.s.HttpSolrCall [admin] webapp=null path=/admin/cores params={qt=/admin/cores&collection.configName=conf&newCollection=true&name=implicitcoll_b_replica1&action=CREATE&numShards=3&collection=implicitcoll&shard=b&wt=javabin&version=2} status=0 QTime=2532
   [junit4]   2> 2367166 INFO  (qtp1433610066-14317) [n:127.0.0.1:63803_solr c:implicitcoll s:c  x:implicitcoll_c_replica4] o.a.s.c.ZkController I am the leader, no recovery necessary
   [junit4]   2> 2367169 INFO  (qtp1433610066-14317) [n:127.0.0.1:63803_solr c:implicitcoll s:c  x:implicitcoll_c_replica4] o.a.s.s.HttpSolrCall [admin] webapp=null path=/admin/cores params={qt=/admin/cores&collection.configName=conf&newCollection=true&name=implicitcoll_c_replica4&action=CREATE&numShards=3&collection=implicitcoll&shard=c&wt=javabin&version=2} status=0 QTime=2554
   [junit4]   2> 2367180 INFO  (qtp1433610066-14309) [n:127.0.0.1:63803_solr c:implicitcoll s:a  x:implicitcoll_a_replica4] o.a.s.c.ZkController I am the leader, no recovery necessary
   [junit4]   2> 2367184 INFO  (qtp1433610066-14309) [n:127.0.0.1:63803_solr c:implicitcoll s:a  x:implicitcoll_a_replica4] o.a.s.s.HttpSolrCall [admin] webapp=null path=/admin/cores params={qt=/admin/cores&collection.configName=conf&newCollection=true&name=implicitcoll_a_replica4&action=CREATE&numShards=3&collection=implicitcoll&shard=a&wt=javabin&version=2} status=0 QTime=2569
   [junit4]   2> 2367296 INFO  (zkCallback-2376-thread-1-processing-n:127.0.0.1:63803_solr) [n:127.0.0.1:63803_solr    ] o.a.s.c.c.ZkStateReader A cluster state change: [WatchedEvent state:SyncConnected type:NodeDataChanged path:/collections/implicitcoll/state.json] for collection [implicitcoll] has occurred - updating... (live nodes size: [4])
   [junit4]   2> 2367296 INFO  (zkCallback-2379-thread-1-processing-n:127.0.0.1:63799_solr) [n:127.0.0.1:63799_solr    ] o.a.s.c.c.ZkStateReader A cluster state change: [WatchedEvent state:SyncConnected type:NodeDataChanged path:/collections/implicitcoll/state.json] for collection [implicitcoll] has occurred - updating... (live nodes size: [4])
   [junit4]   2> 2367296 INFO  (zkCallback-2380-thread-1-processing-n:127.0.0.1:63798_solr) [n:127.0.0.1:63798_solr    ] o.a.s.c.c.ZkStateReader A cluster state change: [WatchedEvent state:SyncConnected type:NodeDataChanged path:/collections/implicitcoll/state.json] for collection [implicitcoll] has occurred - updating... (live nodes size: [4])
   [junit4]   2> 2367296 INFO  (zkCallback-2372-thread-3-processing-n:127.0.0.1:63800_solr) [n:127.0.0.1:63800_solr    ] o.a.s.c.c.ZkStateReader A cluster state change: [WatchedEvent state:SyncConnected type:NodeDataChanged path:/collections/implicitcoll/state.json] for collection [implicitcoll] has occurred - updating... (live nodes size: [4])
   [junit4]   2> 2367469 INFO  (qtp1433610066-14323) [n:127.0.0.1:63803_solr c:implicitcoll s:b  x:implicitcoll_b_replica4] o.a.s.s.HttpSolrCall [admin] webapp=null path=/admin/cores params={qt=/admin/cores&collection.configName=conf&newCollection=true&name=implicitcoll_b_replica4&action=CREATE&numShards=3&collection=implicitcoll&shard=b&wt=javabin&version=2} status=0 QTime=2854
   [junit4]   2> 2367491 INFO  (qtp1731405362-14316) [n:127.0.0.1:63799_solr c:implicitcoll s:c  x:implicitcoll_c_replica3] o.a.s.s.HttpSolrCall [admin] webapp=null path=/admin/cores params={qt=/admin/cores&collection.configName=conf&newCollection=true&name=implicitcoll_c_replica3&action=CREATE&numShards=3&collection=implicitcoll&shard=c&wt=javabin&version=2} status=0 QTime=2880
   [junit4]   2> 2367495 INFO  (qtp686265105-14298) [n:127.0.0.1:63798_solr c:implicitcoll s:c  x:implicitcoll_c_replica2] o.a.s.s.HttpSolrCall [admin] webapp=null path=/admin/cores params={qt=/admin/cores&collection.configName=conf&newCollection=true&name=implicitcoll_c_replica2&action=CREATE&numShards=3&collection=implicitcoll&shard=c&wt=javabin&version=2} status=0 QTime=2875
   [junit4]   2> 2367509 INFO  (qtp1731405362-14314) [n:127.0.0.1:63799_solr c:implicitcoll s:b  x:implicitcoll_b_replica3] o.a.s.s.HttpSolrCall [admin] webapp=null path=/admin/cores params={qt=/admin/cores&collection.configName=conf&newCollection=true&name=implicitcoll_b_replica3&action=CREATE&numShards=3&collection=implicitcoll&shard=b&wt=javabin&version=2} status=0 QTime=2901
   [junit4]   2> 2367509 INFO  (qtp686265105-14302) [n:127.0.0.1:63798_solr c:implicitcoll s:b  x:implicitcoll_b_replica2] o.a.s.s.HttpSolrCall [admin] webapp=null path=/admin/cores params={qt=/admin/cores&collection.configName=conf&newCollection=true&name=implicitcoll_b_replica2&action=CREATE&numShards=3&collection=implicitcoll&shard=b&wt=javabin&version=2} status=0 QTime=2889
   [junit4]   2> 2367512 INFO  (qtp1731405362-14315) [n:127.0.0.1:63799_

[...truncated too long message...]

ic reporters for: solr.node
   [junit4]   2> 2423789 INFO  (jetty-launcher-2359-thread-3) [    ] o.e.j.s.h.ContextHandler Stopped o.e.j.s.ServletContextHandler@12a19f46{/solr,null,UNAVAILABLE}
   [junit4]   2> 2423801 INFO  (jetty-launcher-2359-thread-2) [    ] o.a.s.m.SolrMetricManager Closing metric reporters for: solr.node
   [junit4]   2> 2423802 INFO  (jetty-launcher-2359-thread-2) [    ] o.e.j.s.h.ContextHandler Stopped o.e.j.s.ServletContextHandler@540c4a5d{/solr,null,UNAVAILABLE}
   [junit4]   2> 2423804 INFO  (SUITE-CustomCollectionTest-seed#[167C8A2C2AD6C4E3]-worker) [    ] o.a.s.c.ZkTestServer connecting to 127.0.0.1:63796 63796
   [junit4]   2> 2423805 INFO  (Thread-3217) [    ] o.a.s.c.ZkTestServer connecting to 127.0.0.1:63796 63796
   [junit4]   2> 2427267 WARN  (Thread-3217) [    ] o.a.s.c.ZkTestServer Watch limit violations: 
   [junit4]   2> Maximum concurrent create/delete watches above limit:
   [junit4]   2> 
   [junit4]   2> 	13	/solr/configs/conf
   [junit4]   2> 	9	/solr/clusterprops.json
   [junit4]   2> 	9	/solr/aliases.json
   [junit4]   2> 	4	/solr/security.json
   [junit4]   2> 
   [junit4]   2> Maximum concurrent data watches above limit:
   [junit4]   2> 
   [junit4]   2> 	9	/solr/clusterstate.json
   [junit4]   2> 	5	/solr/collections/implicitcoll/state.json
   [junit4]   2> 	4	/solr/collections/testCreateShardRepFactor/state.json
   [junit4]   2> 	4	/solr/collections/routeFieldColl/state.json
   [junit4]   2> 	4	/solr/collections/withShardField/state.json
   [junit4]   2> 	2	/solr/collections/implicitcoll/leader_elect/c/election/97439766102867976-core_node6-n_0000000000
   [junit4]   2> 
   [junit4]   2> Maximum concurrent children watches above limit:
   [junit4]   2> 
   [junit4]   2> 	78	/solr/overseer/queue
   [junit4]   2> 	45	/solr/overseer/collection-queue-work
   [junit4]   2> 	27	/solr/collections
   [junit4]   2> 	9	/solr/live_nodes
   [junit4]   2> 	7	/solr/overseer/queue-work
   [junit4]   2> 
   [junit4]   2> 2427267 INFO  (SUITE-CustomCollectionTest-seed#[167C8A2C2AD6C4E3]-worker) [    ] o.a.s.SolrTestCaseJ4 ###deleteCore
   [junit4]   2> NOTE: leaving temporary files on disk at: /Users/jenkins/workspace/Lucene-Solr-master-MacOSX/solr/build/solr-core/test/J1/temp/solr.cloud.CustomCollectionTest_167C8A2C2AD6C4E3-001
   [junit4]   2> NOTE: test params are: codec=Asserting(Lucene70), sim=RandomSimilarity(queryNorm=false): {}, locale=he-IL, timezone=America/Port-au-Prince
   [junit4]   2> NOTE: Mac OS X 10.11.6 x86_64/Oracle Corporation 1.8.0_121 (64-bit)/cpus=3,threads=1,free=178633480,total=510947328
   [junit4]   2> NOTE: All tests run in this JVM: [TestDFRSimilarityFactory, TestJettySolrRunner, CachingDirectoryFactoryTest, TestImplicitCoreProperties, MultiThreadedOCPTest, SpatialRPTFieldTypeTest, NoCacheHeaderTest, DistributedQueueTest, CacheHeaderTest, DistributedSuggestComponentTest, MigrateRouteKeyTest, TestTrieFacet, TestLMDirichletSimilarityFactory, LeaderElectionIntegrationTest, CdcrRequestHandlerTest, CloudExitableDirectoryReaderTest, BufferStoreTest, TestWriterPerf, TestDistributedGrouping, TestMaxScoreQueryParser, DistributedDebugComponentTest, TestSSLRandomization, TestQuerySenderListener, TestSolrDeletionPolicy2, TestCloudPseudoReturnFields, TestSolrCoreSnapshots, BaseCdcrDistributedZkTest, TestJoin, TestRawResponseWriter, TestReversedWildcardFilterFactory, BadComponentTest, MetricsHandlerTest, TestNonDefinedSimilarityFactory, VMParamsZkACLAndCredentialsProvidersTest, BasicAuthIntegrationTest, PreAnalyzedFieldTest, RollingRestartTest, TestManagedResourceStorage, FullHLLTest, FieldMutatingUpdateProcessorTest, ConvertedLegacyTest, TestMiniSolrCloudClusterSSL, TestStressRecovery, BitVectorTest, DataDrivenBlockJoinTest, LoggingHandlerTest, SuggesterTest, CloudMLTQParserTest, TlogReplayBufferedWhileIndexingTest, ActionThrottleTest, FullSolrCloudDistribCmdsTest, PKIAuthenticationIntegrationTest, TestSubQueryTransformerDistrib, WordBreakSolrSpellCheckerTest, TestRandomFaceting, TestDistributedMissingSort, TestRangeQuery, DistributedQueryComponentCustomSortTest, TestConfigsApi, CSVRequestHandlerTest, BasicDistributedZk2Test, TestSmileRequest, TestUninvertingReader, PeerSyncReplicationTest, HdfsRecoveryZkTest, TestAuthenticationFramework, URLClassifyProcessorTest, DateMathParserTest, CollectionsAPIAsyncDistributedZkTest, CircularListTest, TestSolrXml, BadIndexSchemaTest, TestSQLHandler, TestSystemCollAutoCreate, OverseerModifyCollectionTest, TestCustomStream, TestInitQParser, TestSolrCloudWithSecureImpersonation, CoreAdminHandlerTest, TestSimpleTrackingShardHandler, TestFieldTypeCollectionResource, TestScoreJoinQPScore, TestGeoJSONResponseWriter, SpellCheckComponentTest, SolrIndexMetricsTest, CollectionStateFormat2Test, TestBlendedInfixSuggestions, ManagedSchemaRoundRobinCloudTest, TestSearchPerf, TestConfig, TestSystemIdResolver, UUIDUpdateProcessorFallbackTest, SolrGangliaReporterTest, TestClusterProperties, AddSchemaFieldsUpdateProcessorFactoryTest, DeleteStatusTest, TermVectorComponentTest, CdcrReplicationDistributedZkTest, MetricUtilsTest, TestRealTimeGet, TestFoldingMultitermQuery, SharedFSAutoReplicaFailoverTest, ConcurrentDeleteAndCreateCollectionTest, TestLocalFSCloudBackupRestore, TestSolrQueryResponse, TestClassicSimilarityFactory, RuleEngineTest, HdfsWriteToMultipleCollectionsTest, TestInitParams, DistributedTermsComponentTest, TestSha256AuthenticationProvider, TestReqParamsAPI, TestFastWriter, TestConfigSetImmutable, SolrJmxReporterTest, RequestHandlersTest, BasicFunctionalityTest, ClassificationUpdateProcessorFactoryTest, UpdateLogTest, TestAtomicUpdateErrorCases, SaslZkACLProviderTest, TestIndexingPerformance, TestSolrQueryParser, TestOmitPositions, TestBulkSchemaAPI, TestManagedStopFilterFactory, BlockJoinFacetRandomTest, TestSchemaManager, UpdateParamsTest, DistributedIntervalFacetingTest, OverriddenZkACLAndCredentialsProvidersTest, OpenCloseCoreStressTest, DistributedFacetPivotSmallTest, TestTestInjection, ConjunctionSolrSpellCheckerTest, GraphQueryTest, TestQueryUtils, TestSubQueryTransformer, InfixSuggestersTest, SolrInfoMBeanTest, TestSuggestSpellingConverter, TestIndexSearcher, SliceStateTest, SignatureUpdateProcessorFactoryTest, TestBackupRepositoryFactory, AnalysisErrorHandlingTest, CoreMergeIndexesAdminHandlerTest, RankQueryTest, TestJavabinTupleStreamParser, TestSolrIndexConfig, SpellCheckCollatorTest, TestConfigSets, DistanceFunctionTest, TestDynamicFieldCollectionResource, TestExceedMaxTermLength, TestUseDocValuesAsStored, TestGraphTermsQParserPlugin, DefaultValueUpdateProcessorTest, TestIntervalFaceting, ShowFileRequestHandlerTest, TestComplexPhraseQParserPlugin, TestCodecSupport, ShufflingReplicaListTransformerTest, BlobRepositoryCloudTest, TestClusterStateMutator, TestHdfsCloudBackupRestore, TestSchemaNameResource, TestQueryWrapperFilter, ChaosMonkeySafeLeaderTest, UnloadDistributedZkTest, CollectionsAPIDistributedZkTest, SyncSliceTest, BasicZkTest, RecoveryZkTest, ClusterStateUpdateTest, ZkSolrClientTest, TestZkChroot, ShardRoutingCustomTest, TestDistributedSearch, TestHashPartitioner, TermVectorComponentDistributedTest, HardAutoCommitTest, TestSolr4Spatial, SolrCmdDistributorTest, TestLazyCores, SolrIndexSplitterTest, TestCoreDiscovery, SuggesterTSTTest, SpatialFilterTest, TestCSVLoader, SolrCoreCheckLockOnStartupTest, TestPseudoReturnFields, SortByFunctionTest, TestSolrDeletionPolicy1, DebugComponentTest, TestSurroundQueryParser, LukeRequestHandlerTest, TestValueSourceCache, MoreLikeThisHandlerTest, FieldAnalysisRequestHandlerTest, RegexBoostProcessorTest, TestCollationField, UpdateRequestProcessorFactoryTest, QueryParsingTest, UniqFieldsUpdateProcessorFactoryTest, JsonLoaderTest, TestPartialUpdateDeduplication, SearchHandlerTest, HighlighterConfigTest, AlternateDirectoryTest, CopyFieldTest, ResponseLogComponentTest, SolrIndexConfigTest, MinimalSchemaTest, OutputWriterTest, TestSolrCoreProperties, SpellPossibilityIteratorTest, TestCharFilters, EchoParamsTest, TestLMJelinekMercerSimilarityFactory, ResourceLoaderTest, TestFastOutputStream, PluginInfoTest, DOMUtilTest, ClusterStateTest, ZkNodePropsTest, DistributedMLTComponentTest, SolrTestCaseJ4Test, TestCrossCoreJoin, TestCursorMarkWithoutUniqueKey, TestTolerantSearch, TestPathTrie, AssignTest, CdcrBootstrapTest, CollectionReloadTest, CollectionTooManyReplicasTest, ConfigSetsAPITest, ConnectionManagerTest, CustomCollectionTest]
   [junit4] Completed [489/694 (1!)] on J1 in 66.26s, 4 tests, 1 error <<< FAILURES!

[...truncated 62889 lines...]
-documentation-lint:
    [jtidy] Checking for broken html (such as invalid tags)...
   [delete] Deleting directory /Users/jenkins/workspace/Lucene-Solr-master-MacOSX/lucene/build/jtidy_tmp
     [echo] Checking for broken links...
     [exec] 
     [exec] Crawl/parse...
     [exec] 
     [exec] Verify...
     [echo] Checking for malformed docs...
     [exec] 
     [exec] /Users/jenkins/workspace/Lucene-Solr-master-MacOSX/solr/build/docs/solr-solrj/overview-summary.html
     [exec]   missing: org.apache.solr.client.solrj.io.eval
     [exec] 
     [exec] Missing javadocs were found!

BUILD FAILED
/Users/jenkins/workspace/Lucene-Solr-master-MacOSX/build.xml:775: The following error occurred while executing this line:
/Users/jenkins/workspace/Lucene-Solr-master-MacOSX/build.xml:101: The following error occurred while executing this line:
/Users/jenkins/workspace/Lucene-Solr-master-MacOSX/solr/build.xml:654: The following error occurred while executing this line:
/Users/jenkins/workspace/Lucene-Solr-master-MacOSX/solr/build.xml:670: The following error occurred while executing this line:
/Users/jenkins/workspace/Lucene-Solr-master-MacOSX/lucene/common-build.xml:2493: exec returned: 1

Total time: 114 minutes 30 seconds
Build step 'Invoke Ant' marked build as failure
Archiving artifacts
[WARNINGS] Skipping publisher since build result is FAILURE
Recording test results
Email was triggered for: Failure - Any
Sending email for trigger: Failure - Any



Mime
View raw message