lucene-dev mailing list archives

Site index · List index
Message view « Date » · « Thread »
Top « Date » · « Thread »
From Policeman Jenkins Server <jenk...@thetaphi.de>
Subject [JENKINS] Lucene-Solr-master-Solaris (64bit/jdk1.8.0) - Build # 1135 - Unstable!
Date Wed, 15 Feb 2017 23:09:40 GMT
Build: https://jenkins.thetaphi.de/job/Lucene-Solr-master-Solaris/1135/
Java: 64bit/jdk1.8.0 -XX:+UseCompressedOops -XX:+UseG1GC

1 tests failed.
FAILED:  org.apache.solr.cloud.PeerSyncReplicationTest.test

Error Message:
timeout waiting to see all nodes active

Stack Trace:
java.lang.AssertionError: timeout waiting to see all nodes active
	at __randomizedtesting.SeedInfo.seed([B92C63C447833C68:31785C1EE97F5190]:0)
	at org.junit.Assert.fail(Assert.java:93)
	at org.apache.solr.cloud.PeerSyncReplicationTest.waitTillNodesActive(PeerSyncReplicationTest.java:326)
	at org.apache.solr.cloud.PeerSyncReplicationTest.bringUpDeadNodeAndEnsureNoReplication(PeerSyncReplicationTest.java:277)
	at org.apache.solr.cloud.PeerSyncReplicationTest.forceNodeFailureAndDoPeerSync(PeerSyncReplicationTest.java:259)
	at org.apache.solr.cloud.PeerSyncReplicationTest.test(PeerSyncReplicationTest.java:138)
	at sun.reflect.NativeMethodAccessorImpl.invoke0(Native Method)
	at sun.reflect.NativeMethodAccessorImpl.invoke(NativeMethodAccessorImpl.java:62)
	at sun.reflect.DelegatingMethodAccessorImpl.invoke(DelegatingMethodAccessorImpl.java:43)
	at java.lang.reflect.Method.invoke(Method.java:498)
	at com.carrotsearch.randomizedtesting.RandomizedRunner.invoke(RandomizedRunner.java:1713)
	at com.carrotsearch.randomizedtesting.RandomizedRunner$8.evaluate(RandomizedRunner.java:907)
	at com.carrotsearch.randomizedtesting.RandomizedRunner$9.evaluate(RandomizedRunner.java:943)
	at com.carrotsearch.randomizedtesting.RandomizedRunner$10.evaluate(RandomizedRunner.java:957)
	at org.apache.solr.BaseDistributedSearchTestCase$ShardsRepeatRule$ShardsFixedStatement.callStatement(BaseDistributedSearchTestCase.java:985)
	at org.apache.solr.BaseDistributedSearchTestCase$ShardsRepeatRule$ShardsStatement.evaluate(BaseDistributedSearchTestCase.java:960)
	at com.carrotsearch.randomizedtesting.rules.SystemPropertiesRestoreRule$1.evaluate(SystemPropertiesRestoreRule.java:57)
	at org.apache.lucene.util.TestRuleSetupTeardownChained$1.evaluate(TestRuleSetupTeardownChained.java:49)
	at org.apache.lucene.util.AbstractBeforeAfterRule$1.evaluate(AbstractBeforeAfterRule.java:45)
	at org.apache.lucene.util.TestRuleThreadAndTestName$1.evaluate(TestRuleThreadAndTestName.java:48)
	at org.apache.lucene.util.TestRuleIgnoreAfterMaxFailures$1.evaluate(TestRuleIgnoreAfterMaxFailures.java:64)
	at org.apache.lucene.util.TestRuleMarkFailure$1.evaluate(TestRuleMarkFailure.java:47)
	at com.carrotsearch.randomizedtesting.rules.StatementAdapter.evaluate(StatementAdapter.java:36)
	at com.carrotsearch.randomizedtesting.ThreadLeakControl$StatementRunner.run(ThreadLeakControl.java:368)
	at com.carrotsearch.randomizedtesting.ThreadLeakControl.forkTimeoutingTask(ThreadLeakControl.java:817)
	at com.carrotsearch.randomizedtesting.ThreadLeakControl$3.evaluate(ThreadLeakControl.java:468)
	at com.carrotsearch.randomizedtesting.RandomizedRunner.runSingleTest(RandomizedRunner.java:916)
	at com.carrotsearch.randomizedtesting.RandomizedRunner$5.evaluate(RandomizedRunner.java:802)
	at com.carrotsearch.randomizedtesting.RandomizedRunner$6.evaluate(RandomizedRunner.java:852)
	at com.carrotsearch.randomizedtesting.RandomizedRunner$7.evaluate(RandomizedRunner.java:863)
	at com.carrotsearch.randomizedtesting.rules.StatementAdapter.evaluate(StatementAdapter.java:36)
	at com.carrotsearch.randomizedtesting.rules.SystemPropertiesRestoreRule$1.evaluate(SystemPropertiesRestoreRule.java:57)
	at org.apache.lucene.util.AbstractBeforeAfterRule$1.evaluate(AbstractBeforeAfterRule.java:45)
	at com.carrotsearch.randomizedtesting.rules.StatementAdapter.evaluate(StatementAdapter.java:36)
	at org.apache.lucene.util.TestRuleStoreClassName$1.evaluate(TestRuleStoreClassName.java:41)
	at com.carrotsearch.randomizedtesting.rules.NoShadowingOrOverridesOnMethodsRule$1.evaluate(NoShadowingOrOverridesOnMethodsRule.java:40)
	at com.carrotsearch.randomizedtesting.rules.NoShadowingOrOverridesOnMethodsRule$1.evaluate(NoShadowingOrOverridesOnMethodsRule.java:40)
	at com.carrotsearch.randomizedtesting.rules.StatementAdapter.evaluate(StatementAdapter.java:36)
	at com.carrotsearch.randomizedtesting.rules.StatementAdapter.evaluate(StatementAdapter.java:36)
	at com.carrotsearch.randomizedtesting.rules.StatementAdapter.evaluate(StatementAdapter.java:36)
	at org.apache.lucene.util.TestRuleAssertionsRequired$1.evaluate(TestRuleAssertionsRequired.java:53)
	at org.apache.lucene.util.TestRuleMarkFailure$1.evaluate(TestRuleMarkFailure.java:47)
	at org.apache.lucene.util.TestRuleIgnoreAfterMaxFailures$1.evaluate(TestRuleIgnoreAfterMaxFailures.java:64)
	at org.apache.lucene.util.TestRuleIgnoreTestSuites$1.evaluate(TestRuleIgnoreTestSuites.java:54)
	at com.carrotsearch.randomizedtesting.rules.StatementAdapter.evaluate(StatementAdapter.java:36)
	at com.carrotsearch.randomizedtesting.ThreadLeakControl$StatementRunner.run(ThreadLeakControl.java:368)
	at java.lang.Thread.run(Thread.java:745)




Build Log:
[...truncated 12428 lines...]
   [junit4] Suite: org.apache.solr.cloud.PeerSyncReplicationTest
   [junit4]   2> Creating dataDir: /export/home/jenkins/workspace/Lucene-Solr-master-Solaris/solr/build/solr-core/test/J0/temp/solr.cloud.PeerSyncReplicationTest_B92C63C447833C68-001/init-core-data-001
   [junit4]   2> 2294441 INFO  (SUITE-PeerSyncReplicationTest-seed#[B92C63C447833C68]-worker) [    ] o.a.s.SolrTestCaseJ4 Using PointFields
   [junit4]   2> 2294443 INFO  (SUITE-PeerSyncReplicationTest-seed#[B92C63C447833C68]-worker) [    ] o.a.s.SolrTestCaseJ4 Randomized ssl (false) and clientAuth (false) via: @org.apache.solr.util.RandomizeSSL(reason=, value=NaN, ssl=NaN, clientAuth=NaN)
   [junit4]   2> 2294443 INFO  (SUITE-PeerSyncReplicationTest-seed#[B92C63C447833C68]-worker) [    ] o.a.s.BaseDistributedSearchTestCase Setting hostContext system property: /
   [junit4]   2> 2294447 INFO  (TEST-PeerSyncReplicationTest.test-seed#[B92C63C447833C68]) [    ] o.a.s.c.ZkTestServer STARTING ZK TEST SERVER
   [junit4]   2> 2294447 INFO  (Thread-5205) [    ] o.a.s.c.ZkTestServer client port:0.0.0.0/0.0.0.0:0
   [junit4]   2> 2294447 INFO  (Thread-5205) [    ] o.a.s.c.ZkTestServer Starting server
   [junit4]   2> 2294547 INFO  (TEST-PeerSyncReplicationTest.test-seed#[B92C63C447833C68]) [    ] o.a.s.c.ZkTestServer start zk server on port:60907
   [junit4]   2> 2294565 INFO  (TEST-PeerSyncReplicationTest.test-seed#[B92C63C447833C68]) [    ] o.a.s.c.AbstractZkTestCase put /export/home/jenkins/workspace/Lucene-Solr-master-Solaris/solr/core/src/test-files/solr/collection1/conf/solrconfig-tlog.xml to /configs/conf1/solrconfig.xml
   [junit4]   2> 2294568 INFO  (TEST-PeerSyncReplicationTest.test-seed#[B92C63C447833C68]) [    ] o.a.s.c.AbstractZkTestCase put /export/home/jenkins/workspace/Lucene-Solr-master-Solaris/solr/core/src/test-files/solr/collection1/conf/schema.xml to /configs/conf1/schema.xml
   [junit4]   2> 2294571 INFO  (TEST-PeerSyncReplicationTest.test-seed#[B92C63C447833C68]) [    ] o.a.s.c.AbstractZkTestCase put /export/home/jenkins/workspace/Lucene-Solr-master-Solaris/solr/core/src/test-files/solr/collection1/conf/solrconfig.snippet.randomindexconfig.xml to /configs/conf1/solrconfig.snippet.randomindexconfig.xml
   [junit4]   2> 2294573 INFO  (TEST-PeerSyncReplicationTest.test-seed#[B92C63C447833C68]) [    ] o.a.s.c.AbstractZkTestCase put /export/home/jenkins/workspace/Lucene-Solr-master-Solaris/solr/core/src/test-files/solr/collection1/conf/stopwords.txt to /configs/conf1/stopwords.txt
   [junit4]   2> 2294575 INFO  (TEST-PeerSyncReplicationTest.test-seed#[B92C63C447833C68]) [    ] o.a.s.c.AbstractZkTestCase put /export/home/jenkins/workspace/Lucene-Solr-master-Solaris/solr/core/src/test-files/solr/collection1/conf/protwords.txt to /configs/conf1/protwords.txt
   [junit4]   2> 2294578 INFO  (TEST-PeerSyncReplicationTest.test-seed#[B92C63C447833C68]) [    ] o.a.s.c.AbstractZkTestCase put /export/home/jenkins/workspace/Lucene-Solr-master-Solaris/solr/core/src/test-files/solr/collection1/conf/currency.xml to /configs/conf1/currency.xml
   [junit4]   2> 2294580 INFO  (TEST-PeerSyncReplicationTest.test-seed#[B92C63C447833C68]) [    ] o.a.s.c.AbstractZkTestCase put /export/home/jenkins/workspace/Lucene-Solr-master-Solaris/solr/core/src/test-files/solr/collection1/conf/enumsConfig.xml to /configs/conf1/enumsConfig.xml
   [junit4]   2> 2294582 INFO  (TEST-PeerSyncReplicationTest.test-seed#[B92C63C447833C68]) [    ] o.a.s.c.AbstractZkTestCase put /export/home/jenkins/workspace/Lucene-Solr-master-Solaris/solr/core/src/test-files/solr/collection1/conf/open-exchange-rates.json to /configs/conf1/open-exchange-rates.json
   [junit4]   2> 2294585 INFO  (TEST-PeerSyncReplicationTest.test-seed#[B92C63C447833C68]) [    ] o.a.s.c.AbstractZkTestCase put /export/home/jenkins/workspace/Lucene-Solr-master-Solaris/solr/core/src/test-files/solr/collection1/conf/mapping-ISOLatin1Accent.txt to /configs/conf1/mapping-ISOLatin1Accent.txt
   [junit4]   2> 2294587 INFO  (TEST-PeerSyncReplicationTest.test-seed#[B92C63C447833C68]) [    ] o.a.s.c.AbstractZkTestCase put /export/home/jenkins/workspace/Lucene-Solr-master-Solaris/solr/core/src/test-files/solr/collection1/conf/old_synonyms.txt to /configs/conf1/old_synonyms.txt
   [junit4]   2> 2294589 INFO  (TEST-PeerSyncReplicationTest.test-seed#[B92C63C447833C68]) [    ] o.a.s.c.AbstractZkTestCase put /export/home/jenkins/workspace/Lucene-Solr-master-Solaris/solr/core/src/test-files/solr/collection1/conf/synonyms.txt to /configs/conf1/synonyms.txt
   [junit4]   2> 2294728 INFO  (TEST-PeerSyncReplicationTest.test-seed#[B92C63C447833C68]) [    ] o.a.s.SolrTestCaseJ4 Writing core.properties file to /export/home/jenkins/workspace/Lucene-Solr-master-Solaris/solr/build/solr-core/test/J0/temp/solr.cloud.PeerSyncReplicationTest_B92C63C447833C68-001/control-001/cores/collection1
   [junit4]   2> 2294729 INFO  (TEST-PeerSyncReplicationTest.test-seed#[B92C63C447833C68]) [    ] o.e.j.s.Server jetty-9.3.14.v20161028
   [junit4]   2> 2294730 INFO  (TEST-PeerSyncReplicationTest.test-seed#[B92C63C447833C68]) [    ] o.e.j.s.h.ContextHandler Started o.e.j.s.ServletContextHandler@4bdfb01a{/,null,AVAILABLE}
   [junit4]   2> 2294731 INFO  (TEST-PeerSyncReplicationTest.test-seed#[B92C63C447833C68]) [    ] o.e.j.s.AbstractConnector Started ServerConnector@331cba29{HTTP/1.1,[http/1.1]}{127.0.0.1:62411}
   [junit4]   2> 2294731 INFO  (TEST-PeerSyncReplicationTest.test-seed#[B92C63C447833C68]) [    ] o.e.j.s.Server Started @2298603ms
   [junit4]   2> 2294731 INFO  (TEST-PeerSyncReplicationTest.test-seed#[B92C63C447833C68]) [    ] o.a.s.c.s.e.JettySolrRunner Jetty properties: {solr.data.dir=/export/home/jenkins/workspace/Lucene-Solr-master-Solaris/solr/build/solr-core/test/J0/temp/solr.cloud.PeerSyncReplicationTest_B92C63C447833C68-001/tempDir-001/control/data, hostContext=/, hostPort=62411, coreRootDirectory=/export/home/jenkins/workspace/Lucene-Solr-master-Solaris/solr/build/solr-core/test/J0/../../../../../../../../../../export/home/jenkins/workspace/Lucene-Solr-master-Solaris/solr/build/solr-core/test/J0/temp/solr.cloud.PeerSyncReplicationTest_B92C63C447833C68-001/control-001/cores}
   [junit4]   2> 2294731 ERROR (TEST-PeerSyncReplicationTest.test-seed#[B92C63C447833C68]) [    ] o.a.s.s.StartupLoggingUtils Missing Java Option solr.log.dir. Logging may be missing or incomplete.
   [junit4]   2> 2294732 INFO  (TEST-PeerSyncReplicationTest.test-seed#[B92C63C447833C68]) [    ] o.a.s.s.SolrDispatchFilter  ___      _       Welcome to Apache Solr? version 7.0.0
   [junit4]   2> 2294732 INFO  (TEST-PeerSyncReplicationTest.test-seed#[B92C63C447833C68]) [    ] o.a.s.s.SolrDispatchFilter / __| ___| |_ _   Starting in cloud mode on port null
   [junit4]   2> 2294732 INFO  (TEST-PeerSyncReplicationTest.test-seed#[B92C63C447833C68]) [    ] o.a.s.s.SolrDispatchFilter \__ \/ _ \ | '_|  Install dir: null
   [junit4]   2> 2294732 INFO  (TEST-PeerSyncReplicationTest.test-seed#[B92C63C447833C68]) [    ] o.a.s.s.SolrDispatchFilter |___/\___/_|_|    Start time: 2017-02-15T22:30:43.695Z
   [junit4]   2> 2294735 INFO  (TEST-PeerSyncReplicationTest.test-seed#[B92C63C447833C68]) [    ] o.a.s.s.SolrDispatchFilter Loading solr.xml from SolrHome (not found in ZooKeeper)
   [junit4]   2> 2294735 INFO  (TEST-PeerSyncReplicationTest.test-seed#[B92C63C447833C68]) [    ] o.a.s.c.SolrXmlConfig Loading container configuration from /export/home/jenkins/workspace/Lucene-Solr-master-Solaris/solr/build/solr-core/test/J0/temp/solr.cloud.PeerSyncReplicationTest_B92C63C447833C68-001/control-001/solr.xml
   [junit4]   2> 2294743 INFO  (TEST-PeerSyncReplicationTest.test-seed#[B92C63C447833C68]) [    ] o.a.s.c.ZkContainer Zookeeper client=127.0.0.1:60907/solr
   [junit4]   2> 2294778 INFO  (TEST-PeerSyncReplicationTest.test-seed#[B92C63C447833C68]) [n:127.0.0.1:62411_    ] o.a.s.c.Overseer Overseer (id=null) closing
   [junit4]   2> 2294779 INFO  (TEST-PeerSyncReplicationTest.test-seed#[B92C63C447833C68]) [n:127.0.0.1:62411_    ] o.a.s.c.OverseerElectionContext I am going to be the leader 127.0.0.1:62411_
   [junit4]   2> 2294781 INFO  (TEST-PeerSyncReplicationTest.test-seed#[B92C63C447833C68]) [n:127.0.0.1:62411_    ] o.a.s.c.Overseer Overseer (id=97464997865783300-127.0.0.1:62411_-n_0000000000) starting
   [junit4]   2> 2294792 INFO  (TEST-PeerSyncReplicationTest.test-seed#[B92C63C447833C68]) [n:127.0.0.1:62411_    ] o.a.s.c.ZkController Register node as live in ZooKeeper:/live_nodes/127.0.0.1:62411_
   [junit4]   2> 2294796 INFO  (zkCallback-2999-thread-1-processing-n:127.0.0.1:62411_) [n:127.0.0.1:62411_    ] o.a.s.c.c.ZkStateReader Updated live nodes from ZooKeeper... (0) -> (1)
   [junit4]   2> 2294904 INFO  (TEST-PeerSyncReplicationTest.test-seed#[B92C63C447833C68]) [n:127.0.0.1:62411_    ] o.a.s.c.CorePropertiesLocator Found 1 core definitions underneath /export/home/jenkins/workspace/Lucene-Solr-master-Solaris/solr/build/solr-core/test/J0/../../../../../../../../../../export/home/jenkins/workspace/Lucene-Solr-master-Solaris/solr/build/solr-core/test/J0/temp/solr.cloud.PeerSyncReplicationTest_B92C63C447833C68-001/control-001/cores
   [junit4]   2> 2294904 INFO  (TEST-PeerSyncReplicationTest.test-seed#[B92C63C447833C68]) [n:127.0.0.1:62411_    ] o.a.s.c.CorePropertiesLocator Cores are: [collection1]
   [junit4]   2> 2294909 INFO  (OverseerStateUpdate-97464997865783300-127.0.0.1:62411_-n_0000000000) [n:127.0.0.1:62411_    ] o.a.s.c.o.ReplicaMutator Assigning new node to shard shard=shard1
   [junit4]   2> 2295924 INFO  (coreLoadExecutor-8548-thread-1-processing-n:127.0.0.1:62411_) [n:127.0.0.1:62411_ c:control_collection   x:collection1] o.a.s.c.SolrConfig Using Lucene MatchVersion: 7.0.0
   [junit4]   2> 2295936 INFO  (coreLoadExecutor-8548-thread-1-processing-n:127.0.0.1:62411_) [n:127.0.0.1:62411_ c:control_collection   x:collection1] o.a.s.s.IndexSchema [collection1] Schema name=test
   [junit4]   2> 2296002 WARN  (coreLoadExecutor-8548-thread-1-processing-n:127.0.0.1:62411_) [n:127.0.0.1:62411_ c:control_collection   x:collection1] o.a.s.s.IndexSchema [collection1] default search field in schema is text. WARNING: Deprecated, please use 'df' on request instead.
   [junit4]   2> 2296004 INFO  (coreLoadExecutor-8548-thread-1-processing-n:127.0.0.1:62411_) [n:127.0.0.1:62411_ c:control_collection   x:collection1] o.a.s.s.IndexSchema Loaded schema test/1.0 with uniqueid field id
   [junit4]   2> 2296021 INFO  (coreLoadExecutor-8548-thread-1-processing-n:127.0.0.1:62411_) [n:127.0.0.1:62411_ c:control_collection   x:collection1] o.a.s.c.CoreContainer Creating SolrCore 'collection1' using configuration from collection control_collection
   [junit4]   2> 2296021 INFO  (coreLoadExecutor-8548-thread-1-processing-n:127.0.0.1:62411_) [n:127.0.0.1:62411_ c:control_collection   x:collection1] o.a.s.c.SolrCore [[collection1] ] Opening new SolrCore at [/export/home/jenkins/workspace/Lucene-Solr-master-Solaris/solr/build/solr-core/test/J0/temp/solr.cloud.PeerSyncReplicationTest_B92C63C447833C68-001/control-001/cores/collection1], dataDir=[/export/home/jenkins/workspace/Lucene-Solr-master-Solaris/solr/build/solr-core/test/J0/../../../../../../../../../../export/home/jenkins/workspace/Lucene-Solr-master-Solaris/solr/build/solr-core/test/J0/temp/solr.cloud.PeerSyncReplicationTest_B92C63C447833C68-001/control-001/cores/collection1/data/]
   [junit4]   2> 2296021 INFO  (coreLoadExecutor-8548-thread-1-processing-n:127.0.0.1:62411_) [n:127.0.0.1:62411_ c:control_collection   x:collection1] o.a.s.c.JmxMonitoredMap JMX monitoring is enabled. Adding Solr mbeans to JMX Server: com.sun.jmx.mbeanserver.JmxMBeanServer@66aef6fa
   [junit4]   2> 2296023 INFO  (coreLoadExecutor-8548-thread-1-processing-n:127.0.0.1:62411_) [n:127.0.0.1:62411_ c:control_collection   x:collection1] o.a.s.u.RandomMergePolicy RandomMergePolicy wrapping class org.apache.lucene.index.LogByteSizeMergePolicy: [LogByteSizeMergePolicy: minMergeSize=1677721, mergeFactor=29, maxMergeSize=2147483648, maxMergeSizeForForcedMerge=9223372036854775807, calibrateSizeByDeletes=false, maxMergeDocs=2147483647, maxCFSSegmentSizeMB=8.796093022207999E12, noCFSRatio=0.45666949756497044]
   [junit4]   2> 2296030 WARN  (coreLoadExecutor-8548-thread-1-processing-n:127.0.0.1:62411_) [n:127.0.0.1:62411_ c:control_collection   x:collection1] o.a.s.c.RequestHandlers INVALID paramSet a in requestHandler {type = requestHandler,name = /dump,class = DumpRequestHandler,attributes = {initParams=a, name=/dump, class=DumpRequestHandler},args = {defaults={a=A,b=B}}}
   [junit4]   2> 2296081 INFO  (coreLoadExecutor-8548-thread-1-processing-n:127.0.0.1:62411_) [n:127.0.0.1:62411_ c:control_collection   x:collection1] o.a.s.u.UpdateHandler Using UpdateLog implementation: org.apache.solr.update.UpdateLog
   [junit4]   2> 2296081 INFO  (coreLoadExecutor-8548-thread-1-processing-n:127.0.0.1:62411_) [n:127.0.0.1:62411_ c:control_collection   x:collection1] o.a.s.u.UpdateLog Initializing UpdateLog: dataDir= defaultSyncLevel=FLUSH numRecordsToKeep=1000 maxNumLogsToKeep=10 numVersionBuckets=65536
   [junit4]   2> 2296082 INFO  (coreLoadExecutor-8548-thread-1-processing-n:127.0.0.1:62411_) [n:127.0.0.1:62411_ c:control_collection   x:collection1] o.a.s.u.CommitTracker Hard AutoCommit: disabled
   [junit4]   2> 2296082 INFO  (coreLoadExecutor-8548-thread-1-processing-n:127.0.0.1:62411_) [n:127.0.0.1:62411_ c:control_collection   x:collection1] o.a.s.u.CommitTracker Soft AutoCommit: disabled
   [junit4]   2> 2296082 INFO  (coreLoadExecutor-8548-thread-1-processing-n:127.0.0.1:62411_) [n:127.0.0.1:62411_ c:control_collection   x:collection1] o.a.s.u.RandomMergePolicy RandomMergePolicy wrapping class org.apache.lucene.index.TieredMergePolicy: [TieredMergePolicy: maxMergeAtOnce=27, maxMergeAtOnceExplicit=43, maxMergedSegmentMB=71.3134765625, floorSegmentMB=1.1767578125, forceMergeDeletesPctAllowed=23.85517895029442, segmentsPerTier=44.0, maxCFSSegmentSizeMB=8.796093022207999E12, noCFSRatio=1.0
   [junit4]   2> 2296083 INFO  (coreLoadExecutor-8548-thread-1-processing-n:127.0.0.1:62411_) [n:127.0.0.1:62411_ c:control_collection   x:collection1] o.a.s.s.SolrIndexSearcher Opening [Searcher@493d240d[collection1] main]
   [junit4]   2> 2296084 INFO  (coreLoadExecutor-8548-thread-1-processing-n:127.0.0.1:62411_) [n:127.0.0.1:62411_ c:control_collection   x:collection1] o.a.s.r.ManagedResourceStorage Configured ZooKeeperStorageIO with znodeBase: /configs/conf1
   [junit4]   2> 2296085 INFO  (coreLoadExecutor-8548-thread-1-processing-n:127.0.0.1:62411_) [n:127.0.0.1:62411_ c:control_collection   x:collection1] o.a.s.r.ManagedResourceStorage Loaded null at path _rest_managed.json using ZooKeeperStorageIO:path=/configs/conf1
   [junit4]   2> 2296085 INFO  (coreLoadExecutor-8548-thread-1-processing-n:127.0.0.1:62411_) [n:127.0.0.1:62411_ c:control_collection   x:collection1] o.a.s.h.ReplicationHandler Commits will be reserved for  10000
   [junit4]   2> 2296086 INFO  (searcherExecutor-8549-thread-1-processing-n:127.0.0.1:62411_ x:collection1 c:control_collection) [n:127.0.0.1:62411_ c:control_collection   x:collection1] o.a.s.c.SolrCore [collection1] Registered new searcher Searcher@493d240d[collection1] main{ExitableDirectoryReader(UninvertingDirectoryReader())}
   [junit4]   2> 2296087 INFO  (coreLoadExecutor-8548-thread-1-processing-n:127.0.0.1:62411_) [n:127.0.0.1:62411_ c:control_collection   x:collection1] o.a.s.u.UpdateLog Could not find max version in index or recent updates, using new clock 1559439967571148800
   [junit4]   2> 2296096 INFO  (coreZkRegister-8541-thread-1-processing-n:127.0.0.1:62411_ x:collection1 c:control_collection) [n:127.0.0.1:62411_ c:control_collection s:shard1 r:core_node1 x:collection1] o.a.s.c.ShardLeaderElectionContext Enough replicas found to continue.
   [junit4]   2> 2296096 INFO  (coreZkRegister-8541-thread-1-processing-n:127.0.0.1:62411_ x:collection1 c:control_collection) [n:127.0.0.1:62411_ c:control_collection s:shard1 r:core_node1 x:collection1] o.a.s.c.ShardLeaderElectionContext I may be the new leader - try and sync
   [junit4]   2> 2296096 INFO  (coreZkRegister-8541-thread-1-processing-n:127.0.0.1:62411_ x:collection1 c:control_collection) [n:127.0.0.1:62411_ c:control_collection s:shard1 r:core_node1 x:collection1] o.a.s.c.SyncStrategy Sync replicas to http://127.0.0.1:62411/collection1/
   [junit4]   2> 2296096 INFO  (coreZkRegister-8541-thread-1-processing-n:127.0.0.1:62411_ x:collection1 c:control_collection) [n:127.0.0.1:62411_ c:control_collection s:shard1 r:core_node1 x:collection1] o.a.s.c.SyncStrategy Sync Success - now sync replicas to me
   [junit4]   2> 2296096 INFO  (coreZkRegister-8541-thread-1-processing-n:127.0.0.1:62411_ x:collection1 c:control_collection) [n:127.0.0.1:62411_ c:control_collection s:shard1 r:core_node1 x:collection1] o.a.s.c.SyncStrategy http://127.0.0.1:62411/collection1/ has no replicas
   [junit4]   2> 2296102 INFO  (coreZkRegister-8541-thread-1-processing-n:127.0.0.1:62411_ x:collection1 c:control_collection) [n:127.0.0.1:62411_ c:control_collection s:shard1 r:core_node1 x:collection1] o.a.s.c.ShardLeaderElectionContext I am the new leader: http://127.0.0.1:62411/collection1/ shard1
   [junit4]   2> 2296253 INFO  (coreZkRegister-8541-thread-1-processing-n:127.0.0.1:62411_ x:collection1 c:control_collection) [n:127.0.0.1:62411_ c:control_collection s:shard1 r:core_node1 x:collection1] o.a.s.c.ZkController I am the leader, no recovery necessary
   [junit4]   2> 2296478 INFO  (TEST-PeerSyncReplicationTest.test-seed#[B92C63C447833C68]) [    ] o.a.s.c.c.ZkStateReader Updated live nodes from ZooKeeper... (0) -> (1)
   [junit4]   2> 2296480 INFO  (TEST-PeerSyncReplicationTest.test-seed#[B92C63C447833C68]) [    ] o.a.s.c.s.i.ZkClientClusterStateProvider Cluster at 127.0.0.1:60907/solr ready
   [junit4]   2> 2296480 INFO  (TEST-PeerSyncReplicationTest.test-seed#[B92C63C447833C68]) [    ] o.a.s.c.ChaosMonkey monkey: init - expire sessions:false cause connection loss:false
   [junit4]   2> 2296618 INFO  (TEST-PeerSyncReplicationTest.test-seed#[B92C63C447833C68]) [    ] o.a.s.SolrTestCaseJ4 Writing core.properties file to /export/home/jenkins/workspace/Lucene-Solr-master-Solaris/solr/build/solr-core/test/J0/temp/solr.cloud.PeerSyncReplicationTest_B92C63C447833C68-001/shard-1-001/cores/collection1
   [junit4]   2> 2296619 INFO  (TEST-PeerSyncReplicationTest.test-seed#[B92C63C447833C68]) [    ] o.a.s.c.AbstractFullDistribZkTestBase create jetty 1 in directory /export/home/jenkins/workspace/Lucene-Solr-master-Solaris/solr/build/solr-core/test/J0/temp/solr.cloud.PeerSyncReplicationTest_B92C63C447833C68-001/shard-1-001
   [junit4]   2> 2296619 INFO  (TEST-PeerSyncReplicationTest.test-seed#[B92C63C447833C68]) [    ] o.e.j.s.Server jetty-9.3.14.v20161028
   [junit4]   2> 2296620 INFO  (TEST-PeerSyncReplicationTest.test-seed#[B92C63C447833C68]) [    ] o.e.j.s.h.ContextHandler Started o.e.j.s.ServletContextHandler@3582c07c{/,null,AVAILABLE}
   [junit4]   2> 2296621 INFO  (TEST-PeerSyncReplicationTest.test-seed#[B92C63C447833C68]) [    ] o.e.j.s.AbstractConnector Started ServerConnector@618eba67{HTTP/1.1,[http/1.1]}{127.0.0.1:35916}
   [junit4]   2> 2296621 INFO  (TEST-PeerSyncReplicationTest.test-seed#[B92C63C447833C68]) [    ] o.e.j.s.Server Started @2300494ms
   [junit4]   2> 2296621 INFO  (TEST-PeerSyncReplicationTest.test-seed#[B92C63C447833C68]) [    ] o.a.s.c.s.e.JettySolrRunner Jetty properties: {solr.data.dir=/export/home/jenkins/workspace/Lucene-Solr-master-Solaris/solr/build/solr-core/test/J0/temp/solr.cloud.PeerSyncReplicationTest_B92C63C447833C68-001/tempDir-001/jetty1, solrconfig=solrconfig.xml, hostContext=/, hostPort=35916, coreRootDirectory=/export/home/jenkins/workspace/Lucene-Solr-master-Solaris/solr/build/solr-core/test/J0/temp/solr.cloud.PeerSyncReplicationTest_B92C63C447833C68-001/shard-1-001/cores}
   [junit4]   2> 2296621 ERROR (TEST-PeerSyncReplicationTest.test-seed#[B92C63C447833C68]) [    ] o.a.s.s.StartupLoggingUtils Missing Java Option solr.log.dir. Logging may be missing or incomplete.
   [junit4]   2> 2296621 INFO  (TEST-PeerSyncReplicationTest.test-seed#[B92C63C447833C68]) [    ] o.a.s.s.SolrDispatchFilter  ___      _       Welcome to Apache Solr? version 7.0.0
   [junit4]   2> 2296621 INFO  (TEST-PeerSyncReplicationTest.test-seed#[B92C63C447833C68]) [    ] o.a.s.s.SolrDispatchFilter / __| ___| |_ _   Starting in cloud mode on port null
   [junit4]   2> 2296621 INFO  (TEST-PeerSyncReplicationTest.test-seed#[B92C63C447833C68]) [    ] o.a.s.s.SolrDispatchFilter \__ \/ _ \ | '_|  Install dir: null
   [junit4]   2> 2296621 INFO  (TEST-PeerSyncReplicationTest.test-seed#[B92C63C447833C68]) [    ] o.a.s.s.SolrDispatchFilter |___/\___/_|_|    Start time: 2017-02-15T22:30:45.584Z
   [junit4]   2> 2296625 INFO  (TEST-PeerSyncReplicationTest.test-seed#[B92C63C447833C68]) [    ] o.a.s.s.SolrDispatchFilter Loading solr.xml from SolrHome (not found in ZooKeeper)
   [junit4]   2> 2296625 INFO  (TEST-PeerSyncReplicationTest.test-seed#[B92C63C447833C68]) [    ] o.a.s.c.SolrXmlConfig Loading container configuration from /export/home/jenkins/workspace/Lucene-Solr-master-Solaris/solr/build/solr-core/test/J0/temp/solr.cloud.PeerSyncReplicationTest_B92C63C447833C68-001/shard-1-001/solr.xml
   [junit4]   2> 2296631 INFO  (TEST-PeerSyncReplicationTest.test-seed#[B92C63C447833C68]) [    ] o.a.s.c.ZkContainer Zookeeper client=127.0.0.1:60907/solr
   [junit4]   2> 2296646 INFO  (TEST-PeerSyncReplicationTest.test-seed#[B92C63C447833C68]) [n:127.0.0.1:35916_    ] o.a.s.c.c.ZkStateReader Updated live nodes from ZooKeeper... (0) -> (1)
   [junit4]   2> 2296649 INFO  (TEST-PeerSyncReplicationTest.test-seed#[B92C63C447833C68]) [n:127.0.0.1:35916_    ] o.a.s.c.Overseer Overseer (id=null) closing
   [junit4]   2> 2296653 INFO  (TEST-PeerSyncReplicationTest.test-seed#[B92C63C447833C68]) [n:127.0.0.1:35916_    ] o.a.s.c.ZkController Register node as live in ZooKeeper:/live_nodes/127.0.0.1:35916_
   [junit4]   2> 2296655 INFO  (zkCallback-2999-thread-1-processing-n:127.0.0.1:62411_) [n:127.0.0.1:62411_    ] o.a.s.c.c.ZkStateReader Updated live nodes from ZooKeeper... (1) -> (2)
   [junit4]   2> 2296655 INFO  (zkCallback-3003-thread-1) [    ] o.a.s.c.c.ZkStateReader Updated live nodes from ZooKeeper... (1) -> (2)
   [junit4]   2> 2296655 INFO  (zkCallback-3008-thread-1-processing-n:127.0.0.1:35916_) [n:127.0.0.1:35916_    ] o.a.s.c.c.ZkStateReader Updated live nodes from ZooKeeper... (1) -> (2)
   [junit4]   2> 2296839 INFO  (TEST-PeerSyncReplicationTest.test-seed#[B92C63C447833C68]) [n:127.0.0.1:35916_    ] o.a.s.c.CorePropertiesLocator Found 1 core definitions underneath /export/home/jenkins/workspace/Lucene-Solr-master-Solaris/solr/build/solr-core/test/J0/temp/solr.cloud.PeerSyncReplicationTest_B92C63C447833C68-001/shard-1-001/cores
   [junit4]   2> 2296839 INFO  (TEST-PeerSyncReplicationTest.test-seed#[B92C63C447833C68]) [n:127.0.0.1:35916_    ] o.a.s.c.CorePropertiesLocator Cores are: [collection1]
   [junit4]   2> 2296841 INFO  (OverseerStateUpdate-97464997865783300-127.0.0.1:62411_-n_0000000000) [n:127.0.0.1:62411_    ] o.a.s.c.o.ReplicaMutator Assigning new node to shard shard=shard1
   [junit4]   2> 2297864 INFO  (coreLoadExecutor-8559-thread-1-processing-n:127.0.0.1:35916_) [n:127.0.0.1:35916_ c:collection1   x:collection1] o.a.s.c.SolrConfig Using Lucene MatchVersion: 7.0.0
   [junit4]   2> 2297875 INFO  (coreLoadExecutor-8559-thread-1-processing-n:127.0.0.1:35916_) [n:127.0.0.1:35916_ c:collection1   x:collection1] o.a.s.s.IndexSchema [collection1] Schema name=test
   [junit4]   2> 2297944 WARN  (coreLoadExecutor-8559-thread-1-processing-n:127.0.0.1:35916_) [n:127.0.0.1:35916_ c:collection1   x:collection1] o.a.s.s.IndexSchema [collection1] default search field in schema is text. WARNING: Deprecated, please use 'df' on request instead.
   [junit4]   2> 2297946 INFO  (coreLoadExecutor-8559-thread-1-processing-n:127.0.0.1:35916_) [n:127.0.0.1:35916_ c:collection1   x:collection1] o.a.s.s.IndexSchema Loaded schema test/1.0 with uniqueid field id
   [junit4]   2> 2297962 INFO  (coreLoadExecutor-8559-thread-1-processing-n:127.0.0.1:35916_) [n:127.0.0.1:35916_ c:collection1   x:collection1] o.a.s.c.CoreContainer Creating SolrCore 'collection1' using configuration from collection collection1
   [junit4]   2> 2297962 INFO  (coreLoadExecutor-8559-thread-1-processing-n:127.0.0.1:35916_) [n:127.0.0.1:35916_ c:collection1   x:collection1] o.a.s.c.SolrCore [[collection1] ] Opening new SolrCore at [/export/home/jenkins/workspace/Lucene-Solr-master-Solaris/solr/build/solr-core/test/J0/temp/solr.cloud.PeerSyncReplicationTest_B92C63C447833C68-001/shard-1-001/cores/collection1], dataDir=[/export/home/jenkins/workspace/Lucene-Solr-master-Solaris/solr/build/solr-core/test/J0/temp/solr.cloud.PeerSyncReplicationTest_B92C63C447833C68-001/shard-1-001/cores/collection1/data/]
   [junit4]   2> 2297962 INFO  (coreLoadExecutor-8559-thread-1-processing-n:127.0.0.1:35916_) [n:127.0.0.1:35916_ c:collection1   x:collection1] o.a.s.c.JmxMonitoredMap JMX monitoring is enabled. Adding Solr mbeans to JMX Server: com.sun.jmx.mbeanserver.JmxMBeanServer@66aef6fa
   [junit4]   2> 2297964 INFO  (coreLoadExecutor-8559-thread-1-processing-n:127.0.0.1:35916_) [n:127.0.0.1:35916_ c:collection1   x:collection1] o.a.s.u.RandomMergePolicy RandomMergePolicy wrapping class org.apache.lucene.index.LogByteSizeMergePolicy: [LogByteSizeMergePolicy: minMergeSize=1677721, mergeFactor=29, maxMergeSize=2147483648, maxMergeSizeForForcedMerge=9223372036854775807, calibrateSizeByDeletes=false, maxMergeDocs=2147483647, maxCFSSegmentSizeMB=8.796093022207999E12, noCFSRatio=0.45666949756497044]
   [junit4]   2> 2297971 WARN  (coreLoadExecutor-8559-thread-1-processing-n:127.0.0.1:35916_) [n:127.0.0.1:35916_ c:collection1   x:collection1] o.a.s.c.RequestHandlers INVALID paramSet a in requestHandler {type = requestHandler,name = /dump,class = DumpRequestHandler,attributes = {initParams=a, name=/dump, class=DumpRequestHandler},args = {defaults={a=A,b=B}}}
   [junit4]   2> 2298013 INFO  (coreLoadExecutor-8559-thread-1-processing-n:127.0.0.1:35916_) [n:127.0.0.1:35916_ c:collection1   x:collection1] o.a.s.u.UpdateHandler Using UpdateLog implementation: org.apache.solr.update.UpdateLog
   [junit4]   2> 2298013 INFO  (coreLoadExecutor-8559-thread-1-processing-n:127.0.0.1:35916_) [n:127.0.0.1:35916_ c:collection1   x:collection1] o.a.s.u.UpdateLog Initializing UpdateLog: dataDir= defaultSyncLevel=FLUSH numRecordsToKeep=1000 maxNumLogsToKeep=10 numVersionBuckets=65536
   [junit4]   2> 2298014 INFO  (coreLoadExecutor-8559-thread-1-processing-n:127.0.0.1:35916_) [n:127.0.0.1:35916_ c:collection1   x:collection1] o.a.s.u.CommitTracker Hard AutoCommit: disabled
   [junit4]   2> 2298014 INFO  (coreLoadExecutor-8559-thread-1-processing-n:127.0.0.1:35916_) [n:127.0.0.1:35916_ c:collection1   x:collection1] o.a.s.u.CommitTracker Soft AutoCommit: disabled
   [junit4]   2> 2298014 INFO  (coreLoadExecutor-8559-thread-1-processing-n:127.0.0.1:35916_) [n:127.0.0.1:35916_ c:collection1   x:collection1] o.a.s.u.RandomMergePolicy RandomMergePolicy wrapping class org.apache.lucene.index.TieredMergePolicy: [TieredMergePolicy: maxMergeAtOnce=27, maxMergeAtOnceExplicit=43, maxMergedSegmentMB=71.3134765625, floorSegmentMB=1.1767578125, forceMergeDeletesPctAllowed=23.85517895029442, segmentsPerTier=44.0, maxCFSSegmentSizeMB=8.796093022207999E12, noCFSRatio=1.0
   [junit4]   2> 2298015 INFO  (coreLoadExecutor-8559-thread-1-processing-n:127.0.0.1:35916_) [n:127.0.0.1:35916_ c:collection1   x:collection1] o.a.s.s.SolrIndexSearcher Opening [Searcher@52f9abe5[collection1] main]
   [junit4]   2> 2298016 INFO  (coreLoadExecutor-8559-thread-1-processing-n:127.0.0.1:35916_) [n:127.0.0.1:35916_ c:collection1   x:collection1] o.a.s.r.ManagedResourceStorage Configured ZooKeeperStorageIO with znodeBase: /configs/conf1
   [junit4]   2> 2298017 INFO  (coreLoadExecutor-8559-thread-1-processing-n:127.0.0.1:35916_) [n:127.0.0.1:35916_ c:collection1   x:collection1] o.a.s.r.ManagedResourceStorage Loaded null at path _rest_managed.json using ZooKeeperStorageIO:path=/configs/conf1
   [junit4]   2> 2298017 INFO  (coreLoadExecutor-8559-thread-1-processing-n:127.0.0.1:35916_) [n:127.0.0.1:35916_ c:collection1   x:collection1] o.a.s.h.ReplicationHandler Commits will be reserved for  10000
   [junit4]   2> 2298018 INFO  (searcherExecutor-8560-thread-1-processing-n:127.0.0.1:35916_ x:collection1 c:collection1) [n:127.0.0.1:35916_ c:collection1   x:collection1] o.a.s.c.SolrCore [collection1] Registered new searcher Searcher@52f9abe5[collection1] main{ExitableDirectoryReader(UninvertingDirectoryReader())}
   [junit4]   2> 2298019 INFO  (coreLoadExecutor-8559-thread-1-processing-n:127.0.0.1:35916_) [n:127.0.0.1:35916_ c:collection1   x:collection1] o.a.s.u.UpdateLog Could not find max version in index or recent updates, using new clock 1559439969596997632
   [junit4]   2> 2298028 INFO  (coreZkRegister-8554-thread-1-processing-n:127.0.0.1:35916_ x:collection1 c:collection1) [n:127.0.0.1:35916_ c:collection1 s:shard1 r:core_node1 x:collection1] o.a.s.c.ShardLeaderElectionContext Enough replicas found to continue.
   [junit4]   2> 2298028 INFO  (coreZkRegister-8554-thread-1-processing-n:127.0.0.1:35916_ x:collection1 c:collection1) [n:127.0.0.1:35916_ c:collection1 s:shard1 r:core_node1 x:collection1] o.a.s.c.ShardLeaderElectionContext I may be the new leader - try and sync
   [junit4]   2> 2298028 INFO  (coreZkRegister-8554-thread-1-processing-n:127.0.0.1:35916_ x:collection1 c:collection1) [n:127.0.0.1:35916_ c:collection1 s:shard1 r:core_node1 x:collection1] o.a.s.c.SyncStrategy Sync replicas to http://127.0.0.1:35916/collection1/
   [junit4]   2> 2298028 INFO  (coreZkRegister-8554-thread-1-processing-n:127.0.0.1:35916_ x:collection1 c:collection1) [n:127.0.0.1:35916_ c:collection1 s:shard1 r:core_node1 x:collection1] o.a.s.c.SyncStrategy Sync Success - now sync replicas to me
   [junit4]   2> 2298028 INFO  (coreZkRegister-8554-thread-1-processing-n:127.0.0.1:35916_ x:collection1 c:collection1) [n:127.0.0.1:35916_ c:collection1 s:shard1 r:core_node1 x:collection1] o.a.s.c.SyncStrategy http://127.0.0.1:35916/collection1/ has no replicas
   [junit4]   2> 2298034 INFO  (coreZkRegister-8554-thread-1-processing-n:127.0.0.1:35916_ x:collection1 c:collection1) [n:127.0.0.1:35916_ c:collection1 s:shard1 r:core_node1 x:collection1] o.a.s.c.ShardLeaderElectionContext I am the new leader: http://127.0.0.1:35916/collection1/ shard1
   [junit4]   2> 2298142 INFO  (coreZkRegister-8554-thread-1-processing-n:127.0.0.1:35916_ x:collection1 c:collection1) [n:127.0.0.1:35916_ c:collection1 s:shard1 r:core_node1 x:collection1] o.a.s.c.ZkController I am the leader, no recovery necessary
   [junit4]   2> 2298540 INFO  (TEST-PeerSyncReplicationTest.test-seed#[B92C63C447833C68]) [    ] o.a.s.SolrTestCaseJ4 Writing core.properties file to /export/home/jenkins/workspace/Lucene-Solr-master-Solaris/solr/build/solr-core/test/J0/temp/solr.cloud.PeerSyncReplicationTest_B92C63C447833C68-001/shard-2-001/cores/collection1
   [junit4]   2> 2298541 INFO  (TEST-PeerSyncReplicationTest.test-seed#[B92C63C447833C68]) [    ] o.a.s.c.AbstractFullDistribZkTestBase create jetty 2 in directory /export/home/jenkins/workspace/Lucene-Solr-master-Solaris/solr/build/solr-core/test/J0/temp/solr.cloud.PeerSyncReplicationTest_B92C63C447833C68-001/shard-2-001
   [junit4]   2> 2298541 INFO  (TEST-PeerSyncReplicationTest.test-seed#[B92C63C447833C68]) [    ] o.e.j.s.Server jetty-9.3.14.v20161028
   [junit4]   2> 2298543 INFO  (TEST-PeerSyncReplicationTest.test-seed#[B92C63C447833C68]) [    ] o.e.j.s.h.ContextHandler Started o.e.j.s.ServletContextHandler@104f1338{/,null,AVAILABLE}
   [junit4]   2> 2298543 INFO  (TEST-PeerSyncReplicationTest.test-seed#[B92C63C447833C68]) [    ] o.e.j.s.AbstractConnector Started ServerConnector@79064c67{HTTP/1.1,[http/1.1]}{127.0.0.1:50685}
   [junit4]   2> 2298544 INFO  (TEST-PeerSyncReplicationTest.test-seed#[B92C63C447833C68]) [    ] o.e.j.s.Server Started @2302417ms
   [junit4]   2> 2298544 INFO  (TEST-PeerSyncReplicationTest.test-seed#[B92C63C447833C68]) [    ] o.a.s.c.s.e.JettySolrRunner Jetty properties: {solr.data.dir=/export/home/jenkins/workspace/Lucene-Solr-master-Solaris/solr/build/solr-core/test/J0/temp/solr.cloud.PeerSyncReplicationTest_B92C63C447833C68-001/tempDir-001/jetty2, solrconfig=solrconfig.xml, hostContext=/, hostPort=50685, coreRootDirectory=/export/home/jenkins/workspace/Lucene-Solr-master-Solaris/solr/build/solr-core/test/J0/temp/solr.cloud.PeerSyncReplicationTest_B92C63C447833C68-001/shard-2-001/cores}
   [junit4]   2> 2298544 ERROR (TEST-PeerSyncReplicationTest.test-seed#[B92C63C447833C68]) [    ] o.a.s.s.StartupLoggingUtils Missing Java Option solr.log.dir. Logging may be missing or incomplete.
   [junit4]   2> 2298544 INFO  (TEST-PeerSyncReplicationTest.test-seed#[B92C63C447833C68]) [    ] o.a.s.s.SolrDispatchFilter  ___      _       Welcome to Apache Solr? version 7.0.0
   [junit4]   2> 2298544 INFO  (TEST-PeerSyncReplicationTest.test-seed#[B92C63C447833C68]) [    ] o.a.s.s.SolrDispatchFilter / __| ___| |_ _   Starting in cloud mode on port null
   [junit4]   2> 2298544 INFO  (TEST-PeerSyncReplicationTest.test-seed#[B92C63C447833C68]) [    ] o.a.s.s.SolrDispatchFilter \__ \/ _ \ | '_|  Install dir: null
   [junit4]   2> 2298544 INFO  (TEST-PeerSyncReplicationTest.test-seed#[B92C63C447833C68]) [    ] o.a.s.s.SolrDispatchFilter |___/\___/_|_|    Start time: 2017-02-15T22:30:47.507Z
   [junit4]   2> 2298548 INFO  (TEST-PeerSyncReplicationTest.test-seed#[B92C63C447833C68]) [    ] o.a.s.s.SolrDispatchFilter Loading solr.xml from SolrHome (not found in ZooKeeper)
   [junit4]   2> 2298548 INFO  (TEST-PeerSyncReplicationTest.test-seed#[B92C63C447833C68]) [    ] o.a.s.c.SolrXmlConfig Loading container configuration from /export/home/jenkins/workspace/Lucene-Solr-master-Solaris/solr/build/solr-core/test/J0/temp/solr.cloud.PeerSyncReplicationTest_B92C63C447833C68-001/shard-2-001/solr.xml
   [junit4]   2> 2298554 INFO  (TEST-PeerSyncReplicationTest.test-seed#[B92C63C447833C68]) [    ] o.a.s.c.ZkContainer Zookeeper client=127.0.0.1:60907/solr
   [junit4]   2> 2298569 INFO  (TEST-PeerSyncReplicationTest.test-seed#[B92C63C447833C68]) [n:127.0.0.1:50685_    ] o.a.s.c.c.ZkStateReader Updated live nodes from ZooKeeper... (0) -> (2)
   [junit4]   2> 2298573 INFO  (TEST-PeerSyncReplicationTest.test-seed#[B92C63C447833C68]) [n:127.0.0.1:50685_    ] o.a.s.c.Overseer Overseer (id=null) closing
   [junit4]   2> 2298577 INFO  (TEST-PeerSyncReplicationTest.test-seed#[B92C63C447833C68]) [n:127.0.0.1:50685_    ] o.a.s.c.ZkController Register node as live in ZooKeeper:/live_nodes/127.0.0.1:50685_
   [junit4]   2> 2298579 INFO  (zkCallback-3003-thread-1) [    ] o.a.s.c.c.ZkStateReader Updated live nodes from ZooKeeper... (2) -> (3)
   [junit4]   2> 2298579 INFO  (zkCallback-2999-thread-1-processing-n:127.0.0.1:62411_) [n:127.0.0.1:62411_    ] o.a.s.c.c.ZkStateReader Updated live nodes from ZooKeeper... (2) -> (3)
   [junit4]   2> 2298579 INFO  (zkCallback-3008-thread-1-processing-n:127.0.0.1:35916_) [n:127.0.0.1:35916_    ] o.a.s.c.c.ZkStateReader Updated live nodes from ZooKeeper... (2) -> (3)
   [junit4]   2> 2298580 INFO  (zkCallback-3014-thread-1-processing-n:127.0.0.1:50685_) [n:127.0.0.1:50685_    ] o.a.s.c.c.ZkStateReader Updated live nodes from ZooKeeper... (2) -> (3)
   [junit4]   2> 2298635 INFO  (TEST-PeerSyncReplicationTest.test-seed#[B92C63C447833C68]) [n:127.0.0.1:50685_    ] o.a.s.c.CorePropertiesLocator Found 1 core definitions underneath /export/home/jenkins/workspace/Lucene-Solr-master-Solaris/solr/build/solr-core/test/J0/temp/solr.cloud.PeerSyncReplicationTest_B92C63C447833C68-001/shard-2-001/cores
   [junit4]   2> 2298635 INFO  (TEST-PeerSyncReplicationTest.test-seed#[B92C63C447833C68]) [n:127.0.0.1:50685_    ] o.a.s.c.CorePropertiesLocator Cores are: [collection1]
   [junit4]   2> 2298638 INFO  (OverseerStateUpdate-97464997865783300-127.0.0.1:62411_-n_0000000000) [n:127.0.0.1:62411_    ] o.a.s.c.o.ReplicaMutator Assigning new node to shard shard=shard1
   [junit4]   2> 2299655 INFO  (coreLoadExecutor-8570-thread-1-processing-n:127.0.0.1:50685_) [n:127.0.0.1:50685_ c:collection1   x:collection1] o.a.s.c.SolrConfig Using Lucene MatchVersion: 7.0.0
   [junit4]   2> 2299666 INFO  (coreLoadExecutor-8570-thread-1-processing-n:127.0.0.1:50685_) [n:127.0.0.1:50685_ c:collection1   x:collection1] o.a.s.s.IndexSchema [collection1] Schema name=test
   [junit4]   2> 2299745 WARN  (coreLoadExecutor-8570-thread-1-processing-n:127.0.0.1:50685_) [n:127.0.0.1:50685_ c:collection1   x:collection1] o.a.s.s.IndexSchema [collection1] default search field in schema is text. WARNING: Deprecated, please use 'df' on request instead.
   [junit4]   2> 2299747 INFO  (coreLoadExecutor-8570-thread-1-processing-n:127.0.0.1:50685_) [n:127.0.0.1:50685_ c:collection1   x:collection1] o.a.s.s.IndexSchema Loaded schema test/1.0 with uniqueid field id
   [junit4]   2> 2299762 INFO  (coreLoadExecutor-8570-thread-1-processing-n:127.0.0.1:50685_) [n:127.0.0.1:50685_ c:collection1   x:collection1] o.a.s.c.CoreContainer Creating SolrCore 'collection1' using configuration from collection collection1
   [junit4]   2> 2299763 INFO  (coreLoadExecutor-8570-thread-1-processing-n:127.0.0.1:50685_) [n:127.0.0.1:50685_ c:collection1   x:collection1] o.a.s.c.SolrCore [[collection1] ] Opening new SolrCore at [/export/home/jenkins/workspace/Lucene-Solr-master-Solaris/solr/build/solr-core/test/J0/temp/solr.cloud.PeerSyncReplicationTest_B92C63C447833C68-001/shard-2-001/cores/collection1], dataDir=[/export/home/jenkins/workspace/Lucene-Solr-master-Solaris/solr/build/solr-core/test/J0/temp/solr.cloud.PeerSyncReplicationTest_B92C63C447833C68-001/shard-2-001/cores/collection1/data/]
   [junit4]   2> 2299763 INFO  (coreLoadExecutor-8570-thread-1-processing-n:127.0.0.1:50685_) [n:127.0.0.1:50685_ c:collection1   x:collection1] o.a.s.c.JmxMonitoredMap JMX monitoring is enabled. Adding Solr mbeans to JMX Server: com.sun.jmx.mbeanserver.JmxMBeanServer@66aef6fa
   [junit4]   2> 2299764 INFO  (coreLoadExecutor-8570-thread-1-processing-n:127.0.0.1:50685_) [n:127.0.0.1:50685_ c:collection1   x:collection1] o.a.s.u.RandomMergePolicy RandomMergePolicy wrapping class org.apache.lucene.index.LogByteSizeMergePolicy: [LogByteSizeMergePolicy: minMergeSize=1677721, mergeFactor=29, maxMergeSize=2147483648, maxMergeSizeForForcedMerge=9223372036854775807, calibrateSizeByDeletes=false, maxMergeDocs=2147483647, maxCFSSegmentSizeMB=8.796093022207999E12, noCFSRatio=0.45666949756497044]
   [junit4]   2> 2299771 WARN  (coreLoadExecutor-8570-thread-1-processing-n:127.0.0.1:50685_) [n:127.0.0.1:50685_ c:collection1   x:collection1] o.a.s.c.RequestHandlers INVALID paramSet a in requestHandler {type = requestHandler,name = /dump,class = DumpRequestHandler,attributes = {initParams=a, name=/dump, class=DumpRequestHandler},args = {defaults={a=A,b=B}}}
   [junit4]   2> 2299814 INFO  (coreLoadExecutor-8570-thread-1-processing-n:127.0.0.1:50685_) [n:127.0.0.1:50685_ c:collection1   x:collection1] o.a.s.u.UpdateHandler Using UpdateLog implementation: org.apache.solr.update.UpdateLog
   [junit4]   2> 2299814 INFO  (coreLoadExecutor-8570-thread-1-processing-n:127.0.0.1:50685_) [n:127.0.0.1:50685_ c:collection1   x:collection1] o.a.s.u.UpdateLog Initializing UpdateLog: dataDir= defaultSyncLevel=FLUSH numRecordsToKeep=1000 maxNumLogsToKeep=10 numVersionBuckets=65536
   [junit4]   2> 2299815 INFO  (coreLoadExecutor-8570-thread-1-processing-n:127.0.0.1:50685_) [n:127.0.0.1:50685_ c:collection1   x:collection1] o.a.s.u.CommitTracker Hard AutoCommit: disabled
   [junit4]   2> 2299815 INFO  (coreLoadExecutor-8570-thread-1-processing-n:127.0.0.1:50685_) [n:127.0.0.1:50685_ c:collection1   x:collection1] o.a.s.u.CommitTracker Soft AutoCommit: disabled
   [junit4]   2> 2299816 INFO  (coreLoadExecutor-8570-thread-1-processing-n:127.0.0.1:50685_) [n:127.0.0.1:50685_ c:collection1   x:collection1] o.a.s.u.RandomMergePolicy RandomMergePolicy wrapping class org.apache.lucene.index.TieredMergePolicy: [TieredMergePolicy: maxMergeAtOnce=27, maxMergeAtOnceExplicit=43, maxMergedSegmentMB=71.3134765625, floorSegmentMB=1.1767578125, forceMergeDeletesPctAllowed=23.85517895029442, segmentsPerTier=44.0, maxCFSSegmentSizeMB=8.796093022207999E12, noCFSRatio=1.0
   [junit4]   2> 2299816 INFO  (coreLoadExecutor-8570-thread-1-processing-n:127.0.0.1:50685_) [n:127.0.0.1:50685_ c:collection1   x:collection1] o.a.s.s.SolrIndexSearcher Opening [Searcher@7f91699[collection1] main]
   [junit4]   2> 2299818 INFO  (coreLoadExecutor-8570-thread-1-processing-n:127.0.0.1:50685_) [n:127.0.0.1:50685_ c:collection1   x:collection1] o.a.s.r.ManagedResourceStorage Configured ZooKeeperStorageIO with znodeBase: /configs/conf1
   [junit4]   2> 2299818 INFO  (coreLoadExecutor-8570-thread-1-processing-n:127.0.0.1:50685_) [n:127.0.0.1:50685_ c:collection1   x:collection1] o.a.s.r.ManagedResourceStorage Loaded null at path _rest_managed.json using ZooKeeperStorageIO:path=/configs/conf1
   [junit4]   2> 2299818 INFO  (coreLoadExecutor-8570-thread-1-processing-n:127.0.0.1:50685_) [n:127.0.0.1:50685_ c:collection1   x:collection1] o.a.s.h.ReplicationHandler Commits will be reserved for  10000
   [junit4]   2> 2299820 INFO  (searcherExecutor-8571-thread-1-processing-n:127.0.0.1:50685_ x:collection1 c:collection1) [n:127.0.0.1:50685_ c:collection1   x:collection1] o.a.s.c.SolrCore [collection1] Registered new searcher Searcher@7f91699[collection1] main{ExitableDirectoryReader(UninvertingDirectoryReader())}
   [junit4]   2> 2299820 INFO  (coreLoadExecutor-8570-thread-1-processing-n:127.0.0.1:50685_) [n:127.0.0.1:50685_ c:collection1   x:collection1] o.a.s.u.UpdateLog Could not find max version in index or recent updates, using new clock 1559439971485483008
   [junit4]   2> 2299825 INFO  (coreZkRegister-8565-thread-1-processing-n:127.0.0.1:50685_ x:collection1 c:collection1) [n:127.0.0.1:50685_ c:collection1 s:shard1 r:core_node2 x:collection1] o.a.s.c.ZkController Core needs to recover:collection1
   [junit4]   2> 2299825 INFO  (updateExecutor-3011-thread-1-processing-n:127.0.0.1:50685_ x:collection1 s:shard1 c:collection1 r:core_node2) [n:127.0.0.1:50685_ c:collection1 s:shard1 r:core_node2 x:collection1] o.a.s.u.DefaultSolrCoreState Running recovery
   [junit4]   2> 2299826 INFO  (recoveryExecutor-3012-thread-1-processing-n:127.0.0.1:50685_ x:collection1 s:shard1 c:collection1 r:core_node2) [n:127.0.0.1:50685_ c:collection1 s:shard1 r:core_node2 x:collection1] o.a.s.c.RecoveryStrategy Starting recovery process. recoveringAfterStartup=true
   [junit4]   2> 2299826 INFO  (recoveryExecutor-3012-thread-1-processing-n:127.0.0.1:50685_ x:collection1 s:shard1 c:collection1 r:core_node2) [n:127.0.0.1:50685_ c:collection1 s:shard1 r:core_node2 x:collection1] o.a.s.c.RecoveryStrategy ###### startupVersions=[[]]
   [junit4]   2> 2299826 INFO  (recoveryExecutor-3012-thread-1-processing-n:127.0.0.1:50685_ x:collection1 s:shard1 c:collection1 r:core_node2) [n:127.0.0.1:50685_ c:collection1 s:shard1 r:core_node2 x:collection1] o.a.s.c.RecoveryStrategy Begin buffering updates. core=[collection1]
   [junit4]   2> 2299826 INFO  (recoveryExecutor-3012-thread-1-processing-n:127.0.0.1:50685_ x:collection1 s:shard1 c:collection1 r:core_node2) [n:127.0.0.1:50685_ c:collection1 s:shard1 r:core_node2 x:collection1] o.a.s.u.UpdateLog Starting to buffer updates. FSUpdateLog{state=ACTIVE, tlog=null}
   [junit4]   2> 2299827 INFO  (recoveryExecutor-3012-thread-1-processing-n:127.0.0.1:50685_ x:collection1 s:shard1 c:collection1 r:core_node2) [n:127.0.0.1:50685_ c:collection1 s:shard1 r:core_node2 x:collection1] o.a.s.c.RecoveryStrategy Publishing state of core [collection1] as recovering, leader is [http://127.0.0.1:35916/collection1/] and I am [http://127.0.0.1:50685/collection1/]
   [junit4]   2> 2299831 INFO  (recoveryExecutor-3012-thread-1-processing-n:127.0.0.1:50685_ x:collection1 s:shard1 c:collection1 r:core_node2) [n:127.0.0.1:50685_ c:collection1 s:shard1 r:core_node2 x:collection1] o.a.s.c.RecoveryStrategy Sending prep recovery command to [http://127.0.0.1:35916]; [WaitForState: action=PREPRECOVERY&core=collection1&nodeName=127.0.0.1:50685_&coreNodeName=core_node2&state=recovering&checkLive=true&onlyIfLeader=true&onlyIfLeaderActive=true]
   [junit4]   2> 2299834 INFO  (qtp83545459-19666) [n:127.0.0.1:35916_    ] o.a.s.h.a.PrepRecoveryOp Going to wait for coreNodeName: core_node2, state: recovering, checkLive: true, onlyIfLeader: true, onlyIfLeaderActive: true
   [junit4]   2> 2299834 INFO  (qtp83545459-19666) [n:127.0.0.1:35916_    ] o.a.s.h.a.PrepRecoveryOp Will wait a max of 183 seconds to see collection1 (shard1 of collection1) have state: recovering
   [junit4]   2> 2299834 INFO  (qtp83545459-19666) [n:127.0.0.1:35916_    ] o.a.s.h.a.PrepRecoveryOp In WaitForState(recovering): collection=collection1, shard=shard1, thisCore=collection1, leaderDoesNotNeedRecovery=false, isLeader? true, live=true, checkLive=true, currentState=down, localState=active, nodeName=127.0.0.1:50685_, coreNodeName=core_node2, onlyIfActiveCheckResult=false, nodeProps: core_node2:{"core":"collection1","base_url":"http://127.0.0.1:50685","node_name":"127.0.0.1:50685_","state":"down"}
   [junit4]   2> 2300340 INFO  (TEST-PeerSyncReplicationTest.test-seed#[B92C63C447833C68]) [    ] o.a.s.SolrTestCaseJ4 Writing core.properties file to /export/home/jenkins/workspace/Lucene-Solr-master-Solaris/solr/build/solr-core/test/J0/temp/solr.cloud.PeerSyncReplicationTest_B92C63C447833C68-001/shard-3-001/cores/collection1
   [junit4]   2> 2300340 INFO  (TEST-PeerSyncReplicationTest.test-seed#[B92C63C447833C68]) [    ] o.a.s.c.AbstractFullDistribZkTestBase create jetty 3 in directory /export/home/jenkins/workspace/Lucene-Solr-master-Solaris/solr/build/solr-core/test/J0/temp/solr.cloud.PeerSyncReplicationTest_B92C63C447833C68-001/shard-3-001
   [junit4]   2> 2300341 INFO  (TEST-PeerSyncReplicationTest.test-seed#[B92C63C447833C68]) [    ] o.e.j.s.Server jetty-9.3.14.v20161028
   [junit4]   2> 2300342 INFO  (TEST-PeerSyncReplicationTest.test-seed#[B92C63C447833C68]) [    ] o.e.j.s.h.ContextHandler Started o.e.j.s.ServletContextHandler@17ed88b7{/,null,AVAILABLE}
   [junit4]   2> 2300343 INFO  (TEST-PeerSyncReplicationTest.test-seed#[B92C63C447833C68]) [    ] o.e.j.s.AbstractConnector Started ServerConnector@62b5bd7c{HTTP/1.1,[http/1.1]}{127.0.0.1:53451}
   [junit4]   2> 2300343 INFO  (TEST-PeerSyncReplicationTest.test-seed#[B92C63C447833C68]) [    ] o.e.j.s.Server Started @2304217ms
   [junit4]   2> 2300343 INFO  (TEST-PeerSyncReplicationTest.test-seed#[B92C63C447833C68]) [    ] o.a.s.c.s.e.JettySolrRunner Jetty properties: {solr.data.dir=/export/home/jenkins/workspace/Lucene-Solr-master-Solaris/solr/build/solr-core/test/J0/temp/solr.cloud.PeerSyncReplicationTest_B92C63C447833C68-001/tempDir-001/jetty3, solrconfig=solrconfig.xml, hostContext=/, hostPort=53451, coreRootDirectory=/export/home/jenkins/workspace/Lucene-Solr-master-Solaris/solr/build/solr-core/test/J0/temp/solr.cloud.PeerSyncReplicationTest_B92C63C447833C68-001/shard-3-001/cores}
   [junit4]   2> 2300343 ERROR (TEST-PeerSyncReplicationTest.test-seed#[B92C63C447833C68]) [    ] o.a.s.s.StartupLoggingUtils Missing Java Option solr.log.dir. Logging may be missing or incomplete.
   [junit4]   2> 2300343 INFO  (TEST-PeerSyncReplicationTest.test-seed#[B92C63C447833C68]) [    ] o.a.s.s.SolrDispatchFilter  ___      _       Welcome to Apache Solr? version 7.0.0
   [junit4]   2> 2300343 INFO  (TEST-PeerSyncReplicationTest.test-seed#[B92C63C447833C68]) [    ] o.a.s.s.SolrDispatchFilter / __| ___| |_ _   Starting in cloud mode on port null
   [junit4]   2> 2300343 INFO  (TEST-PeerSyncReplicationTest.test-seed#[B92C63C447833C68]) [    ] o.a.s.s.SolrDispatchFilter \__ \/ _ \ | '_|  Install dir: null
   [junit4]   2> 2300343 INFO  (TEST-PeerSyncReplicationTest.test-seed#[B92C63C447833C68]) [    ] o.a.s.s.SolrDispatchFilter |___/\___/_|_|    Start time: 2017-02-15T22:30:49.306Z
   [junit4]   2> 2300347 INFO  (TEST-PeerSyncReplicationTest.test-seed#[B92C63C447833C68]) [    ] o.a.s.s.SolrDispatchFilter Loading solr.xml from SolrHome (not found in ZooKeeper)
   [junit4]   2> 2300347 INFO  (TEST-PeerSyncReplicationTest.test-seed#[B92C63C447833C68]) [    ] o.a.s.c.SolrXmlConfig Loading container configuration from /export/home/jenkins/workspace/Lucene-Solr-master-Solaris/solr/build/solr-core/test/J0/temp/solr.cloud.PeerSyncReplicationTest_B92C63C447833C68-001/shard-3-001/solr.xml
   [junit4]   2> 2300353 INFO  (TEST-PeerSyncReplicationTest.test-seed#[B92C63C447833C68]) [    ] o.a.s.c.ZkContainer Zookeeper client=127.0.0.1:60907/solr
   [junit4]   2> 2300368 INFO  (TEST-PeerSyncReplicationTest.test-seed#[B92C63C447833C68]) [n:127.0.0.1:53451_    ] o.a.s.c.c.ZkStateReader Updated live nodes from ZooKeeper... (0) -> (3)
   [junit4]   2> 2300372 INFO  (TEST-PeerSyncReplicationTest.test-seed#[B92C63C447833C68]) [n:127.0.0.1:53451_    ] o.a.s.c.Overseer Overseer (id=null) closing
   [junit4]   2> 2300376 INFO  (TEST-PeerSyncReplicationTest.test-seed#[B92C63C447833C68]) [n:127.0.0.1:53451_    ] o.a.s.c.ZkController Register node as live in ZooKeeper:/live_nodes/127.0.0.1:53451_
   [junit4]   2> 2300378 INFO  (zkCallback-3003-thread-1) [    ] o.a.s.c.c.ZkStateReader Updated live nodes from ZooKeeper... (3) -> (4)
   [junit4]   2> 2300378 INFO  (zkCallback-3008-thread-1-processing-n:127.0.0.1:35916_) [n:127.0.0.1:35916_    ] o.a.s.c.c.ZkStateReader Updated live nodes from ZooKeeper... (3) -> (4)
   [junit4]   2> 2300378 INFO  (zkCallback-2999-thread-2-processing-n:127.0.0.1:62411_) [n:127.0.0.1:62411_    ] o.a.s.c.c.ZkStateReader Updated live nodes from ZooKeeper... (3) -> (4)
   [junit4]   2> 2300379 INFO  (zkCallback-3014-thread-1-processing-n:127.0.0.1:50685_) [n:127.0.0.1:50685_    ] o.a.s.c.c.ZkStateReader Updated live nodes from ZooKeeper... (3) -> (4)
   [junit4]   2> 2300379 INFO  (zkCallback-3021-thread-1-processing-n:127.0.0.1:53451_) [n:127.0.0.1:53451_    ] o.a.s.c.c.ZkStateReader Updated live nodes from ZooKeeper... (3) -> (4)
   [junit4]   2> 2300512 INFO  (TEST-PeerSyncReplicationTest.test-seed#[B92C63C447833C68]) [n:127.0.0.1:53451_    ] o.a.s.c.CorePropertiesLocator Found 1 core definitions underneath /export/home/jenkins/workspace/Lucene-Solr-master-Solaris/solr/build/solr-core/test/J0/temp/solr.cloud.PeerSyncReplicationTest_B92C63C447833C68-001/shard-3-001/cores
   [junit4]   2> 2300512 INFO  (TEST-PeerSyncReplicationTest.test-seed#[B92C63C447833C68]) [n:127.0.0.1:53451_    ] o.a.s.c.CorePropertiesLocator Cores are: [collection1]
   [junit4]   2> 2300514 INFO  (OverseerStateUpdate-97464997865783300-127.0.0.1:62411_-n_0000000000) [n:127.0.0.1:62411_    ] o.a.s.c.o.ReplicaMutator Assigning new node to shard shard=shard1
   [junit4]   2> 2300836 INFO  (qtp83545459-19666) [n:127.0.0.1:35916_    ] o.a.s.h.a.PrepRecoveryOp In WaitForState(recovering): collection=collection1, shard=shard1, thisCore=collection1, leaderDoesNotNeedRecovery=false, isLeader? true, live=true, checkLive=true, currentState=recovering, localState=active, nodeName=127.0.0.1:50685_, coreNodeName=core_node2, onlyIfActiveCheckResult=false, nodeProps: core_node2:{"core":"collection1","base_url":"http://127.0.0.1:50685","node_name":"127.0.0.1:50685_","state":"recovering"}
   [junit4]   2> 2300836 INFO  (qtp83545459-19666) [n:127.0.0.1:35916_    ] o.a.s.h.a.PrepRecoveryOp Waited coreNodeName: core_node2, state: recovering, checkLive: true, onlyIfLeader: true for: 1 seconds.
   [junit4]   2> 2300837 INFO  (qtp83545459-19666) [n:127.0.0.1:35916_    ] o.a.s.s.HttpSolrCall [admin] webapp=null path=/admin/cores params={nodeName=127.0.0.1:50685_&onlyIfLeaderActive=true&core=collection1&coreNodeName=core_node2&action=PREPRECOVERY&checkLive=true&state=recovering&onlyIfLeader=true&wt=javabin&version=2} status=0 QTime=1003
   [junit4]   2> 2301534 INFO  (coreLoadExecutor-8581-thread-1-processing-n:127.0.0.1:53451_) [n:127.0.0.1:53451_ c:collection1   x:collection1] o.a.s.c.SolrConfig Using Lucene MatchVersion: 7.0.0
   [junit4]   2> 2301546 INFO  (coreLoadExecutor-8581-thread-1-processing-n:127.0.0.1:53451_) [n:127.0.0.1:53451_ c:collection1   x:collection1] o.a.s.s.IndexSchema [collection1] Schema name=test
   [junit4]   2> 2301629 WARN  (coreLoadExecutor-8581-thread-1-processing-n:127.0.0.1:53451_) [n:127.0.0.1:53451_ c:collection1   x:collection1] o.a.s.s.IndexSchema [collection1] default search field in schema is text. WARNING: Deprecated, please use 'df' on request instead.
   [junit4]   2> 2301631 INFO  (coreLoadExecutor-8581-thread-1-processing-n:127.0.0.1:53451_) [n:127.0.0.1:53451_ c:collection1   x:collection1] o.a.s.s.IndexSchema Loaded schema test/1.0 with uniqueid field id
   [junit4]   2> 2301646 INFO  (coreLoadExecutor-8581-thread-1-processing-n:127.0.0.1:53451_) [n:127.0.0.1:53451_ c:collection1   x:collection1] o.a.s.c.CoreContainer Creating SolrCore 'collection1' using configuration from collection collection1
   [junit4]   2> 2301646 INFO  (coreLoadExecutor-8581-thread-1-processing-n:127.0.0.1:53451_) [n:127.0.0.1:53451_ c:collection1   x:collection1] o.a.s.c.SolrCore [[collection1] ] Opening new SolrCore at [/export/home/jenkins/workspace/Lucene-Solr-master-Solaris/solr/build/solr-core/test/J0/temp/solr.cloud.PeerSyncReplicationTest_B92C63C447833C68-001/shard-3-001/cores/collection1], dataDir=[/export/home/jenkins/workspace/Lucene-Solr-master-Solaris/solr/build/solr-core/test/J0/temp/solr.cloud.PeerSyncReplicationTest_B92C63C447833C68-001/shard-3-001/cores/collection1/data/]
   [junit4]   2> 2301647 INFO  (coreLoadExecutor-8581-thread-1-processing-n:127.0.0.1:53451_) [n:127.0.0.1:53451_ c:collection1   x:collection1] o.a.s.c.JmxMonitoredMap JMX monitoring is enabled. Adding Solr mbeans to JMX Server: com.sun.jmx.mbeanserver.JmxMBeanServer@66aef6fa
   [junit4]   2> 2301648 INFO  (coreLoadExecutor-8581-thread-1-processing-n:127.0.0.1:53451_) [n:127.0.0.1:53451_ c:collection1   x:collection1] o.a.s.u.RandomMergePolicy RandomMergePolicy wrapping class org.apache.lucene.index.LogByteSizeMergePolicy: [LogByteSizeMergePolicy: minMergeSize=1677721, mergeFactor=29, maxMergeSize=2147483648, maxMergeSizeForForcedMerge=9223372036854775807, calibrateSizeByDeletes=false, maxMergeDocs=2147483647, maxCFSSegmentSizeMB=8.796093022207999E12, noCFSRatio=0.45666949756497044]
   [junit4]   2> 2301655 WARN  (coreLoadExecutor-8581-thread-1-processing-n:127.0.0.1:53451_) [n:127.0.0.1:53451_ c:collection1   x:collection1] o.a.s.c.RequestHandlers INVALID paramSet a in requestHandler {type = requestHandler,name = /dump,class = DumpRequestHandler,attributes = {initParams=a, name=/dump, class=DumpRequestHandler},args = {defaults={a=A,b=B}}}
   [junit4]   2> 2301696 INFO  (coreLoadExecutor-8581-thread-1-processing-n:127.0.0.1:53451_) [n:127.0.0.1:53451_ c:collection1   x:collection1] o.a.s.u.UpdateHandler Using UpdateLog implementation: org.apache.solr.update.UpdateLog
   [junit4]   2> 2301696 INFO  (coreLoadExecutor-8581-thread-1-processing-n:127.0.0.1:53451_) [n:127.0.0.1:53451_ c:collection1   x:collection1] o.a.s.u.UpdateLog Initializing UpdateLog: dataDir= defaultSyncLevel=FLUSH numRecordsToKeep=1000 maxNumLogsToKeep=10 numVersionBuckets=65536
   [junit4]   2> 2301697 INFO  (coreLoadExecutor-8581-thread-1-processing-n:127.0.0.1:53451_) [n:127.0.0.1:53451_ c:collection1   x:collection1] o.a.s.u.CommitTracker Hard AutoCommit: disabled
   [junit4]   2> 2301697 INFO  (coreLoadExecutor-8581-thread-1-processing-n:127.0.0.1:53451_) [n:127.0.0.1:53451_ c:collection1   x:collection1] o.a.s.u.CommitTracker Soft AutoCommit: disabled
   [junit4]   2> 2301697 INFO  (coreLoadExecutor-8581-thread-1-processing-n:127.0.0.1:53451_) [n:127.0.0.1:53451_ c:collection1   x:collection1] o.a.s.u.RandomMergePolicy RandomMergePolicy wrapping class org.apache.lucene.index.TieredMergePolicy: [TieredMergePolicy: maxMergeAtOnce=27, maxMergeAtOnceExplicit=43, maxMergedSegmentMB=71.3134765625, floorSegmentMB=1.1767578125, forceMergeDeletesPctAllowed=23.85517895029442, segmentsPerTier=44.0, maxCFSSegmentSizeMB=8.796093022207999E12, noCFSRatio=1.0
   [junit4]   2> 2301698 INFO  (coreLoadExecutor-8581-thread-1-processing-n:127.0.0.1:53451_) [n:127.0.0.1:53451_ c:collection1   x:collection1] o.a.s.s.SolrIndexSearcher Opening [Searcher@10ca0186[collection1] main]
   [junit4]   2> 2301700 INFO  (coreLoadExecutor-8581-thread-1-processing-n:127.0.0.1:53451_) [n:127.0.0.1:53451_ c:collection1   x:collection1] o.a.s.r.ManagedResourceStorage Configured ZooKeeperStorageIO with znodeBase: /configs/conf1
   [junit4]   2> 2301700 INFO  (coreLoadExecutor-8581-thread-1-processing-n:127.0.0.1:53451_) [n:127.0.0.1:53451_ c:collection1   x:collection1] o.a.s.r.ManagedResourceStorage Loaded null at path _rest_managed.json using ZooKeeperStorageIO:path=/configs/conf1
   [junit4]   2> 2301700 INFO  (coreLoadExecutor-8581-thread-1-processing-n:127.0.0.1:53451_) [n:127.0.0.1:53451_ c:collection1   x:collection1] o.a.s.h.ReplicationHandler Commits will be reserved for  10000
   [junit4]   2> 2301702 INFO  (searcherExecutor-8582-thread-1-processing-n:127.0.0.1:53451_ x:collection1 c:collection1) [n:127.0.0.1:53451_ c:collection1   x:collection1] o.a.s.c.SolrCore [collection1] Registered new searcher Searcher@10ca0186[collection1] main{ExitableDirectoryReader(UninvertingDirectoryReader())}
   [junit4]   2> 2301702 INFO  (coreLoadExecutor-8581-thread-1-processing-n:127.0.0.1:53451_) [n:127.0.0.1:53451_ c:collection1   x:collection1] o.a.s.u.UpdateLog Could not find max version in index or recent updates, using new clock 1559439973458903040
   [junit4]   2> 2301708 INFO  (coreZkRegister-8576-thread-1-processing-n:127.0.0.1:53451_ x:collection1 c:collection1) [n:127.0.0.1:53451_ c:collection1 s:shard1 r:core_node3 x:collection1] o.a.s.c.ZkController Core needs to recover:collection1
   [junit4]   2> 2301708 INFO  (updateExecutor-3018-thread-1-processing-n:127.0.0.1:53451_ x:collection1 s:shard1 c:collection1 r:core_node3) [n:127.0.0.1:53451_ c:collection1 s:shard1 r:core_node3 x:collection1] o.a.s.u.DefaultSolrCoreState Running recovery
   [junit4]   2> 2301709 INFO  (recoveryExecutor-3019-thread-1-processing-n:127.0.0.1:53451_ x:collection1 s:shard1 c:collection1 r:core_node3) [n:127.0.0.1:53451_ c:collection1 s:shard1 r:core_node3 x:collection1] o.a.s.c.RecoveryStrategy Starting recovery process. recoveringAfterStartup=true
   [junit4]   2> 2301709 INFO  (recoveryExecutor-3019-thread-1-processing-n:127.0.0.1:53451_ x:collection1 s:shard1 c:collection1 r:core_node3) [n:127.0.0.1:53451_ c:collection1 s:shard1 r:core_node3 x:collection1] o.a.s.c.RecoveryStrategy ###### startupVersions=[[]]
   [junit4]   2> 2301709 INFO  (recoveryExecutor-3019-thread-1-processing-n:127.0.0.1:53451_ x:collection1 s:shard1 c:collection1 r:core_node3) [n:127.0.0.1:53451_ c:collection1 s:shard1 r:core_node3 x:collection1] o.a.s.c.RecoveryStrategy Begin buffering updates. core=[collection1]
   [junit4]   2> 2301709 INFO  (recoveryExecutor-3019-thread-1-processing-n:127.0.0.1:53451_ x:collection1 s:shard1 c:collection1 r:core_node3) [n:127.0.0.1:53451_ c:collection1 s:shard1 r:core_node3 x:collection1] o.a.s.u.UpdateLog Starting to buffer updates. FSUpdateLog{state=ACTIVE, tlog=null}
   [junit4]   2> 2301709 INFO  (recoveryExecutor-3019-thread-1-processing-n:127.0.0.1:53451_ x:collection1 s:shard1 c:collection1 r:core_node3) [n:127.0.0.1:53451_ c:collection1 s:shard1 r:core_node3 x:collection1] o.a.s.c.RecoveryStrategy Publishing state of core [collection1] as recovering, leader is [http://127.0.0.1:35916/collection1/] and I am [http://127.0.0.1:53451/collection1/]
   [junit4]   2> 2301714 INFO  (recoveryExecutor-3019-thread-1-processing-n:127.0.0.1:53451_ x:collection1 s:shard1 c:collection1 r:core_node3) [n:127.0.0.1:53451_ c:collection1 s:shard1 r:core_node3 x:collection1] o.a.s.c.RecoveryStrategy Sending prep recovery command to [http://127.0.0.1:35916]; [WaitForState: action=PREPRECOVERY&core=collection1&nodeName=127.0.0.1:53451_&coreNodeName=core_node3&state=recovering&checkLive=true&onlyIfLeader=true&onlyIfLeaderActive=true]
   [junit4]   2> 2301715 INFO  (qtp83545459-19670) [n:127.0.0.1:35916_    ] o.a.s.h.a.PrepRecoveryOp Going to wait for coreNodeName: core_node3, state: recovering, checkLive: true, onlyIfLeader: true, onlyIfLeaderActive: true
   [junit4]   2> 2301716 INFO  (qtp83545459-19670) [n:127.0.0.1:35916_    ] o.a.s.h.a.PrepRecoveryOp Will wait a max of 183 seconds to see collection1 (shard1 of collection1) have state: recovering
   [junit4]   2> 2301716 INFO  (qtp83545459-19670) [n:127.0.0.1:35916_    ] o.a.s.h.a.PrepRecoveryOp In WaitForState(recovering): collection=collection1, shard=shard1, thisCore=collection1, leaderDoesNotNeedRecovery=false, isLeader? true, live=true, checkLive=true, currentState=down, localState=active, nodeName=127.0.0.1:53451_, coreNodeName=core_node3, onlyIfActiveCheckResult=false, nodeProps: core_node3:{"core":"collection1","base_url":"http://127.0.0.1:53451","node_name":"127.0.0.1:53451_","state":"down"}
   [junit4]   2> 2302099 INFO  (TEST-PeerSyncReplicationTest.test-seed#[B92C63C447833C68]) [    ] o.a.s.SolrTestCaseJ4 ###Starting test
   [junit4]   2> 2302100 INFO  (TEST-PeerSyncReplicationTest.test-seed#[B92C63C447833C68]) [    ] o.a.s.c.AbstractFullDistribZkTestBase Wait for recoveries to finish - wait 30 for each attempt
   [junit4]   2> 2302100 INFO  (TEST-PeerSyncReplicationTest.test-seed#[B92C63C447833C68]) [    ] o.a.s.c.AbstractDistribZkTestBase Wait for recoveries to finish - collection: collection1 failOnTimeout:true timeout (sec):30
   [junit4]   2> 2302717 INFO  (qtp83545459-19670) [n:127.0.0.1:35916_    ] o.a.s.h.a.PrepRecoveryOp In WaitForState(recovering): collection=collection1, shard=shard1, thisCore=collection1, leaderDoesNotNeedRecovery=false, isLeader? true, live=true, checkLive=true, currentState=recovering, localState=active, nodeName=127.0.0.1:53451_, coreNodeName=core_node3, onlyIfActiveCheckResult=false, nodeProps: core_node3:{"core":"collection1","base_url":"http://127.0.0.1:53451","node_name":"127.0.0.1:53451_","state":"recovering"}
   [junit4]   2> 2302717 INFO  (qtp83545459-19670) [n:127.0.0.1:35916_    ] o.a.s.h.a.PrepRecoveryOp Waited coreNodeName: core_node3, state: recovering, checkLive: true, onlyIfLeader: true for: 1 seconds.
   [junit4]   2> 2302717 INFO  (qtp83545459-19670) [n:127.0.0.1:35916_    ] o.a.s.s.HttpSolrCall [admin] webapp=null path=/admin/cores params={nodeName=127.0.0.1:53451_&onlyIfLeaderActive=true&core=collection1&coreNodeName=core_node3&action=PREPRECOVERY&checkLive=true&state=recovering&onlyIfLeader=true&wt=javabin&version=2} status=0 QTime=1002
   [junit4]   2> 2307837 INFO  (recoveryExecutor-3012-thread-1-processing-n:127.0.0.1:50685_ x:collection1 s:shard1 c:collection1 r:core_node2) [n:127.0.0.1:50685_ c:collection1 s:shard1 r:core_node2 x:collection1] o.a.s.c.RecoveryStrategy Attempting to PeerSync from [http://127.0.0.1:35916/collection1/] - recoveringAfterStartup=[true]
   [junit4]   2> 2307837 INFO  (recoveryExecutor-3012-thread-1-processing-n:127.0.0.1:50685_ x:collection1 s:shard1 c:collection1 r:core_node2) [n:127.0.0.1:50685_ c:collection1 s:shard1 r:core_node2 x:collection1] o.a.s.u.PeerSync PeerSync: core=collection1 url=http://127.0.0.1:50685 START replicas=[http://127.0.0.1:35916/collection1/] nUpdates=1000
   [junit4]   2> 2307840 INFO  (qtp83545459-19667) [n:127.0.0.1:35916_ c:collection1 s:shard1 r:core_node1 x:collection1] o.a.s.u.IndexFingerprint IndexFingerprint millis:0.0 result:{maxVersionSpecified=9223372036854775807, maxVersionEncountered=0, maxInHash=0, versionsHash=0, numVersions=0, numDocs=0, maxDoc=0}
   [junit4]   2> 2307840 INFO  (qtp83545459-19667) [n:127.0.0.1:35916_ c:collection1 s:shard1 r:core_node1 x:collection1] o.a.s.c.S.Request [collection1]  webapp= path=/get params={distrib=false&qt=/get&getFingerprint=9223372036854775807&wt=javabin&version=2} status=0 QTime=0
   [junit4]   2> 2307840 INFO  (recoveryExecutor-3012-thread-1-processing-n:127.0.0.1:50685_ x:collection1 s:shard1 c:collection1 r:core_node2) [n:127.0.0.1:50685_ c:collection1 s:shard1 r:core_node2 x:collection1] o.a.s.u.IndexFingerprint IndexFingerprint millis:0.0 result:{maxVersionSpecified=9223372036854775807, maxVersionEncountered=0, maxInHash=0, versionsHash=0, numVersions=0, numDocs=0, maxDoc=0}
   [junit4]   2> 2307840 INFO  (recoveryExecutor-3012-thread-1-processing-n:127.0.0.1:50685_ x:collection1 s:shard1 c:collection1 r:core_node2) [n:127.0.0.1:50685_ c:collection1 s:shard1 r:core_node2 x:collection1] o.a.s.u.PeerSync We are already in sync. No need to do a PeerSync 
   [junit4]   2> 2307840 INFO  (recoveryExecutor-3012-thread-1-processing-n:127.0.0.1:50685_ x:collection1 s:shard1 c:collection1 r:core_node2) [n:127.0.0.1:50685_ c:collection1 s:shard1 r:core_node2 x:collection1] o.a.s.u.DirectUpdateHandler2 start commit{,optimize=false,openSearcher=true,waitSearcher=true,expungeDeletes=false,softCommit=false,prepareCommit=false}
   [junit4]   2> 2307841 INFO  (recoveryExecutor-3012-thread-1-processing-n:127.0.0.1:50685_ x:collection1 s:shard1 c:collection1 r:core_node2) [n:127.0.0.1:50685_ c:collection1 s:shard1 r:core_node2 x:collection1] o.a.s.u.DirectUpdateHandler2 No uncommitted changes. Skipping IW.commit.
   [junit4]   2> 2307842 INFO  (recoveryExecutor-3012-thread-1-processing-n:127.0.0.1:50685_ x:collection1 s:shard1 c:collection1 r:core_node2) [n:127.0.0.1:50685_ c:collection1 s:shard1 r:core_node2 x:collection1] o.a.s.u.DirectUpdateHandler2 end_commit_flush
   [junit4]   2> 2307842 INFO  (recoveryExecutor-3012-thread-1-processing-n:127.0.0.1:50685_ x:collection1 s:shard1 c:collection1 r:core_node2) [n:127.0.0.1:50685_ c:collection1 s:shard1 r:core_node2 x:collection1] o.a.s.c.RecoveryStrategy PeerSync stage of recovery was successful.
   [junit4]   2> 2307842 INFO  (recoveryExecutor-3012-thread-1-processing-n:127.0.0.1:50685_ x:collection1 s:shard1 c:collection1 r:core_node2) [n:127.0.0.1:50685_ c:collection1 s:shard1 r:core_node2 x:collection1] o.a.s.c.RecoveryStrategy Replaying updates buffered during PeerSync.
   [junit4]   2> 2307842 INFO  (recoveryExecutor-3012-thread-1-processing-n:127.0.0.1:50685_ x:collection1 s:shard1 c:collection1 r:core_node2) [n:127.0.0.1:50685_ c:collection1 s:shard1 r:core_node2 x:collection1] o.a.s.c.RecoveryStrategy No replay needed.
   [junit4]   2> 2307842 INFO  (recoveryExecutor-3012-thread-1-processing-n:127.0.0.1:50685_ x:collection1 s:shard1 c:collection1 r:core_node2) [n:127.0.0.1:50685_ c:collection1 s:shard1 r:core_node2 x:collection1] o.a.s.c.RecoveryStrategy Registering as Active after recovery.
   [junit4]   2> 2309718 INFO  (recoveryExecutor-3019-thread-1-processing-n:127.0.0.1:53451_ x:collection1 s:shard1 c:collection1 r:core_node3) [n:127.0.0.1:53451_ c:collection1 s:shard1 r:core_node3 x:collection1] o.a.s.c.RecoveryStrategy Attempting to PeerSync from [http://127.0.0.1:35916/collection1/] - recoveringAfterStartup=[true]
   [junit4]   2> 2309718 INFO  (recoveryExecutor-3019-thread-1-processing-n:127.0.0.1:53451_ x:collection1 s:shard1 c:collection1 r:core_node3) [n:127.0.0.1:53451_ c:collection1 s:shard1 r:core_node3 x:collection1] o.a.s.u.PeerSync PeerSync: core=collection1 url=http://127.0.0.1:53451 START replicas=[http://127.0.0.1:35916/collection1/] nUpdates=1000
   [junit4]   2> 2309721 INFO  (qtp83545459-19669) [n:127.0.0.1:35916_ c:collection1 s:shard1 r:core_node1 x:collection1] o.a.s.u.IndexFingerprint IndexFingerprint millis:0.0 result:{maxVersionSpecified=9223372036854775807, maxVersionEncountered=0, maxInHash=0, versionsHash=0, numVersions=0, numDocs=0, maxDoc=0}
   [junit4]   2> 2309721 INFO  (qtp83545459-19669) [n:127.0.0.1:35916_ c:collection1 s:shard1 r:core_node1 x:collection1] o.a.s.c.S.Request [collection1]  webapp= path=/get params={distrib=false&qt=/get&getFingerprint=9223372036854775807&wt=javabin&version=2} status=0 QTime=0
   [junit4]   2> 2309721 INFO  (recoveryExecutor-3019-thread-1-processing-n:127.0.0.1:53451_ x:collection1 s:shard1 c:collection1 r:core_node3) [n:127.0.0.1:53451_ c:collection1 s:shard1 r:core_node3 x:collection1] o.a.s.u.IndexFingerprint IndexFingerprint millis:0.0 result:{maxVersionSpecified=9223372036854775807, maxVersionEncountered=0, maxInHash=0, versionsHash=0, numVersions=0, numDocs=0, maxDoc=0}
   [junit4]   2> 2309722 INFO  (recoveryExecutor-3019-thread-1-processing-n:127.0.0.1:53451_ x:collection1 s:shard1 c:collection1 r:core_node3) [n:127.0.0.1:53451_ c:collection1 s:shard1 r:core_node3 x:collection1] o.a.s.u.PeerSync We are already in sync. No need to do a PeerSync 
   [junit4]   2> 2309722 INFO  (recoveryExecutor-3019-thread-1-processing-n:127.0.0.1:53451_ x:collection1 s:shard1 c:collection1 r:core_node3) [n:127.0.0.1:53451_ c:collection1 s:shard1 r:core_node3 x:collection1] o.a.s.u.DirectUpdateHandler2 start commit{,optimize=false,openSearcher=true,waitSearcher=true,expungeDeletes=false,softCommit=false,prepareCommit=false}
   [junit4]   2> 2309722 INFO  (recoveryExecutor-3019-thread-1-processing-n:127.0.0.1:53451_ x:collection1 s:shard1 c:collection1 r:core_node3) [n:127.0.0.1:53451_ c:collection1 s:shard1 r:core_node3 x:collection1] o.a.s.u.DirectUpdateHandler2 No uncommitted changes. Skipping IW.commit.
   [junit4]   2> 2309723 INFO  (recoveryExecutor-3019-thread-1-processing-n:127.0.0.1:53451_ x:collection1 s:shard1 c:collection1 r:core_node3) [n:127.0.0.1:53451_ c:collection1 s:shard1 r:core_node3 x:collection1] o.a.s.u.DirectUpdateHandler2 end_commit_flush
   [junit4]   2> 2309724 INFO  (recoveryExecutor-3019-thread-1-processing-n:127.0.0.1:53451_ x:collection1 s:shard1 c:collection1 r:core_node3) [n:127.0.0.1:53451_ c:collection1 s:shard1 r:core_node3 x:collection1] o.a.s.c.RecoveryStrategy PeerSync stage of recovery was successful.
   [junit4]   2> 2309724 INFO  (recoveryExecutor-3019-thread-1-processing-n:127.0.0.1:53451_ x:collection1 s:shard1 c:collection1 r:core_node3) [n:127.0.0.1:53451_ c:collection1 s:shard1 r:core_node3 x:collection1] o.a.s.c.RecoveryStrategy Replaying updates buffered during PeerSync.
   [junit4]   2> 2309724 INFO  (recoveryExecutor-3019-thread-1-processing-n:127.0.0.1:53451_ x:collection1 s:shard1 c:collection1 r:core_node3) [n:127.0.0.1:53451_ c:collection1 s:shard1 r:core_node3 x:collection1] o.a.s.c.RecoveryStrategy No replay needed.
   [junit4]   2> 2309724 INFO  (recoveryExecutor-3019-thread-1-processing-n:127.0.0.1:53451_ x:collection1 s:shard1 c:collection1 r:core_node3) [n:127.0.0.1:53451_ c:collection1 s:shard1 r:core_node3 x:collection1] o.a.s.c.RecoveryStrategy Registering as Active after recovery.
   [junit4]   2> 2310115 INFO  (TEST-PeerSyncReplicationTest.test-seed#[B92C63C447833C68]) [    ] o.a.s.c.AbstractDistribZkTestBase Recoveries finished - collection: collection1
   [junit4]   2> 2310118 INFO  (qtp2058570968-19630) [n:127.0.0.1:62411_ c:control_collection s:shard1 r:core_node1 x:collection1] o.a.s.u.DirectUpdateHandler2 start commit{,optimize=false,openSearcher=true,waitSearcher=true,expungeDeletes=false,softCommit=false,prepareCommit=false}
   [junit4]   2> 2310118 INFO  (qtp2058570968-19630) [n:127.0.0.1:62411_ c:control_collection s:shard1 r:core_node1 x:collection1] o.a.s.u.DirectUpdateHandler2 No uncommitted changes. Skipping IW.commit.
   [junit4]   2> 2310119 INFO  (qtp2058570968-19630) [n:127.0.0.1:62411_ c:control_collection s:shard1 r:core_node1 x:collection1] o.a.s.u.DirectUpdateHandler2 end_commit_flush
   [junit4]   2> 2310119 INFO  (qtp2058570968-19630) [n:127.0.0.1:62411_ c:control_collection s:shard1 r:core_node1 x:collection1] o.a.s.u.p.LogUpdateProcessorFactory [collection1]  webapp= path=/update params={waitSearcher=true&commit=true&softCommit=false&wt=javabin&version=2}{commit=} 0 1
   [junit4]   2> 2310123 INFO  (qtp83545459-19666) [n:127.0.0.1:35916_ c:collection1 s:shard1 r:core_node1 x:collection1] o.a.s.u.DirectUpdateHandler2 start commit{,optimize=false,openSearcher=true,waitSearcher=true,expungeDeletes=false,softCommit=false,prepareCommit=false}
   [junit4]   2> 2310124 INFO  (qtp83545459-19666) [n:127.0.0.1:35916_ c:collection1 s:shard1 r:core_node1 x:collection1] o.a.s.u.DirectUpdateHandler2 No uncommitted changes. Skipping IW.commit.
   [junit4]   2> 2310125 INFO  (qtp362875608-19694) [n:127.0.0.1:50685_ c:collection1 s:shard1 r:core_node2 x:collection1] o.a.s.u.DirectUpdateHandler2 start commit{,optimize=false,openSearcher=true,waitSearcher=true,expungeDeletes=false,softCommit=false,prepareCommit=false}
   [junit4]   2> 2310126 INFO  (qtp362875608-19694) [n:127.0.0.1:50685_ c:collection1 s:shard1 r:core_node2 x:collection1] o.a.s.u.DirectUpdateHandler2 No uncommitted changes. Skipping IW.commit.
   [junit4]   2> 2310126 INFO  (qtp83545459-19666) [n:127.0.0.1:35916_ c:collection1 s:shard1 r:core_node1 x:collection1] o.a.s.u.DirectUpdateHandler2 end_commit_flush
   [junit4]   2> 2310126 INFO  (qtp362875608-19694) [n:127.0.0.1:50685_ c:collection1 s:shard1 r:core_node2 x:collection1] o.a.s.u.DirectUpdateHandler2 end_commit_flush
   [junit4]   2> 2310126 INFO  (qtp362875608-19694) [n:127.0.0.1:50685_ c:collection1 s:shard1 r:core_node2 x:collection1] o.a.s.u.p.LogUpdateProcessorFactory [collection1]  webapp= path=/update params={update.distrib=FROMLEADER&waitSearcher=true&openSearcher=true&commit=true&softCommit=false&distrib.from=http://127.0.0.1:35916/collection1/&commit_end_point=true&wt=javabin&version=2&expungeDeletes=false}{commit=} 0 1
   [junit4]   2> 2310127 INFO  (qtp83545459-19666) [n:127.0.0.1:35916_ c:collection1 s:shard1 r:core_node1 x:collection1] o.a.s.u.p.LogUpdateProcessorFactory [collection1]  webapp= path=/update params={update.distrib=FROMLEADER&waitSearcher=true&openSearcher=true&commit=true&softCommit=false&distrib.from=http://127.0.0.1:35916/collection1/&commit_end_point=true&wt=javabin&version=2&expungeDeletes=false}{commit=} 0 5
   [junit4]   2> 2310127 INFO  (qtp1560167540-19729) [n:127.0.0.1:53451_ c:collection1 s:shard1 r:core_node3 x:collection1] o.a.s.u.DirectUpdateHandler2 start commit{,optimize=false,openSearcher=true,waitSearcher=true,expungeDeletes=false,softCommit=false,prepareCommit=false}
   [junit4]   2> 2310127 INFO  (qtp1560167540-19729) [n:127.0.0.1:53451_ c:collection1 s:shard1 r:core_node3 x:collection1] o.a.s.u.DirectUpdateHandler2 No uncommitted changes. Skipping IW.commit.
   [junit4]   2> 2310128 INFO  (qtp1560167540-19729) [n:127.0.0.1:53451_ c:collection1 s:shard1 r:core_node3 x:collection1] o.a.s.u.DirectUpdateHandler2 end_commit_flush
   [junit4]   2> 2310128 INFO  (qtp1560167540-19729) [n:127.0.0.1:53451_ c:collection1 s:shard1 r:core_node3 x:collection1] o.a.s.u.p.LogUpdateProcessorFactory [collection1]  webapp= path=/update params={update.distrib=FROMLEADER&waitSearcher=true&openSearcher=true&commit=true&softCommit=false&distrib.from=http://127.0.0.1:35916/collection1/&commit_end_point=true&wt=javabin&version=2&expungeDeletes=false}{commit=} 0 0
   [junit4]   2> 2310128 INFO  (qtp83545459-19671) [n:127.0.0.1:35916_ c:collection1 s:shard1 r:core_node1 x:collection1] o.a.s.u.p.LogUpdateProcessorFactory [collection1]  webapp= path=/update params={waitSearcher=true&commit=true&softCommit=false&wt=javabin&version=2}{commit=} 0 7
   [junit4]   2> 2310130 INFO  (qtp83545459-19668) [n:127.0.0.1:35916_ c:collection1 s:shard1 r:core_node1 x:collection1] o.a.s.c.S.Request [collection1]  webapp= path=/select params={q=*:*&distrib=false&tests=checkShardConsistency&rows=0&wt=javabin&version=2} hits=0 status=0 QTime=0
   [junit4]   2> 2310132 INFO  (qtp362875608-19696) [n:127.0.0.1:50685_ c:collection1 s:shard1 r:core_node2 x:collection1] o.a.s.c.S.Request [collection1]  webapp= path=/select params={q=*:*&distrib=false&tests=checkShardConsistency&rows=0&wt=javabin&version=2} hits=0 status=0 QTime=0
   [junit4]   2> 2310133 INFO  (qtp1560167540-19731) [n:127.0.0.1:53451_ c:collection1 s:shard1 r:core_node3 x:collection1] o.a.s.c.S.Request [collection1]  webapp= path=/select params={q=*:*&distrib=false&tests=checkShardConsistency&rows=0&wt=javabin&version=2} hits=0 status=0 QTime=0
   [junit4]   2> 2312137 INFO  (qtp2058570968-19629) [n:127.0.0.1:62411_ c:control_collection s:shard1 r:core_node1 x:collection1] o.a.s.u.p.LogUpdateProcessorFactory [collection1]  webapp= path=/update params={wt=javabin&version=2}{deleteByQuery=*:* (-1559439984398696448)} 0 2
   [junit4]   2> 2312142 INFO  (qtp362875608-19697) [n:127.0.0.1:50685_ c:collection1 s:shard1 r:core_node2 x:collection1] o.a.s.u.p.LogUpdateProcessorFactory [collection1]  webapp= path=/update params={update.distrib=FROMLEADER&_version_=-1559439984400793600&distrib.from=http://127.0.0.1:35916/collection1/&wt=javabin&version=2}{deleteByQuery=*:* (-1559439984400793600)} 0 2
   [junit4]   2> 2312142 INFO  (qtp1560167540-19732) [n:127.0.0.1:53451_ c:collection1 s:shard1 r:core_node3 x:collection1] o.a.s.u.p.LogUpdateProcessorFactory [collection1]  webapp= path=/update params={update.distrib=FROMLEADER&_version_=-1559439984400793600&distrib.from=http://127.0.0.1:35916/collection1/&wt=javabin&version=2}{deleteByQuery=*:* (-1559439984400793600)} 0 2
   [junit4]   2> 2312143 INFO  (qtp83545459-19669) [n:127.0.0.1:35916_ c:collection1 s:shard1 r:core_node1 x:collection1] o.a.s.u.p.LogUpdateProcessorFactory [collection1]  webapp= path=/update params={wt=javabin&version=2}{deleteByQuery=*:* (-1559439984400793600)} 0 5
   [junit4]   2> 2312146 INFO  (qtp362875608-19698) [n:127.0.0.1:50685_ c:collection1 s:shard1 r:core_node2 x:collection1] o.a.s.u.p.LogUpdateProcessorFactory [collection1]  webapp= path=/update params={update.distrib=FROMLEADER&distrib.from=http://127.0.0.1:35916/collection1/&wt=javabin&version=2}{add=[0 (1559439984408133632)]} 0 1
   [junit4]   2> 2312146 INFO  (qtp1560167540-19733) [n:127.0.0.1:53451_ c:collection1 s:shard1 r:core_node3 x:collection1] o.a.s.u.p.LogUpdateProcessorFactory [collection1]  webapp= path=/update params={update.distrib=FROMLEADER&distrib.from=http://127.0.0.1:35916/collection1/&wt=javabin&version=2}{add=[0 (1559439984408133632)]} 0 0
   [junit4]   2> 2312146 INFO  (qtp83545459-19670) [n:127.0.0.1:35916_ c:collection1 s:shard1 r:core_node1 x:collection1] o.a.s.u.p.LogUpdateProcessorFactory [collection1]  webapp= path=/update params={wt=javabin&version=2}{add=[0 (1559439984408133632)]} 0 3
   [junit4]   2> 2312148 INFO  (qtp362875608-19699) [n:127.0.0.1:50685_ c:collection1 s:shard1 r:core_node2 x:collection1] o.a.s.u.p.LogUpdateProcessorFactory [collection1]  webapp= path=/update params={update.distrib=FROMLEADER&distrib.from=http://127.0.0.1:35916/collection1/&wt=javabin&version=2}{add=[1 (1559439984411279360)]} 0 0
   [junit4]   2> 2312148 INFO  (qtp1560167540-19734) [n:127.0.0.1:53451_ c:collection1 s:shard1 r:core_node3 x:collection1] o.a.s.u.p.LogUpdateProcessorFactory [collection1]  webapp= path=/update params={update.distrib=FROMLEADER&distrib.from=http://127.0.0.1:35916/collection1/&wt=javabin&version=2}{add=[1 (1559439984411279360)]} 0 0
   [junit4]   2> 2312148 INFO  (qtp83545459-19664) [n:127.0.0.1:35916_ c:collection1 s:shard1 r:core_node1 x:collection1] o.a.s.u.p.LogUpdateProcessorFactory [collection1]  webapp= path=/update params={wt=javabin&version=2}{add=[1 (1559439984411279360)]} 0 1
   [junit4]   2> 2312149 INFO  (qtp362875608-19692) [n:127.0.0.1:50685_ c:collection1 s:shard1 r:core_node2 x:collection1] o.a.s.u.p.LogUpdateProcessorFactory [collection1]  webapp= path=/update params={update.distrib=FROMLEADER&distrib.from=http://127.0.0.1:35916/collection1/&wt=javabin&version=2}{add=[2 (1559439984413376512)]} 0 0
   [junit4]   2> 2312149 INFO  (qtp1560167540-19727) [n:127.0.0.1:53451_ c:collection1 s:shard1 r:core_node3 x:collection1] o.a.s.u.p.LogUpdateProcessorFactory [collection1]  webapp= path=/update params={update.distrib=FROMLEADER&distrib.from=http://127.0.0.1:35916/collection1/&wt=javabin&version=2}{add=[2 (1559439984413376512)]} 0 0
   [junit4]   2> 2312150 INFO  (qtp83545459-19666) [n:127.0.0.1:35916_ c:collection1 s:shard1 r:core_node1 x:collection1] o.a.s.u.p.LogUpdateProcessorFactory [collection1]  webapp= path=/update params={wt=javabin&version=2}{add=[2 (1559439984413376512)]} 0 1
   [junit4]   2> 2312151 INFO  (qtp362875608-19694) [n:127.0.0.1:50685_ c:collection1 s:shard1 r:core_node2 x:collection1] o.a.s.u.p.LogUpdateProcessorFactory [collection1]  webapp= path=/update params={update.distrib=FROMLEADER&distrib.from=http://127.0.0.1:35916/collection1/&wt=javabin&version=2}{add=[3 (1559439984414425088)]} 0 0
   [junit4]   2> 2312151 INFO  (qtp1560167540-19729) [n:127.0.0.1:53451_ c:collection1 s:shard1 r:core_node3 x:collection1] o.a.s.u.p.LogUpdateProcessorFactory [collection1]  webapp= path=/update params={update.distrib=FROMLEADER&distrib.from=http://127.0.0.1:35916/collection1/&wt=javabin&version=2}{add=[3 (1559439984414425088)]} 0 0
   [junit4]   2> 2312152 INFO  (qtp83545459-19671) [n:127.0.0.1:35916_ c:collection1 s:shard1 r:core_node1 x:collection1] o.a.s.u.p.LogUpdateProcessorFactory [collection1]  webapp= path=/update params={wt=javabin&version=2}{add=[3 (1559439984414425088)]} 0 1
   [junit4]   2> 2312153 INFO  (qtp362875608-19695) [n:127.0.0.1:50685_ c:collection1 s:shard1 r:core_node2 x:collection1] o.a.s.u.p.LogUpdateProcessorFactory [collection1]  webapp= path=/update params={update.distrib=FROMLEADER&distrib.from=http://127.0.0.1:35916/collection1/&wt=javabin&version=2}{add=[4 (1559439984416522240)]} 0 0
   [junit4]   2> 2312153 INFO  (qtp1560167540-19730) [n:127.0.0.1:53451_ c:collection1 s:shard1 r:core_node3 x:collection1] o.a.s.u.p.LogUpdateProcessorFactory [collection1]  webapp= path=/update params={update.distrib=FROMLEADER&distrib.from=http://127.0.0.1:35916/collection1/&wt=javabin&version=2}{add=[4 (1559439984416522240)]} 0 0
   [junit4]   2> 2312153 INFO  (qtp83545459-19667) [n:127.0.0.1:35916_ c:collection1 s:shard1 r:core_node1 x:collection1] o.a.s.u.p.LogUpdateProcessorFactory [collection1]  webapp= path=/update params={wt=javabin&version=2}{add=[4 (1559439984416522240)]} 0 1
   [junit4]   2> 2312155 INFO  (qtp362875608-19696) [n:127.0.0.1:50685_ c:collection1 s:shard1 r:core_node2 x:collection1] o.a.s.u.p.LogUpdateProcessorFactory [collection1]  webapp= path=/update params={update.distrib=FROMLEADER&distrib.from=http://127.0.0.1:35916/collection1/&wt=javabin&version=2}{add=[5 (1559439984418619392)]} 0 0
   [junit4]   2> 2312155 INFO  (qtp1560167540-19731) [n:127.0.0.1:53451_ c:collection1 s:shard1 r:core_node3 x:collection1] o.a.s.u.p.LogUpdateProcessorFactory [collection1]  webapp= path=/update params={update.distrib=FROMLEADER&distrib.from=http://127.0.0.1:35916/collection1/&wt=javabin&version=2}{add=[5 (1559439984418619392)]} 0 0
   [junit4]   2> 2312155 INFO  (qtp83545459-19668) [n:127.0.0.1:35916_ c:collection1 s:shard1 r:core_node1 x:collection1] o.a.s.u.p.LogUpdateProcessorFactory [collection1]  webapp= path=/update params={wt=javabin&version=2}{add=[5 (1559439984418619392)]} 0 1
   [junit4]   2> 2312156 INFO  (qtp362875608-19696) [n:127.0.0.1:50685_ c:collection1 s:shard1 r:core_node2 x:collection1] o.a.s.u.p.LogUpdateProcessorFactory [collection1]  webapp= path=/update params={update.distrib=FROMLEADER&distrib.from=http://127.0.0.1:35916/collection1/&wt=javabin&version=2}{add=[6 (1559439984420716544)]} 0 0
   [junit4]   2> 2312156 INFO  (qtp1560167540-19731) [n:127.0.0.1:53451_ c:collection1 s:shard1 r:core_node3 x:collection1] o.a.s.u.p.LogUpdateProcessorFactory [collection1]  webapp= path=/update params={update.distrib=FROMLEADER&distrib.from=http://127.0.0.1:35916/collection1/&wt=javabin&version=2}{add=[6 (1559439984420716544)]} 0 0
   [junit4]   2> 2312157 INFO  (qtp83545459-19669) [n:127.0.0.1:35916_ c:collection1 s:shard1 r:core_node1 x:collection1] o.a.s.u.p.LogUpdateProcessorFactory [collection1]  webapp= path=/update params={wt=javabin&version=2}{add=[6 (1559439984420716544)]} 0 0
   [junit4]   2> 2312158 INFO  (qtp362875608-19698) [n:127.0.0.1:50685_ c:collection1 s:shard1 r:core_node2 x:collection1] o.a.s.u.p.LogUpdateProcessorFactory [collection1]  webapp= path=/update params={update.distrib=FROMLEADER&distrib.from=http://127.0.0.1:35916/collection1/&wt=javabin&version=2}{add=[7 (1559439984421765120)]} 0 0
   [junit4]   2> 2312158 INFO  (qtp1560167540-19733) [n:127.0.0.1:53451_ c:collection1 s:shard1 r:core_node3 x:collection1] o.a.s.u.p.LogUpdateProcessorFactory [collection1]  webapp= path=/update params={update.distrib=FROMLEADER&distrib.from=http://127.0.0.1:35916/collection1/&wt=javabin&version=2}{add=[7 (1559439984421765120)]} 0 0
   [junit4]   2> 2312158 INFO  (qtp83545459-19670) [n:127.0.0.1:35916_ c:collection1 s:shard1 r:core_node1 x:collection1] o.a.s.u.p.LogUpdateProcessorFactory [collection1]  weba

[...truncated too long message...]

O  (Thread-5205) [    ] o.a.s.c.ZkTestServer connecting to 127.0.0.1:60907 60907
   [junit4]   2> 2502417 WARN  (Thread-5205) [    ] o.a.s.c.ZkTestServer Watch limit violations: 
   [junit4]   2> Maximum concurrent create/delete watches above limit:
   [junit4]   2> 
   [junit4]   2> 	6	/solr/aliases.json
   [junit4]   2> 	6	/solr/clusterprops.json
   [junit4]   2> 	5	/solr/security.json
   [junit4]   2> 	5	/solr/configs/conf1
   [junit4]   2> 	4	/solr/collections/collection1/state.json
   [junit4]   2> 
   [junit4]   2> Maximum concurrent data watches above limit:
   [junit4]   2> 
   [junit4]   2> 	6	/solr/clusterstate.json
   [junit4]   2> 	2	/solr/collections/collection1/leader_elect/shard1/election/97464997865783304-core_node1-n_0000000000
   [junit4]   2> 	2	/solr/overseer_elect/election/97464997865783304-127.0.0.1:35916_-n_0000000001
   [junit4]   2> 
   [junit4]   2> Maximum concurrent children watches above limit:
   [junit4]   2> 
   [junit4]   2> 	207	/solr/overseer/collection-queue-work
   [junit4]   2> 	41	/solr/overseer/queue
   [junit4]   2> 	6	/solr/collections
   [junit4]   2> 	5	/solr/live_nodes
   [junit4]   2> 	4	/solr/overseer/queue-work
   [junit4]   2> 
   [junit4]   2> NOTE: reproduce with: ant test  -Dtestcase=PeerSyncReplicationTest -Dtests.method=test -Dtests.seed=B92C63C447833C68 -Dtests.slow=true -Dtests.locale=he-IL -Dtests.timezone=SystemV/EST5 -Dtests.asserts=true -Dtests.file.encoding=US-ASCII
   [junit4] FAILURE  208s J0 | PeerSyncReplicationTest.test <<<
   [junit4]    > Throwable #1: java.lang.AssertionError: timeout waiting to see all nodes active
   [junit4]    > 	at __randomizedtesting.SeedInfo.seed([B92C63C447833C68:31785C1EE97F5190]:0)
   [junit4]    > 	at org.apache.solr.cloud.PeerSyncReplicationTest.waitTillNodesActive(PeerSyncReplicationTest.java:326)
   [junit4]    > 	at org.apache.solr.cloud.PeerSyncReplicationTest.bringUpDeadNodeAndEnsureNoReplication(PeerSyncReplicationTest.java:277)
   [junit4]    > 	at org.apache.solr.cloud.PeerSyncReplicationTest.forceNodeFailureAndDoPeerSync(PeerSyncReplicationTest.java:259)
   [junit4]    > 	at org.apache.solr.cloud.PeerSyncReplicationTest.test(PeerSyncReplicationTest.java:138)
   [junit4]    > 	at org.apache.solr.BaseDistributedSearchTestCase$ShardsRepeatRule$ShardsFixedStatement.callStatement(BaseDistributedSearchTestCase.java:985)
   [junit4]    > 	at org.apache.solr.BaseDistributedSearchTestCase$ShardsRepeatRule$ShardsStatement.evaluate(BaseDistributedSearchTestCase.java:960)
   [junit4]    > 	at java.lang.Thread.run(Thread.java:745)
   [junit4]   2> 2502422 INFO  (SUITE-PeerSyncReplicationTest-seed#[B92C63C447833C68]-worker) [    ] o.a.s.SolrTestCaseJ4 ###deleteCore
   [junit4]   2> NOTE: leaving temporary files on disk at: /export/home/jenkins/workspace/Lucene-Solr-master-Solaris/solr/build/solr-core/test/J0/temp/solr.cloud.PeerSyncReplicationTest_B92C63C447833C68-001
   [junit4]   2> Feb 15, 2017 10:34:11 PM com.carrotsearch.randomizedtesting.ThreadLeakControl checkThreadLeaks
   [junit4]   2> WARNING: Will linger awaiting termination of 2 leaked thread(s).
   [junit4]   2> NOTE: test params are: codec=Asserting(Lucene70): {other_tl1=PostingsFormat(name=MockRandom), rnd_s=PostingsFormat(name=MockRandom), multiDefault=PostingsFormat(name=LuceneVarGapFixedInterval), a_t=PostingsFormat(name=LuceneVarGapFixedInterval), a_i1=PostingsFormat(name=LuceneVarGapFixedInterval), id=Lucene50(blocksize=128), text=PostingsFormat(name=Memory), timestamp=PostingsFormat(name=LuceneVarGapFixedInterval)}, docValues:{range_facet_l_dv=DocValuesFormat(name=Lucene70), _version_=DocValuesFormat(name=Lucene70), intDefault=DocValuesFormat(name=Lucene70), range_facet_i_dv=DocValuesFormat(name=Memory), intDvoDefault=DocValuesFormat(name=Lucene70), range_facet_l=DocValuesFormat(name=Memory), timestamp=DocValuesFormat(name=Memory)}, maxPointsInLeafNode=1733, maxMBSortInHeap=6.452954308144852, sim=RandomSimilarity(queryNorm=true): {}, locale=he-IL, timezone=SystemV/EST5
   [junit4]   2> NOTE: SunOS 5.11 amd64/Oracle Corporation 1.8.0_121 (64-bit)/cpus=3,threads=1,free=108937984,total=536870912
   [junit4]   2> NOTE: All tests run in this JVM: [TestCloudPivotFacet, CopyFieldTest, HdfsBasicDistributedZk2Test, DirectSolrConnectionTest, TestCSVLoader, ReplaceNodeTest, TestExclusionRuleCollectionAccess, ExplicitHLLTest, MoreLikeThisHandlerTest, TestCSVResponseWriter, TestQuerySenderNoQuery, SolrXmlInZkTest, VersionInfoTest, HdfsUnloadDistributedZkTest, SolrTestCaseJ4Test, TestDelegationWithHadoopAuth, NumericFieldsTest, TestReplicationHandler, DeleteNodeTest, TestDynamicLoading, JvmMetricsTest, ShardRoutingTest, JSONWriterTest, StressHdfsTest, SolrPluginUtilsTest, DistributedFacetPivotWhiteBoxTest, CleanupOldIndexTest, TestCursorMarkWithoutUniqueKey, HighlighterTest, LeaderFailureAfterFreshStartTest, RecoveryZkTest, TestFieldCacheVsDocValues, AliasIntegrationTest, InfoHandlerTest, DateRangeFieldTest, ForceLeaderTest, TestSolrJ, TestLeaderInitiatedRecoveryThread, TestLFUCache, BigEndianAscendingWordSerializerTest, TestUniqueKeyFieldResource, SimplePostToolTest, TestSubQueryTransformerCrossCore, PathHierarchyTokenizerFactoryTest, CdcrBootstrapTest, SynonymTokenizerTest, SparseHLLTest, TestXmlQParser, QueryEqualityTest, TestFaceting, DocumentAnalysisRequestHandlerTest, DeleteInactiveReplicaTest, TestSizeLimitedDistributedMap, LeaderElectionTest, StandardRequestHandlerTest, TestReloadDeadlock, SolrSlf4jReporterTest, TestBulkSchemaConcurrent, DistributedMLTComponentTest, TestCryptoKeys, TestDefaultSearchFieldResource, UniqFieldsUpdateProcessorFactoryTest, CoreSorterTest, DistributedQueryComponentOptimizationTest, TestSlowCompositeReaderWrapper, TestHighFrequencyDictionaryFactory, SchemaVersionSpecificBehaviorTest, SyncSliceTest, MergeStrategyTest, AtomicUpdatesTest, DistributedQueryElevationComponentTest, TestCollectionAPIs, DOMUtilTest, TestStressCloudBlindAtomicUpdates, TestSolrCLIRunExample, HdfsRestartWhileUpdatingTest, SimpleMLTQParserTest, TriLevelCompositeIdRoutingTest, TestFastOutputStream, BasicAuthStandaloneTest, PeerSyncTest, TestPerFieldSimilarityWithDefaultOverride, TestRestoreCore, SystemInfoHandlerTest, ConnectionReuseTest, TestExactSharedStatsCache, TestRandomRequestDistribution, TestSolrCloudWithKerberosAlt, TestManagedSynonymFilterFactory, TestRequestStatusCollectionAPI, TestSchemaVersionResource, PrimUtilsTest, PreAnalyzedFieldManagedSchemaCloudTest, OverseerTest, MultiTermTest, CollectionTooManyReplicasTest, ZkCLITest, CloneFieldUpdateProcessorFactoryTest, TestWordDelimiterFilterFactory, TestInPlaceUpdatesStandalone, RequiredFieldsTest, TestReRankQParserPlugin, TestNumericTerms64, TestCustomSort, CollectionReloadTest, SpatialHeatmapFacetsTest, ExitableDirectoryReaderTest, TestConfigSetsAPIExclusivity, BlockJoinFacetSimpleTest, TestGraphMLResponseWriter, ClassificationUpdateProcessorIntegrationTest, TestLeaderElectionWithEmptyReplica, ZkStateReaderTest, TestCharFilters, AnalysisAfterCoreReloadTest, TestDynamicFieldResource, TestSolrFieldCacheMBean, PingRequestHandlerTest, TestPseudoReturnFields, SecurityConfHandlerTest, CursorPagingTest, RequestLoggingTest, TestOnReconnectListenerSupport, LeaderInitiatedRecoveryOnShardRestartTest, QueryResultKeyTest, TimeZoneUtilsTest, TemplateUpdateProcessorTest, TestIBSimilarityFactory, TestBinaryResponseWriter, TestUseDocValuesAsStored2, TestCoreAdminApis, TestComplexPhraseLeadingWildcard, AsyncCallRequestStatusResponseTest, DistanceUnitsTest, CollectionsAPISolrJTest, MBeansHandlerTest, DirectUpdateHandlerTest, TestFilteredDocIdSet, V2ApiIntegrationTest, TestMergePolicyConfig, TestHighlightDedupGrouping, ReplicaListTransformerTest, CdcrReplicationHandlerTest, TestSolr4Spatial2, OutputWriterTest, DistributedExpandComponentTest, PeerSyncWithIndexFingerprintCachingTest, HdfsThreadLeakTest, TestPushWriter, TestScoreJoinQPNoScore, OutOfBoxZkACLAndCredentialsProvidersTest, RecoveryAfterSoftCommitTest, TestConfigReload, TestEmbeddedSolrServerConstructors, TestRTGBase, TestUpdate, TestSQLHandlerNonCloud, StatsReloadRaceTest, FastVectorHighlighterTest, TestLRUCache, TestDFISimilarityFactory, TestRawTransformer, TestSolrDeletionPolicy1, StatelessScriptUpdateProcessorFactoryTest, PluginInfoTest, TestSweetSpotSimilarityFactory, TestFunctionQuery, TestLegacyNumericRangeQueryBuilder, TestRandomDVFaceting, TestDistributedSearch, DistributedSpellCheckComponentTest, TestStressReorder, TestReload, HardAutoCommitTest, TestCoreContainer, SimpleFacetsTest, StatsComponentTest, QueryElevationComponentTest, ConvertedLegacyTest, TestLazyCores, SoftAutoCommitTest, XsltUpdateRequestHandlerTest, CacheHeaderTest, TestSurroundQueryParser, DirectSolrSpellCheckerTest, TestQueryTypes, TestOmitPositions, TermsComponentTest, RequestHandlersTest, TestValueSourceCache, TestIndexingPerformance, TestSolrQueryParser, LoggingHandlerTest, TestJmxIntegration, ReturnFieldsTest, TestAnalyzedSuggestions, BinaryUpdateRequestHandlerTest, SearchHandlerTest, TestSolrDeletionPolicy2, SampleTest, TestDocSet, TestBinaryField, TestElisionMultitermQuery, TestSolrCoreProperties, TestPostingsSolrHighlighter, NotRequiredUniqueKeyTest, TestLuceneMatchVersion, TestPhraseSuggestions, TestCodecSupport, TestXIncludeConfig, EchoParamsTest, TestPerFieldSimilarity, TestLMDirichletSimilarityFactory, TestLMJelinekMercerSimilarityFactory, TestBM25SimilarityFactory, TestJmxMonitoredMap, OpenExchangeRatesOrgProviderTest, TestFastLRUCache, DateMathParserTest, ChaosMonkeyNothingIsSafeTest, TestTolerantSearch, TestPathTrie, AssignTest, CdcrRequestHandlerTest, CdcrVersionReplicationTest, CreateCollectionCleanupTest, DeleteShardTest, DistribCursorPagingTest, DistribJoinFromCollectionTest, DistributedVersionInfoTest, LeaderElectionContextKeyTest, LeaderFailoverAfterPartitionTest, LeaderInitiatedRecoveryOnCommitTest, MultiThreadedOCPTest, PeerSyncReplicationTest]
   [junit4] Completed [509/694 (1!)] on J0 in 208.76s, 1 test, 1 failure <<< FAILURES!

[...truncated 63225 lines...]


Mime
View raw message