lucene-dev mailing list archives

Site index · List index
Message view « Date » · « Thread »
Top « Date » · « Thread »
From Policeman Jenkins Server <jenk...@thetaphi.de>
Subject [JENKINS] Lucene-Solr-6.x-MacOSX (64bit/jdk1.8.0) - Build # 678 - Unstable!
Date Thu, 02 Feb 2017 12:08:50 GMT
Build: https://jenkins.thetaphi.de/job/Lucene-Solr-6.x-MacOSX/678/
Java: 64bit/jdk1.8.0 -XX:+UseCompressedOops -XX:+UseParallelGC

1 tests failed.
FAILED:  org.apache.solr.handler.admin.MBeansHandlerTest.testDiff

Error Message:
expected:<Was: [1, Now: 2], Delta: 1> but was:<Was: [4, Now: 5], Delta: 1>

Stack Trace:
org.junit.ComparisonFailure: expected:<Was: [1, Now: 2], Delta: 1> but was:<Was:
[4, Now: 5], Delta: 1>
	at __randomizedtesting.SeedInfo.seed([3E7E6C6CD1D6AAD4:FB68A8F7C16092B4]:0)
	at org.junit.Assert.assertEquals(Assert.java:125)
	at org.junit.Assert.assertEquals(Assert.java:147)
	at org.apache.solr.handler.admin.MBeansHandlerTest.testDiff(MBeansHandlerTest.java:63)
	at sun.reflect.NativeMethodAccessorImpl.invoke0(Native Method)
	at sun.reflect.NativeMethodAccessorImpl.invoke(NativeMethodAccessorImpl.java:62)
	at sun.reflect.DelegatingMethodAccessorImpl.invoke(DelegatingMethodAccessorImpl.java:43)
	at java.lang.reflect.Method.invoke(Method.java:498)
	at com.carrotsearch.randomizedtesting.RandomizedRunner.invoke(RandomizedRunner.java:1713)
	at com.carrotsearch.randomizedtesting.RandomizedRunner$8.evaluate(RandomizedRunner.java:907)
	at com.carrotsearch.randomizedtesting.RandomizedRunner$9.evaluate(RandomizedRunner.java:943)
	at com.carrotsearch.randomizedtesting.RandomizedRunner$10.evaluate(RandomizedRunner.java:957)
	at com.carrotsearch.randomizedtesting.rules.SystemPropertiesRestoreRule$1.evaluate(SystemPropertiesRestoreRule.java:57)
	at org.apache.lucene.util.TestRuleSetupTeardownChained$1.evaluate(TestRuleSetupTeardownChained.java:49)
	at org.apache.lucene.util.AbstractBeforeAfterRule$1.evaluate(AbstractBeforeAfterRule.java:45)
	at org.apache.lucene.util.TestRuleThreadAndTestName$1.evaluate(TestRuleThreadAndTestName.java:48)
	at org.apache.lucene.util.TestRuleIgnoreAfterMaxFailures$1.evaluate(TestRuleIgnoreAfterMaxFailures.java:64)
	at org.apache.lucene.util.TestRuleMarkFailure$1.evaluate(TestRuleMarkFailure.java:47)
	at com.carrotsearch.randomizedtesting.rules.StatementAdapter.evaluate(StatementAdapter.java:36)
	at com.carrotsearch.randomizedtesting.ThreadLeakControl$StatementRunner.run(ThreadLeakControl.java:368)
	at com.carrotsearch.randomizedtesting.ThreadLeakControl.forkTimeoutingTask(ThreadLeakControl.java:817)
	at com.carrotsearch.randomizedtesting.ThreadLeakControl$3.evaluate(ThreadLeakControl.java:468)
	at com.carrotsearch.randomizedtesting.RandomizedRunner.runSingleTest(RandomizedRunner.java:916)
	at com.carrotsearch.randomizedtesting.RandomizedRunner$5.evaluate(RandomizedRunner.java:802)
	at com.carrotsearch.randomizedtesting.RandomizedRunner$6.evaluate(RandomizedRunner.java:852)
	at com.carrotsearch.randomizedtesting.RandomizedRunner$7.evaluate(RandomizedRunner.java:863)
	at com.carrotsearch.randomizedtesting.rules.StatementAdapter.evaluate(StatementAdapter.java:36)
	at com.carrotsearch.randomizedtesting.rules.SystemPropertiesRestoreRule$1.evaluate(SystemPropertiesRestoreRule.java:57)
	at org.apache.lucene.util.AbstractBeforeAfterRule$1.evaluate(AbstractBeforeAfterRule.java:45)
	at com.carrotsearch.randomizedtesting.rules.StatementAdapter.evaluate(StatementAdapter.java:36)
	at org.apache.lucene.util.TestRuleStoreClassName$1.evaluate(TestRuleStoreClassName.java:41)
	at com.carrotsearch.randomizedtesting.rules.NoShadowingOrOverridesOnMethodsRule$1.evaluate(NoShadowingOrOverridesOnMethodsRule.java:40)
	at com.carrotsearch.randomizedtesting.rules.NoShadowingOrOverridesOnMethodsRule$1.evaluate(NoShadowingOrOverridesOnMethodsRule.java:40)
	at com.carrotsearch.randomizedtesting.rules.StatementAdapter.evaluate(StatementAdapter.java:36)
	at com.carrotsearch.randomizedtesting.rules.StatementAdapter.evaluate(StatementAdapter.java:36)
	at com.carrotsearch.randomizedtesting.rules.StatementAdapter.evaluate(StatementAdapter.java:36)
	at org.apache.lucene.util.TestRuleAssertionsRequired$1.evaluate(TestRuleAssertionsRequired.java:53)
	at org.apache.lucene.util.TestRuleMarkFailure$1.evaluate(TestRuleMarkFailure.java:47)
	at org.apache.lucene.util.TestRuleIgnoreAfterMaxFailures$1.evaluate(TestRuleIgnoreAfterMaxFailures.java:64)
	at org.apache.lucene.util.TestRuleIgnoreTestSuites$1.evaluate(TestRuleIgnoreTestSuites.java:54)
	at com.carrotsearch.randomizedtesting.rules.StatementAdapter.evaluate(StatementAdapter.java:36)
	at com.carrotsearch.randomizedtesting.ThreadLeakControl$StatementRunner.run(ThreadLeakControl.java:368)
	at java.lang.Thread.run(Thread.java:745)




Build Log:
[...truncated 12065 lines...]
   [junit4] Suite: org.apache.solr.handler.admin.MBeansHandlerTest
   [junit4]   2> Creating dataDir: /Users/jenkins/workspace/Lucene-Solr-6.x-MacOSX/solr/build/solr-core/test/J0/temp/solr.handler.admin.MBeansHandlerTest_3E7E6C6CD1D6AAD4-001/init-core-data-001
   [junit4]   2> 2350655 INFO  (SUITE-MBeansHandlerTest-seed#[3E7E6C6CD1D6AAD4]-worker)
[    ] o.a.s.SolrTestCaseJ4 Randomized ssl (true) and clientAuth (false) via: @org.apache.solr.util.RandomizeSSL(reason=,
value=NaN, ssl=NaN, clientAuth=NaN) w/ MAC_OS_X supressed clientAuth
   [junit4]   2> 2350657 INFO  (SUITE-MBeansHandlerTest-seed#[3E7E6C6CD1D6AAD4]-worker)
[    ] o.a.s.SolrTestCaseJ4 ####initCore
   [junit4]   2> 2350657 INFO  (SUITE-MBeansHandlerTest-seed#[3E7E6C6CD1D6AAD4]-worker)
[    ] o.a.s.c.SolrResourceLoader [null] Added 2 libs to classloader, from paths: [/Users/jenkins/workspace/Lucene-Solr-6.x-MacOSX/solr/core/src/test-files/solr/collection1/lib,
/Users/jenkins/workspace/Lucene-Solr-6.x-MacOSX/solr/core/src/test-files/solr/collection1/lib/classes]
   [junit4]   2> 2350716 INFO  (SUITE-MBeansHandlerTest-seed#[3E7E6C6CD1D6AAD4]-worker)
[    ] o.a.s.c.SolrConfig Using Lucene MatchVersion: 6.5.0
   [junit4]   2> 2350732 INFO  (SUITE-MBeansHandlerTest-seed#[3E7E6C6CD1D6AAD4]-worker)
[    ] o.a.s.s.IndexSchema [null] Schema name=test
   [junit4]   2> 2350808 WARN  (SUITE-MBeansHandlerTest-seed#[3E7E6C6CD1D6AAD4]-worker)
[    ] o.a.s.s.IndexSchema [null] default search field in schema is text. WARNING: Deprecated,
please use 'df' on request instead.
   [junit4]   2> 2350810 INFO  (SUITE-MBeansHandlerTest-seed#[3E7E6C6CD1D6AAD4]-worker)
[    ] o.a.s.s.IndexSchema Loaded schema test/1.0 with uniqueid field id
   [junit4]   2> 2350830 INFO  (SUITE-MBeansHandlerTest-seed#[3E7E6C6CD1D6AAD4]-worker)
[    ] o.a.s.u.UpdateShardHandler Creating UpdateShardHandler HTTP client with params: socketTimeout=30000&connTimeout=30000&retry=true
   [junit4]   2> 2350834 WARN  (SUITE-MBeansHandlerTest-seed#[3E7E6C6CD1D6AAD4]-worker)
[    ] o.a.s.m.r.SolrJmxReporter No serviceUrl or agentId was configured, using first MBeanServer.
   [junit4]   2> 2350836 INFO  (SUITE-MBeansHandlerTest-seed#[3E7E6C6CD1D6AAD4]-worker)
[    ] o.a.s.m.r.SolrJmxReporter JMX monitoring enabled at server: com.sun.jmx.mbeanserver.JmxMBeanServer@6536031
   [junit4]   2> 2350836 WARN  (SUITE-MBeansHandlerTest-seed#[3E7E6C6CD1D6AAD4]-worker)
[    ] o.a.s.m.r.SolrJmxReporter No serviceUrl or agentId was configured, using first MBeanServer.
   [junit4]   2> 2350840 INFO  (SUITE-MBeansHandlerTest-seed#[3E7E6C6CD1D6AAD4]-worker)
[    ] o.a.s.m.r.SolrJmxReporter JMX monitoring enabled at server: com.sun.jmx.mbeanserver.JmxMBeanServer@6536031
   [junit4]   2> 2350840 WARN  (SUITE-MBeansHandlerTest-seed#[3E7E6C6CD1D6AAD4]-worker)
[    ] o.a.s.m.r.SolrJmxReporter No serviceUrl or agentId was configured, using first MBeanServer.
   [junit4]   2> 2350840 INFO  (SUITE-MBeansHandlerTest-seed#[3E7E6C6CD1D6AAD4]-worker)
[    ] o.a.s.m.r.SolrJmxReporter JMX monitoring enabled at server: com.sun.jmx.mbeanserver.JmxMBeanServer@6536031
   [junit4]   2> 2350843 INFO  (coreLoadExecutor-7271-thread-1) [    x:collection1] o.a.s.c.SolrResourceLoader
[null] Added 2 libs to classloader, from paths: [/Users/jenkins/workspace/Lucene-Solr-6.x-MacOSX/solr/core/src/test-files/solr/collection1/lib,
/Users/jenkins/workspace/Lucene-Solr-6.x-MacOSX/solr/core/src/test-files/solr/collection1/lib/classes]
   [junit4]   2> 2350873 INFO  (coreLoadExecutor-7271-thread-1) [    x:collection1] o.a.s.c.SolrConfig
Using Lucene MatchVersion: 6.5.0
   [junit4]   2> 2350890 INFO  (coreLoadExecutor-7271-thread-1) [    x:collection1] o.a.s.s.IndexSchema
[collection1] Schema name=test
   [junit4]   2> 2350972 WARN  (coreLoadExecutor-7271-thread-1) [    x:collection1] o.a.s.s.IndexSchema
[collection1] default search field in schema is text. WARNING: Deprecated, please use 'df'
on request instead.
   [junit4]   2> 2350976 INFO  (coreLoadExecutor-7271-thread-1) [    x:collection1] o.a.s.s.IndexSchema
Loaded schema test/1.0 with uniqueid field id
   [junit4]   2> 2350990 INFO  (coreLoadExecutor-7271-thread-1) [    x:collection1] o.a.s.c.CoreContainer
Creating SolrCore 'collection1' using configuration from instancedir /Users/jenkins/workspace/Lucene-Solr-6.x-MacOSX/solr/core/src/test-files/solr/collection1
   [junit4]   2> 2350991 WARN  (coreLoadExecutor-7271-thread-1) [    x:collection1] o.a.s.m.r.SolrJmxReporter
No serviceUrl or agentId was configured, using first MBeanServer.
   [junit4]   2> 2350991 INFO  (coreLoadExecutor-7271-thread-1) [    x:collection1] o.a.s.m.r.SolrJmxReporter
JMX monitoring enabled at server: com.sun.jmx.mbeanserver.JmxMBeanServer@6536031
   [junit4]   2> 2350991 INFO  (coreLoadExecutor-7271-thread-1) [    x:collection1] o.a.s.c.SolrCore
[[collection1] ] Opening new SolrCore at [/Users/jenkins/workspace/Lucene-Solr-6.x-MacOSX/solr/core/src/test-files/solr/collection1],
dataDir=[/Users/jenkins/workspace/Lucene-Solr-6.x-MacOSX/solr/build/solr-core/test/J0/temp/solr.handler.admin.MBeansHandlerTest_3E7E6C6CD1D6AAD4-001/init-core-data-001/]
   [junit4]   2> 2350991 INFO  (coreLoadExecutor-7271-thread-1) [    x:collection1] o.a.s.c.JmxMonitoredMap
JMX monitoring is enabled. Adding Solr mbeans to JMX Server: com.sun.jmx.mbeanserver.JmxMBeanServer@6536031
   [junit4]   2> 2351006 INFO  (coreLoadExecutor-7271-thread-1) [    x:collection1] o.a.s.u.RandomMergePolicy
RandomMergePolicy wrapping class org.apache.lucene.index.LogDocMergePolicy: [LogDocMergePolicy:
minMergeSize=1000, mergeFactor=38, maxMergeSize=9223372036854775807, maxMergeSizeForForcedMerge=9223372036854775807,
calibrateSizeByDeletes=false, maxMergeDocs=2147483647, maxCFSSegmentSizeMB=8.796093022207999E12,
noCFSRatio=0.43608219569680484]
   [junit4]   2> 2351045 INFO  (coreLoadExecutor-7271-thread-1) [    x:collection1] o.a.s.u.UpdateHandler
Using UpdateLog implementation: org.apache.solr.update.UpdateLog
   [junit4]   2> 2351045 INFO  (coreLoadExecutor-7271-thread-1) [    x:collection1] o.a.s.u.UpdateLog
Initializing UpdateLog: dataDir= defaultSyncLevel=FLUSH numRecordsToKeep=100 maxNumLogsToKeep=10
numVersionBuckets=65536
   [junit4]   2> 2351045 INFO  (coreLoadExecutor-7271-thread-1) [    x:collection1] o.a.s.u.CommitTracker
Hard AutoCommit: disabled
   [junit4]   2> 2351045 INFO  (coreLoadExecutor-7271-thread-1) [    x:collection1] o.a.s.u.CommitTracker
Soft AutoCommit: disabled
   [junit4]   2> 2351050 INFO  (coreLoadExecutor-7271-thread-1) [    x:collection1] o.a.s.u.RandomMergePolicy
RandomMergePolicy wrapping class org.apache.lucene.index.TieredMergePolicy: [TieredMergePolicy:
maxMergeAtOnce=11, maxMergeAtOnceExplicit=44, maxMergedSegmentMB=92.2236328125, floorSegmentMB=1.9404296875,
forceMergeDeletesPctAllowed=7.633172534066112, segmentsPerTier=18.0, maxCFSSegmentSizeMB=8.796093022207999E12,
noCFSRatio=0.0
   [junit4]   2> 2351051 INFO  (coreLoadExecutor-7271-thread-1) [    x:collection1] o.a.s.s.SolrIndexSearcher
Opening [Searcher@12f2d470[collection1] main]
   [junit4]   2> 2351051 INFO  (coreLoadExecutor-7271-thread-1) [    x:collection1] o.a.s.h.c.SpellCheckComponent
Initializing spell checkers
   [junit4]   2> 2351064 INFO  (coreLoadExecutor-7271-thread-1) [    x:collection1] o.a.s.s.DirectSolrSpellChecker
init: {name=direct,classname=DirectSolrSpellChecker,field=lowerfilt,minQueryLength=3}
   [junit4]   2> 2351128 INFO  (coreLoadExecutor-7271-thread-1) [    x:collection1] o.a.s.h.ReplicationHandler
Commits will be reserved for  10000
   [junit4]   2> 2351128 INFO  (searcherExecutor-7272-thread-1-processing-x:collection1)
[    x:collection1] o.a.s.h.c.SpellCheckComponent Loading spell index for spellchecker: default
   [junit4]   2> 2351129 INFO  (searcherExecutor-7272-thread-1-processing-x:collection1)
[    x:collection1] o.a.s.h.c.SpellCheckComponent Loading spell index for spellchecker: direct
   [junit4]   2> 2351130 INFO  (searcherExecutor-7272-thread-1-processing-x:collection1)
[    x:collection1] o.a.s.h.c.SpellCheckComponent Loading spell index for spellchecker: wordbreak
   [junit4]   2> 2351130 INFO  (searcherExecutor-7272-thread-1-processing-x:collection1)
[    x:collection1] o.a.s.h.c.SpellCheckComponent Loading spell index for spellchecker: multipleFields
   [junit4]   2> 2351130 INFO  (searcherExecutor-7272-thread-1-processing-x:collection1)
[    x:collection1] o.a.s.h.c.SpellCheckComponent Loading spell index for spellchecker: jarowinkler
   [junit4]   2> 2351130 INFO  (searcherExecutor-7272-thread-1-processing-x:collection1)
[    x:collection1] o.a.s.h.c.SpellCheckComponent Loading spell index for spellchecker: external
   [junit4]   2> 2351130 INFO  (coreLoadExecutor-7271-thread-1) [    x:collection1] o.a.s.u.UpdateLog
Could not find max version in index or recent updates, using new clock 1558220003721871360
   [junit4]   2> 2351136 INFO  (SUITE-MBeansHandlerTest-seed#[3E7E6C6CD1D6AAD4]-worker)
[    ] o.a.s.SolrTestCaseJ4 ####initCore end
   [junit4]   2> 2351138 INFO  (searcherExecutor-7272-thread-1-processing-x:collection1)
[    x:collection1] o.a.s.h.c.SpellCheckComponent Loading spell index for spellchecker: freq
   [junit4]   2> 2351139 INFO  (searcherExecutor-7272-thread-1-processing-x:collection1)
[    x:collection1] o.a.s.h.c.SpellCheckComponent Loading spell index for spellchecker: fqcn
   [junit4]   2> 2351140 INFO  (searcherExecutor-7272-thread-1-processing-x:collection1)
[    x:collection1] o.a.s.h.c.SpellCheckComponent Loading spell index for spellchecker: perDict
   [junit4]   2> 2351141 INFO  (searcherExecutor-7272-thread-1-processing-x:collection1)
[    x:collection1] o.a.s.c.SolrCore [collection1] Registered new searcher Searcher@12f2d470[collection1]
main{ExitableDirectoryReader(UninvertingDirectoryReader())}
   [junit4]   2> 2351142 INFO  (TEST-MBeansHandlerTest.testBackCompatNames-seed#[3E7E6C6CD1D6AAD4])
[    ] o.a.s.SolrTestCaseJ4 ###Starting testBackCompatNames
   [junit4]   2> 2351143 INFO  (TEST-MBeansHandlerTest.testBackCompatNames-seed#[3E7E6C6CD1D6AAD4])
[    ] o.a.s.c.S.Request [collection1]  webapp=null path=null params={qt=/admin/mbeans&wt=xml}
status=0 QTime=1
   [junit4]   2> 2351148 INFO  (TEST-MBeansHandlerTest.testBackCompatNames-seed#[3E7E6C6CD1D6AAD4])
[    ] o.a.s.c.S.Request [collection1]  webapp=null path=null params={qt=/admin/mbeans&cat=QUERYHANDLER&wt=xml}
status=0 QTime=0
   [junit4]   2> 2351148 INFO  (TEST-MBeansHandlerTest.testBackCompatNames-seed#[3E7E6C6CD1D6AAD4])
[    ] o.a.s.c.S.Request [collection1]  webapp=null path=null params={qt=/admin/mbeans&cat=UPDATE&wt=xml}
status=0 QTime=0
   [junit4]   2> 2351149 INFO  (TEST-MBeansHandlerTest.testBackCompatNames-seed#[3E7E6C6CD1D6AAD4])
[    ] o.a.s.SolrTestCaseJ4 ###Ending testBackCompatNames
   [junit4]   2> 2351192 INFO  (TEST-MBeansHandlerTest.testXMLDiffWithExternalEntity-seed#[3E7E6C6CD1D6AAD4])
[    ] o.a.s.SolrTestCaseJ4 ###Starting testXMLDiffWithExternalEntity
   [junit4]   2> 2351269 INFO  (TEST-MBeansHandlerTest.testXMLDiffWithExternalEntity-seed#[3E7E6C6CD1D6AAD4])
[    ] o.a.s.SolrTestCaseJ4 ###Ending testXMLDiffWithExternalEntity
   [junit4]   2> 2351271 INFO  (TEST-MBeansHandlerTest.testDiff-seed#[3E7E6C6CD1D6AAD4])
[    ] o.a.s.SolrTestCaseJ4 ###Starting testDiff
   [junit4]   2> 2351294 INFO  (TEST-MBeansHandlerTest.testDiff-seed#[3E7E6C6CD1D6AAD4])
[    ] o.a.s.c.S.Request [collection1]  webapp=null path=null params={qt=/admin/mbeans&stats=true&wt=xml}
status=0 QTime=22
   [junit4]   2> 2351332 INFO  (TEST-MBeansHandlerTest.testDiff-seed#[3E7E6C6CD1D6AAD4])
[    ] o.a.s.c.S.Request [collection1]  webapp=null path=null params={qt=/admin/mbeans&stats=true&diff=true&wt=xml}
status=0 QTime=37
   [junit4]   2> 2351334 INFO  (TEST-MBeansHandlerTest.testDiff-seed#[3E7E6C6CD1D6AAD4])
[    ] o.a.s.SolrTestCaseJ4 ###Ending testDiff
   [junit4]   2> NOTE: reproduce with: ant test  -Dtestcase=MBeansHandlerTest -Dtests.method=testDiff
-Dtests.seed=3E7E6C6CD1D6AAD4 -Dtests.slow=true -Dtests.locale=en-IE -Dtests.timezone=Asia/Jakarta
-Dtests.asserts=true -Dtests.file.encoding=UTF-8
   [junit4] FAILURE 0.07s J0 | MBeansHandlerTest.testDiff <<<
   [junit4]    > Throwable #1: org.junit.ComparisonFailure: expected:<Was: [1, Now:
2], Delta: 1> but was:<Was: [4, Now: 5], Delta: 1>
   [junit4]    > 	at __randomizedtesting.SeedInfo.seed([3E7E6C6CD1D6AAD4:FB68A8F7C16092B4]:0)
   [junit4]    > 	at org.apache.solr.handler.admin.MBeansHandlerTest.testDiff(MBeansHandlerTest.java:63)
   [junit4]    > 	at java.lang.Thread.run(Thread.java:745)
   [junit4]   2> 2351341 INFO  (SUITE-MBeansHandlerTest-seed#[3E7E6C6CD1D6AAD4]-worker)
[    ] o.a.s.SolrTestCaseJ4 ###deleteCore
   [junit4]   2> 2351341 INFO  (SUITE-MBeansHandlerTest-seed#[3E7E6C6CD1D6AAD4]-worker)
[    ] o.a.s.c.CoreContainer Shutting down CoreContainer instance=1864053707
   [junit4]   2> 2351341 INFO  (coreCloseExecutor-7277-thread-1) [    x:collection1] o.a.s.c.SolrCore
[collection1]  CLOSING SolrCore org.apache.solr.core.SolrCore@51adf379
   [junit4]   2> 2351496 INFO  (coreCloseExecutor-7277-thread-1) [    x:collection1] o.a.s.m.SolrMetricManager
Closing metric reporters for: solr.core.collection1
   [junit4]   2> 2351500 INFO  (SUITE-MBeansHandlerTest-seed#[3E7E6C6CD1D6AAD4]-worker)
[    ] o.a.s.m.SolrMetricManager Closing metric reporters for: solr.node
   [junit4]   2> NOTE: leaving temporary files on disk at: /Users/jenkins/workspace/Lucene-Solr-6.x-MacOSX/solr/build/solr-core/test/J0/temp/solr.handler.admin.MBeansHandlerTest_3E7E6C6CD1D6AAD4-001
   [junit4]   2> NOTE: test params are: codec=CheapBastard, sim=RandomSimilarity(queryNorm=false,coord=crazy):
{}, locale=en-IE, timezone=Asia/Jakarta
   [junit4]   2> NOTE: Mac OS X 10.11.6 x86_64/Oracle Corporation 1.8.0_121 (64-bit)/cpus=3,threads=1,free=113018944,total=439353344
   [junit4]   2> NOTE: All tests run in this JVM: [TestDocTermOrds, TestAnalyzeInfixSuggestions,
TestPartialUpdateDeduplication, TestSolr4Spatial2, OverseerModifyCollectionTest, PingRequestHandlerTest,
DOMUtilTest, TestDefaultSearchFieldResource, HdfsRestartWhileUpdatingTest, TestSchemaVersionResource,
TestPushWriter, TestRTGBase, QueryResultKeyTest, AssignTest, BadComponentTest, PrimUtilsTest,
ClassificationUpdateProcessorTest, TestHdfsCloudBackupRestore, BlockJoinFacetSimpleTest, TestShardHandlerFactory,
TestFaceting, PathHierarchyTokenizerFactoryTest, TestDocumentBuilder, TestComplexPhraseQParserPlugin,
PeerSyncTest, DistributedSuggestComponentTest, TestCharFilters, BlockDirectoryTest, AddSchemaFieldsUpdateProcessorFactoryTest,
SolrPluginUtilsTest, SOLR749Test, TestLazyCores, SegmentsInfoRequestHandlerTest, SystemInfoHandlerTest,
BlockJoinFacetDistribTest, DocumentAnalysisRequestHandlerTest, BaseCdcrDistributedZkTest,
DistribDocExpirationUpdateProcessorTest, TestAnalyzedSuggestions, TestMiniSolrCloudClusterSSL,
TestNumericTerms64, TestLRUCache, BigEndianAscendingWordSerializerTest, TestSolrIndexConfig,
StatelessScriptUpdateProcessorFactoryTest, TestChildDocTransformer, DocExpirationUpdateProcessorFactoryTest,
TestDownShardTolerantSearch, TestUpdate, TestSlowCompositeReaderWrapper, HdfsBasicDistributedZk2Test,
TestSortByMinMaxFunction, JSONWriterTest, TestRestManager, TestDocBasedVersionConstraints,
AnalyticsMergeStrategyTest, ZkControllerTest, TestSchemaManager, TestSort, TestFastOutputStream,
SharedFSAutoReplicaFailoverTest, ClusterStateUpdateTest, TestOverriddenPrefixQueryForCustomFieldType,
TriLevelCompositeIdRoutingTest, SolrMetricManagerTest, OverriddenZkACLAndCredentialsProvidersTest,
TestMacroExpander, TestSweetSpotSimilarityFactory, TestSolrDeletionPolicy1, TestDistribIDF,
TestDistributedSearch, TestClusterProperties, RemoteQueryErrorTest, TestPseudoReturnFields,
SimpleMLTQParserTest, CursorPagingTest, TestRandomFlRTGCloud, RankQueryTest, TestFunctionQuery,
TestConfigOverlay, CollectionStateFormat2Test, ConnectionManagerTest, TestConfigSetProperties,
TestManagedSynonymFilterFactory, NumericFieldsTest, TestRuleBasedAuthorizationPlugin, MetricsHandlerTest,
DeleteReplicaTest, XsltUpdateRequestHandlerTest, TestTolerantUpdateProcessorRandomCloud, TestCloudInspectUtil,
SynonymTokenizerTest, TestCoreContainer, TestManagedResource, TestExpandComponent, TestStressReorder,
TestMiniSolrCloudCluster, ConcurrentDeleteAndCreateCollectionTest, TestStressRecovery, TestComponentsName,
TestNRTOpen, TestMinMaxOnMultiValuedField, TestDelegationWithHadoopAuth, TestTolerantSearch,
TestCollationField, ShardRoutingTest, TestDeleteCollectionOnDownNodes, SolrRequestParserTest,
HttpPartitionTest, TestReplicationHandler, FastVectorHighlighterTest, ResponseLogComponentTest,
ZkStateReaderTest, CustomCollectionTest, TestCSVLoader, IndexSchemaRuntimeFieldTest, TestSolrConfigHandlerConcurrent,
TestSolrQueryParserDefaultOperatorResource, TermsComponentTest, ResponseHeaderTest, TestExtendedDismaxParser,
TestSolrCloudWithSecureImpersonation, TestInfoStreamLogging, TestFastLRUCache, ParsingFieldUpdateProcessorsTest,
TestHighlightDedupGrouping, SolrSlf4jReporterTest, HLLSerializationTest, HdfsCollectionsAPIDistributedZkTest,
SaslZkACLProviderTest, MultiTermTest, TestFieldCacheVsDocValues, TestFieldSortValues, HdfsDirectoryTest,
TestCorePropertiesReload, DisMaxRequestHandlerTest, TestStressLiveNodes, TestHashPartitioner,
SparseHLLTest, TestRandomDVFaceting, TestSubQueryTransformerCrossCore, AnalysisAfterCoreReloadTest,
PolyFieldTest, TestExportWriter, StandardRequestHandlerTest, CheckHdfsIndexTest, TestObjectReleaseTracker,
MultiThreadedOCPTest, TestMissingGroups, OverseerTest, CoreSorterTest, BasicAuthIntegrationTest,
TestBinaryResponseWriter, TestJettySolrRunner, TestDynamicFieldResource, TestSSLRandomization,
DistributedSpellCheckComponentTest, TestLFUCache, PrimitiveFieldTypeTest, ClassificationUpdateProcessorFactoryTest,
IndexBasedSpellCheckerTest, TestFileDictionaryLookup, QueryElevationComponentTest, TestFieldResource,
TestSolrCloudSnapshots, TestCollationFieldDocValues, TestTrackingShardHandlerFactory, BasicDistributedZkTest,
BasicDistributedZk2Test, UnloadDistributedZkTest, CollectionsAPIDistributedZkTest, OpenCloseCoreStressTest,
BasicZkTest, RecoveryZkTest, LeaderElectionTest, ZkCLITest, DistributedTermsComponentTest,
SolrCoreTest, BadIndexSchemaTest, TestFiltering, DirectUpdateHandlerTest, TestIndexSearcher,
SoftAutoCommitTest, SuggesterFSTTest, SuggesterTSTTest, TestStressLucene, SpatialFilterTest,
SuggesterWFSTTest, NoCacheHeaderTest, WordBreakSolrSpellCheckerTest, SchemaVersionSpecificBehaviorTest,
SolrCoreCheckLockOnStartupTest, TestWordDelimiterFilterFactory, DefaultValueUpdateProcessorTest,
DocValuesMultiTest, DebugComponentTest, TestSurroundQueryParser, DirectSolrSpellCheckerTest,
TestOmitPositions, FileBasedSpellCheckerTest, XmlUpdateRequestHandlerTest, RequestHandlersTest,
DocumentBuilderTest, TermVectorComponentTest, TestIndexingPerformance, RequiredFieldsTest,
LoggingHandlerTest, IndexSchemaTest, JSONWriterTest, MBeansHandlerTest]
   [junit4] Completed [410/682 (1!)] on J0 in 0.87s, 3 tests, 1 failure <<< FAILURES!

[...truncated 63389 lines...]


Mime
View raw message