lucene-dev mailing list archives

Site index · List index
Message view « Date » · « Thread »
Top « Date » · « Thread »
From Policeman Jenkins Server <jenk...@thetaphi.de>
Subject [JENKINS-EA] Lucene-Solr-6.x-Linux (64bit/jdk-9-ea+155) - Build # 2863 - Still Unstable!
Date Wed, 15 Feb 2017 22:17:28 GMT
Build: https://jenkins.thetaphi.de/job/Lucene-Solr-6.x-Linux/2863/
Java: 64bit/jdk-9-ea+155 -XX:+UseCompressedOops -XX:+UseG1GC

2 tests failed.
FAILED:  org.apache.solr.cloud.PeerSyncReplicationTest.test

Error Message:
PeerSync failed. Had to fail back to replication

Stack Trace:
java.lang.AssertionError: PeerSync failed. Had to fail back to replication
	at __randomizedtesting.SeedInfo.seed([127C456CF0EA8BEA:9A287AB65E16E612]:0)
	at org.junit.Assert.fail(Assert.java:93)
	at org.junit.Assert.assertTrue(Assert.java:43)
	at org.apache.solr.cloud.PeerSyncReplicationTest.bringUpDeadNodeAndEnsureNoReplication(PeerSyncReplicationTest.java:290)
	at org.apache.solr.cloud.PeerSyncReplicationTest.forceNodeFailureAndDoPeerSync(PeerSyncReplicationTest.java:259)
	at org.apache.solr.cloud.PeerSyncReplicationTest.test(PeerSyncReplicationTest.java:138)
	at java.base/jdk.internal.reflect.NativeMethodAccessorImpl.invoke0(Native Method)
	at java.base/jdk.internal.reflect.NativeMethodAccessorImpl.invoke(NativeMethodAccessorImpl.java:62)
	at java.base/jdk.internal.reflect.DelegatingMethodAccessorImpl.invoke(DelegatingMethodAccessorImpl.java:43)
	at java.base/java.lang.reflect.Method.invoke(Method.java:543)
	at com.carrotsearch.randomizedtesting.RandomizedRunner.invoke(RandomizedRunner.java:1713)
	at com.carrotsearch.randomizedtesting.RandomizedRunner$8.evaluate(RandomizedRunner.java:907)
	at com.carrotsearch.randomizedtesting.RandomizedRunner$9.evaluate(RandomizedRunner.java:943)
	at com.carrotsearch.randomizedtesting.RandomizedRunner$10.evaluate(RandomizedRunner.java:957)
	at org.apache.solr.BaseDistributedSearchTestCase$ShardsRepeatRule$ShardsFixedStatement.callStatement(BaseDistributedSearchTestCase.java:992)
	at org.apache.solr.BaseDistributedSearchTestCase$ShardsRepeatRule$ShardsStatement.evaluate(BaseDistributedSearchTestCase.java:967)
	at com.carrotsearch.randomizedtesting.rules.SystemPropertiesRestoreRule$1.evaluate(SystemPropertiesRestoreRule.java:57)
	at org.apache.lucene.util.TestRuleSetupTeardownChained$1.evaluate(TestRuleSetupTeardownChained.java:49)
	at org.apache.lucene.util.AbstractBeforeAfterRule$1.evaluate(AbstractBeforeAfterRule.java:45)
	at org.apache.lucene.util.TestRuleThreadAndTestName$1.evaluate(TestRuleThreadAndTestName.java:48)
	at org.apache.lucene.util.TestRuleIgnoreAfterMaxFailures$1.evaluate(TestRuleIgnoreAfterMaxFailures.java:64)
	at org.apache.lucene.util.TestRuleMarkFailure$1.evaluate(TestRuleMarkFailure.java:47)
	at com.carrotsearch.randomizedtesting.rules.StatementAdapter.evaluate(StatementAdapter.java:36)
	at com.carrotsearch.randomizedtesting.ThreadLeakControl$StatementRunner.run(ThreadLeakControl.java:368)
	at com.carrotsearch.randomizedtesting.ThreadLeakControl.forkTimeoutingTask(ThreadLeakControl.java:817)
	at com.carrotsearch.randomizedtesting.ThreadLeakControl$3.evaluate(ThreadLeakControl.java:468)
	at com.carrotsearch.randomizedtesting.RandomizedRunner.runSingleTest(RandomizedRunner.java:916)
	at com.carrotsearch.randomizedtesting.RandomizedRunner$5.evaluate(RandomizedRunner.java:802)
	at com.carrotsearch.randomizedtesting.RandomizedRunner$6.evaluate(RandomizedRunner.java:852)
	at com.carrotsearch.randomizedtesting.RandomizedRunner$7.evaluate(RandomizedRunner.java:863)
	at com.carrotsearch.randomizedtesting.rules.StatementAdapter.evaluate(StatementAdapter.java:36)
	at com.carrotsearch.randomizedtesting.rules.SystemPropertiesRestoreRule$1.evaluate(SystemPropertiesRestoreRule.java:57)
	at org.apache.lucene.util.AbstractBeforeAfterRule$1.evaluate(AbstractBeforeAfterRule.java:45)
	at com.carrotsearch.randomizedtesting.rules.StatementAdapter.evaluate(StatementAdapter.java:36)
	at org.apache.lucene.util.TestRuleStoreClassName$1.evaluate(TestRuleStoreClassName.java:41)
	at com.carrotsearch.randomizedtesting.rules.NoShadowingOrOverridesOnMethodsRule$1.evaluate(NoShadowingOrOverridesOnMethodsRule.java:40)
	at com.carrotsearch.randomizedtesting.rules.NoShadowingOrOverridesOnMethodsRule$1.evaluate(NoShadowingOrOverridesOnMethodsRule.java:40)
	at com.carrotsearch.randomizedtesting.rules.StatementAdapter.evaluate(StatementAdapter.java:36)
	at com.carrotsearch.randomizedtesting.rules.StatementAdapter.evaluate(StatementAdapter.java:36)
	at org.apache.lucene.util.TestRuleAssertionsRequired$1.evaluate(TestRuleAssertionsRequired.java:53)
	at org.apache.lucene.util.TestRuleMarkFailure$1.evaluate(TestRuleMarkFailure.java:47)
	at org.apache.lucene.util.TestRuleIgnoreAfterMaxFailures$1.evaluate(TestRuleIgnoreAfterMaxFailures.java:64)
	at org.apache.lucene.util.TestRuleIgnoreTestSuites$1.evaluate(TestRuleIgnoreTestSuites.java:54)
	at com.carrotsearch.randomizedtesting.rules.StatementAdapter.evaluate(StatementAdapter.java:36)
	at com.carrotsearch.randomizedtesting.ThreadLeakControl$StatementRunner.run(ThreadLeakControl.java:368)
	at java.base/java.lang.Thread.run(Thread.java:844)


FAILED:  org.apache.solr.handler.admin.TestApiFramework.testFramework

Error Message:


Stack Trace:
java.lang.ExceptionInInitializerError
	at __randomizedtesting.SeedInfo.seed([127C456CF0EA8BEA:50A8F4BF63E67D7]:0)
	at net.sf.cglib.core.KeyFactory$Generator.generateClass(KeyFactory.java:166)
	at net.sf.cglib.core.DefaultGeneratorStrategy.generate(DefaultGeneratorStrategy.java:25)
	at net.sf.cglib.core.AbstractClassGenerator.create(AbstractClassGenerator.java:216)
	at net.sf.cglib.core.KeyFactory$Generator.create(KeyFactory.java:144)
	at net.sf.cglib.core.KeyFactory.create(KeyFactory.java:116)
	at net.sf.cglib.core.KeyFactory.create(KeyFactory.java:108)
	at net.sf.cglib.core.KeyFactory.create(KeyFactory.java:104)
	at net.sf.cglib.proxy.Enhancer.<clinit>(Enhancer.java:69)
	at org.easymock.internal.ClassProxyFactory.createEnhancer(ClassProxyFactory.java:259)
	at org.easymock.internal.ClassProxyFactory.createProxy(ClassProxyFactory.java:174)
	at org.easymock.internal.MocksControl.createMock(MocksControl.java:60)
	at org.easymock.EasyMock.createMock(EasyMock.java:104)
	at org.apache.solr.handler.admin.TestCoreAdminApis.getCoreContainerMock(TestCoreAdminApis.java:83)
	at org.apache.solr.handler.admin.TestApiFramework.testFramework(TestApiFramework.java:59)
	at java.base/jdk.internal.reflect.NativeMethodAccessorImpl.invoke0(Native Method)
	at java.base/jdk.internal.reflect.NativeMethodAccessorImpl.invoke(NativeMethodAccessorImpl.java:62)
	at java.base/jdk.internal.reflect.DelegatingMethodAccessorImpl.invoke(DelegatingMethodAccessorImpl.java:43)
	at java.base/java.lang.reflect.Method.invoke(Method.java:543)
	at com.carrotsearch.randomizedtesting.RandomizedRunner.invoke(RandomizedRunner.java:1713)
	at com.carrotsearch.randomizedtesting.RandomizedRunner$8.evaluate(RandomizedRunner.java:907)
	at com.carrotsearch.randomizedtesting.RandomizedRunner$9.evaluate(RandomizedRunner.java:943)
	at com.carrotsearch.randomizedtesting.RandomizedRunner$10.evaluate(RandomizedRunner.java:957)
	at com.carrotsearch.randomizedtesting.rules.SystemPropertiesRestoreRule$1.evaluate(SystemPropertiesRestoreRule.java:57)
	at org.apache.lucene.util.TestRuleSetupTeardownChained$1.evaluate(TestRuleSetupTeardownChained.java:49)
	at org.apache.lucene.util.AbstractBeforeAfterRule$1.evaluate(AbstractBeforeAfterRule.java:45)
	at org.apache.lucene.util.TestRuleThreadAndTestName$1.evaluate(TestRuleThreadAndTestName.java:48)
	at org.apache.lucene.util.TestRuleIgnoreAfterMaxFailures$1.evaluate(TestRuleIgnoreAfterMaxFailures.java:64)
	at org.apache.lucene.util.TestRuleMarkFailure$1.evaluate(TestRuleMarkFailure.java:47)
	at com.carrotsearch.randomizedtesting.rules.StatementAdapter.evaluate(StatementAdapter.java:36)
	at com.carrotsearch.randomizedtesting.ThreadLeakControl$StatementRunner.run(ThreadLeakControl.java:368)
	at com.carrotsearch.randomizedtesting.ThreadLeakControl.forkTimeoutingTask(ThreadLeakControl.java:817)
	at com.carrotsearch.randomizedtesting.ThreadLeakControl$3.evaluate(ThreadLeakControl.java:468)
	at com.carrotsearch.randomizedtesting.RandomizedRunner.runSingleTest(RandomizedRunner.java:916)
	at com.carrotsearch.randomizedtesting.RandomizedRunner$5.evaluate(RandomizedRunner.java:802)
	at com.carrotsearch.randomizedtesting.RandomizedRunner$6.evaluate(RandomizedRunner.java:852)
	at com.carrotsearch.randomizedtesting.RandomizedRunner$7.evaluate(RandomizedRunner.java:863)
	at com.carrotsearch.randomizedtesting.rules.StatementAdapter.evaluate(StatementAdapter.java:36)
	at com.carrotsearch.randomizedtesting.rules.SystemPropertiesRestoreRule$1.evaluate(SystemPropertiesRestoreRule.java:57)
	at org.apache.lucene.util.AbstractBeforeAfterRule$1.evaluate(AbstractBeforeAfterRule.java:45)
	at com.carrotsearch.randomizedtesting.rules.StatementAdapter.evaluate(StatementAdapter.java:36)
	at org.apache.lucene.util.TestRuleStoreClassName$1.evaluate(TestRuleStoreClassName.java:41)
	at com.carrotsearch.randomizedtesting.rules.NoShadowingOrOverridesOnMethodsRule$1.evaluate(NoShadowingOrOverridesOnMethodsRule.java:40)
	at com.carrotsearch.randomizedtesting.rules.NoShadowingOrOverridesOnMethodsRule$1.evaluate(NoShadowingOrOverridesOnMethodsRule.java:40)
	at com.carrotsearch.randomizedtesting.rules.StatementAdapter.evaluate(StatementAdapter.java:36)
	at com.carrotsearch.randomizedtesting.rules.StatementAdapter.evaluate(StatementAdapter.java:36)
	at org.apache.lucene.util.TestRuleAssertionsRequired$1.evaluate(TestRuleAssertionsRequired.java:53)
	at org.apache.lucene.util.TestRuleMarkFailure$1.evaluate(TestRuleMarkFailure.java:47)
	at org.apache.lucene.util.TestRuleIgnoreAfterMaxFailures$1.evaluate(TestRuleIgnoreAfterMaxFailures.java:64)
	at org.apache.lucene.util.TestRuleIgnoreTestSuites$1.evaluate(TestRuleIgnoreTestSuites.java:54)
	at com.carrotsearch.randomizedtesting.rules.StatementAdapter.evaluate(StatementAdapter.java:36)
	at com.carrotsearch.randomizedtesting.ThreadLeakControl$StatementRunner.run(ThreadLeakControl.java:368)
	at java.base/java.lang.Thread.run(Thread.java:844)
Caused by: java.lang.reflect.InaccessibleObjectException: Unable to make protected final java.lang.Class java.lang.ClassLoader.defineClass(java.lang.String,byte[],int,int,java.security.ProtectionDomain) throws java.lang.ClassFormatError accessible: module java.base does not "opens java.lang" to unnamed module @7cb9a136
	at java.base/java.lang.reflect.AccessibleObject.checkCanSetAccessible(AccessibleObject.java:207)
	at java.base/java.lang.reflect.Method.checkCanSetAccessible(Method.java:192)
	at java.base/java.lang.reflect.Method.setAccessible(Method.java:186)
	at net.sf.cglib.core.ReflectUtils$2.run(ReflectUtils.java:56)
	at java.base/java.security.AccessController.doPrivileged(Native Method)
	at net.sf.cglib.core.ReflectUtils.<clinit>(ReflectUtils.java:46)
	... 52 more




Build Log:
[...truncated 12557 lines...]
   [junit4] Suite: org.apache.solr.cloud.PeerSyncReplicationTest
   [junit4]   2> Creating dataDir: /home/jenkins/workspace/Lucene-Solr-6.x-Linux/solr/build/solr-core/test/J0/temp/solr.cloud.PeerSyncReplicationTest_127C456CF0EA8BEA-001/init-core-data-001
   [junit4]   2> 1737031 INFO  (SUITE-PeerSyncReplicationTest-seed#[127C456CF0EA8BEA]-worker) [    ] o.a.s.SolrTestCaseJ4 Using PointFields
   [junit4]   2> 1737033 INFO  (SUITE-PeerSyncReplicationTest-seed#[127C456CF0EA8BEA]-worker) [    ] o.a.s.SolrTestCaseJ4 Randomized ssl (false) and clientAuth (false) via: @org.apache.solr.util.RandomizeSSL(reason="", ssl=0.0/0.0, value=0.0/0.0, clientAuth=0.0/0.0)
   [junit4]   2> 1737033 INFO  (SUITE-PeerSyncReplicationTest-seed#[127C456CF0EA8BEA]-worker) [    ] o.a.s.BaseDistributedSearchTestCase Setting hostContext system property: /
   [junit4]   2> 1737034 INFO  (TEST-PeerSyncReplicationTest.test-seed#[127C456CF0EA8BEA]) [    ] o.a.s.c.ZkTestServer STARTING ZK TEST SERVER
   [junit4]   2> 1737034 INFO  (Thread-3195) [    ] o.a.s.c.ZkTestServer client port:0.0.0.0/0.0.0.0:0
   [junit4]   2> 1737034 INFO  (Thread-3195) [    ] o.a.s.c.ZkTestServer Starting server
   [junit4]   2> 1737134 INFO  (TEST-PeerSyncReplicationTest.test-seed#[127C456CF0EA8BEA]) [    ] o.a.s.c.ZkTestServer start zk server on port:38999
   [junit4]   2> 1737140 INFO  (TEST-PeerSyncReplicationTest.test-seed#[127C456CF0EA8BEA]) [    ] o.a.s.c.AbstractZkTestCase put /home/jenkins/workspace/Lucene-Solr-6.x-Linux/solr/core/src/test-files/solr/collection1/conf/solrconfig-tlog.xml to /configs/conf1/solrconfig.xml
   [junit4]   2> 1737142 INFO  (TEST-PeerSyncReplicationTest.test-seed#[127C456CF0EA8BEA]) [    ] o.a.s.c.AbstractZkTestCase put /home/jenkins/workspace/Lucene-Solr-6.x-Linux/solr/core/src/test-files/solr/collection1/conf/schema.xml to /configs/conf1/schema.xml
   [junit4]   2> 1737144 INFO  (TEST-PeerSyncReplicationTest.test-seed#[127C456CF0EA8BEA]) [    ] o.a.s.c.AbstractZkTestCase put /home/jenkins/workspace/Lucene-Solr-6.x-Linux/solr/core/src/test-files/solr/collection1/conf/solrconfig.snippet.randomindexconfig.xml to /configs/conf1/solrconfig.snippet.randomindexconfig.xml
   [junit4]   2> 1737145 INFO  (TEST-PeerSyncReplicationTest.test-seed#[127C456CF0EA8BEA]) [    ] o.a.s.c.AbstractZkTestCase put /home/jenkins/workspace/Lucene-Solr-6.x-Linux/solr/core/src/test-files/solr/collection1/conf/stopwords.txt to /configs/conf1/stopwords.txt
   [junit4]   2> 1737147 INFO  (TEST-PeerSyncReplicationTest.test-seed#[127C456CF0EA8BEA]) [    ] o.a.s.c.AbstractZkTestCase put /home/jenkins/workspace/Lucene-Solr-6.x-Linux/solr/core/src/test-files/solr/collection1/conf/protwords.txt to /configs/conf1/protwords.txt
   [junit4]   2> 1737150 INFO  (TEST-PeerSyncReplicationTest.test-seed#[127C456CF0EA8BEA]) [    ] o.a.s.c.AbstractZkTestCase put /home/jenkins/workspace/Lucene-Solr-6.x-Linux/solr/core/src/test-files/solr/collection1/conf/currency.xml to /configs/conf1/currency.xml
   [junit4]   2> 1737151 INFO  (TEST-PeerSyncReplicationTest.test-seed#[127C456CF0EA8BEA]) [    ] o.a.s.c.AbstractZkTestCase put /home/jenkins/workspace/Lucene-Solr-6.x-Linux/solr/core/src/test-files/solr/collection1/conf/enumsConfig.xml to /configs/conf1/enumsConfig.xml
   [junit4]   2> 1737153 INFO  (TEST-PeerSyncReplicationTest.test-seed#[127C456CF0EA8BEA]) [    ] o.a.s.c.AbstractZkTestCase put /home/jenkins/workspace/Lucene-Solr-6.x-Linux/solr/core/src/test-files/solr/collection1/conf/open-exchange-rates.json to /configs/conf1/open-exchange-rates.json
   [junit4]   2> 1737155 INFO  (TEST-PeerSyncReplicationTest.test-seed#[127C456CF0EA8BEA]) [    ] o.a.s.c.AbstractZkTestCase put /home/jenkins/workspace/Lucene-Solr-6.x-Linux/solr/core/src/test-files/solr/collection1/conf/mapping-ISOLatin1Accent.txt to /configs/conf1/mapping-ISOLatin1Accent.txt
   [junit4]   2> 1737156 INFO  (TEST-PeerSyncReplicationTest.test-seed#[127C456CF0EA8BEA]) [    ] o.a.s.c.AbstractZkTestCase put /home/jenkins/workspace/Lucene-Solr-6.x-Linux/solr/core/src/test-files/solr/collection1/conf/old_synonyms.txt to /configs/conf1/old_synonyms.txt
   [junit4]   2> 1737158 INFO  (TEST-PeerSyncReplicationTest.test-seed#[127C456CF0EA8BEA]) [    ] o.a.s.c.AbstractZkTestCase put /home/jenkins/workspace/Lucene-Solr-6.x-Linux/solr/core/src/test-files/solr/collection1/conf/synonyms.txt to /configs/conf1/synonyms.txt
   [junit4]   2> 1737719 INFO  (TEST-PeerSyncReplicationTest.test-seed#[127C456CF0EA8BEA]) [    ] o.a.s.SolrTestCaseJ4 Writing core.properties file to /home/jenkins/workspace/Lucene-Solr-6.x-Linux/solr/build/solr-core/test/J0/temp/solr.cloud.PeerSyncReplicationTest_127C456CF0EA8BEA-001/control-001/cores/collection1
   [junit4]   2> 1737721 INFO  (TEST-PeerSyncReplicationTest.test-seed#[127C456CF0EA8BEA]) [    ] o.e.j.s.Server jetty-9.3.14.v20161028
   [junit4]   2> 1737722 INFO  (TEST-PeerSyncReplicationTest.test-seed#[127C456CF0EA8BEA]) [    ] o.e.j.s.h.ContextHandler Started o.e.j.s.ServletContextHandler@14839882{/,null,AVAILABLE}
   [junit4]   2> 1737723 INFO  (TEST-PeerSyncReplicationTest.test-seed#[127C456CF0EA8BEA]) [    ] o.e.j.s.AbstractConnector Started ServerConnector@345a7c70{HTTP/1.1,[http/1.1]}{127.0.0.1:34899}
   [junit4]   2> 1737723 INFO  (TEST-PeerSyncReplicationTest.test-seed#[127C456CF0EA8BEA]) [    ] o.e.j.s.Server Started @1739616ms
   [junit4]   2> 1737723 INFO  (TEST-PeerSyncReplicationTest.test-seed#[127C456CF0EA8BEA]) [    ] o.a.s.c.s.e.JettySolrRunner Jetty properties: {hostContext=/, solr.data.dir=/home/jenkins/workspace/Lucene-Solr-6.x-Linux/solr/build/solr-core/test/J0/temp/solr.cloud.PeerSyncReplicationTest_127C456CF0EA8BEA-001/tempDir-001/control/data, hostPort=34899, coreRootDirectory=/home/jenkins/workspace/Lucene-Solr-6.x-Linux/solr/build/solr-core/test/J0/temp/solr.cloud.PeerSyncReplicationTest_127C456CF0EA8BEA-001/control-001/cores}
   [junit4]   2> 1737724 ERROR (TEST-PeerSyncReplicationTest.test-seed#[127C456CF0EA8BEA]) [    ] o.a.s.s.StartupLoggingUtils Missing Java Option solr.log.dir. Logging may be missing or incomplete.
   [junit4]   2> 1737724 INFO  (TEST-PeerSyncReplicationTest.test-seed#[127C456CF0EA8BEA]) [    ] o.a.s.s.SolrDispatchFilter  ___      _       Welcome to Apache Solr™ version 6.5.0
   [junit4]   2> 1737724 INFO  (TEST-PeerSyncReplicationTest.test-seed#[127C456CF0EA8BEA]) [    ] o.a.s.s.SolrDispatchFilter / __| ___| |_ _   Starting in cloud mode on port null
   [junit4]   2> 1737724 INFO  (TEST-PeerSyncReplicationTest.test-seed#[127C456CF0EA8BEA]) [    ] o.a.s.s.SolrDispatchFilter \__ \/ _ \ | '_|  Install dir: null
   [junit4]   2> 1737724 INFO  (TEST-PeerSyncReplicationTest.test-seed#[127C456CF0EA8BEA]) [    ] o.a.s.s.SolrDispatchFilter |___/\___/_|_|    Start time: 2017-02-15T21:58:37.383303Z
   [junit4]   2> 1737726 INFO  (TEST-PeerSyncReplicationTest.test-seed#[127C456CF0EA8BEA]) [    ] o.a.s.s.SolrDispatchFilter Loading solr.xml from SolrHome (not found in ZooKeeper)
   [junit4]   2> 1737726 INFO  (TEST-PeerSyncReplicationTest.test-seed#[127C456CF0EA8BEA]) [    ] o.a.s.c.SolrXmlConfig Loading container configuration from /home/jenkins/workspace/Lucene-Solr-6.x-Linux/solr/build/solr-core/test/J0/temp/solr.cloud.PeerSyncReplicationTest_127C456CF0EA8BEA-001/control-001/solr.xml
   [junit4]   2> 1737732 INFO  (TEST-PeerSyncReplicationTest.test-seed#[127C456CF0EA8BEA]) [    ] o.a.s.u.UpdateShardHandler Creating UpdateShardHandler HTTP client with params: socketTimeout=340000&connTimeout=45000&retry=true
   [junit4]   2> 1737733 INFO  (TEST-PeerSyncReplicationTest.test-seed#[127C456CF0EA8BEA]) [    ] o.a.s.c.ZkContainer Zookeeper client=127.0.0.1:38999/solr
   [junit4]   2> 1737741 INFO  (TEST-PeerSyncReplicationTest.test-seed#[127C456CF0EA8BEA]) [    ] o.a.s.c.Overseer Overseer (id=null) closing
   [junit4]   2> 1737741 INFO  (TEST-PeerSyncReplicationTest.test-seed#[127C456CF0EA8BEA]) [    ] o.a.s.c.OverseerElectionContext I am going to be the leader 127.0.0.1:34899_
   [junit4]   2> 1737741 INFO  (TEST-PeerSyncReplicationTest.test-seed#[127C456CF0EA8BEA]) [    ] o.a.s.c.Overseer Overseer (id=97464871596589060-127.0.0.1:34899_-n_0000000000) starting
   [junit4]   2> 1737744 INFO  (TEST-PeerSyncReplicationTest.test-seed#[127C456CF0EA8BEA]) [    ] o.a.s.c.ZkController Register node as live in ZooKeeper:/live_nodes/127.0.0.1:34899_
   [junit4]   2> 1737745 INFO  (zkCallback-1839-thread-1) [    ] o.a.s.c.c.ZkStateReader Updated live nodes from ZooKeeper... (0) -> (1)
   [junit4]   2> 1737842 INFO  (TEST-PeerSyncReplicationTest.test-seed#[127C456CF0EA8BEA]) [    ] o.a.s.c.CorePropertiesLocator Found 1 core definitions underneath /home/jenkins/workspace/Lucene-Solr-6.x-Linux/solr/build/solr-core/test/J0/temp/solr.cloud.PeerSyncReplicationTest_127C456CF0EA8BEA-001/control-001/cores
   [junit4]   2> 1737843 INFO  (TEST-PeerSyncReplicationTest.test-seed#[127C456CF0EA8BEA]) [    ] o.a.s.c.CorePropertiesLocator Cores are: [collection1]
   [junit4]   2> 1737844 INFO  (OverseerStateUpdate-97464871596589060-127.0.0.1:34899_-n_0000000000) [    ] o.a.s.c.o.ReplicaMutator Assigning new node to shard shard=shard1
   [junit4]   2> 1738851 WARN  (coreLoadExecutor-7034-thread-1) [    ] o.a.s.c.Config Beginning with Solr 5.5, <mergePolicy> is deprecated, use <mergePolicyFactory> instead.
   [junit4]   2> 1738851 INFO  (coreLoadExecutor-7034-thread-1) [    ] o.a.s.c.SolrConfig Using Lucene MatchVersion: 6.5.0
   [junit4]   2> 1738861 INFO  (coreLoadExecutor-7034-thread-1) [    ] o.a.s.s.IndexSchema [collection1] Schema name=test
   [junit4]   2> 1738929 WARN  (coreLoadExecutor-7034-thread-1) [    ] o.a.s.s.IndexSchema [collection1] default search field in schema is text. WARNING: Deprecated, please use 'df' on request instead.
   [junit4]   2> 1738930 INFO  (coreLoadExecutor-7034-thread-1) [    ] o.a.s.s.IndexSchema Loaded schema test/1.0 with uniqueid field id
   [junit4]   2> 1738936 INFO  (coreLoadExecutor-7034-thread-1) [    ] o.a.s.c.CoreContainer Creating SolrCore 'collection1' using configuration from collection control_collection
   [junit4]   2> 1738936 INFO  (coreLoadExecutor-7034-thread-1) [    ] o.a.s.c.SolrCore [[collection1] ] Opening new SolrCore at [/home/jenkins/workspace/Lucene-Solr-6.x-Linux/solr/build/solr-core/test/J0/temp/solr.cloud.PeerSyncReplicationTest_127C456CF0EA8BEA-001/control-001/cores/collection1], dataDir=[/home/jenkins/workspace/Lucene-Solr-6.x-Linux/solr/build/solr-core/test/J0/temp/solr.cloud.PeerSyncReplicationTest_127C456CF0EA8BEA-001/control-001/cores/collection1/data/]
   [junit4]   2> 1738937 INFO  (coreLoadExecutor-7034-thread-1) [    ] o.a.s.c.JmxMonitoredMap JMX monitoring is enabled. Adding Solr mbeans to JMX Server: com.sun.jmx.mbeanserver.JmxMBeanServer@26be7889
   [junit4]   2> 1738942 INFO  (coreLoadExecutor-7034-thread-1) [    ] o.a.s.u.RandomMergePolicy RandomMergePolicy wrapping class org.apache.lucene.index.TieredMergePolicy: [TieredMergePolicy: maxMergeAtOnce=32, maxMergeAtOnceExplicit=14, maxMergedSegmentMB=9.9892578125, floorSegmentMB=1.96484375, forceMergeDeletesPctAllowed=26.95330187594849, segmentsPerTier=27.0, maxCFSSegmentSizeMB=8.796093022207999E12, noCFSRatio=0.4653509738578777
   [junit4]   2> 1738994 WARN  (coreLoadExecutor-7034-thread-1) [    ] o.a.s.c.RequestHandlers INVALID paramSet a in requestHandler {type = requestHandler,name = /dump,class = DumpRequestHandler,attributes = {initParams=a, name=/dump, class=DumpRequestHandler},args = {defaults={a=A,b=B}}}
   [junit4]   2> 1739094 INFO  (coreLoadExecutor-7034-thread-1) [    ] o.a.s.u.UpdateHandler Using UpdateLog implementation: org.apache.solr.update.UpdateLog
   [junit4]   2> 1739094 INFO  (coreLoadExecutor-7034-thread-1) [    ] o.a.s.u.UpdateLog Initializing UpdateLog: dataDir= defaultSyncLevel=FLUSH numRecordsToKeep=1000 maxNumLogsToKeep=10 numVersionBuckets=65536
   [junit4]   2> 1739095 INFO  (coreLoadExecutor-7034-thread-1) [    ] o.a.s.u.CommitTracker Hard AutoCommit: disabled
   [junit4]   2> 1739095 INFO  (coreLoadExecutor-7034-thread-1) [    ] o.a.s.u.CommitTracker Soft AutoCommit: disabled
   [junit4]   2> 1739096 INFO  (coreLoadExecutor-7034-thread-1) [    ] o.a.s.u.RandomMergePolicy RandomMergePolicy wrapping class org.apache.lucene.index.TieredMergePolicy: [TieredMergePolicy: maxMergeAtOnce=13, maxMergeAtOnceExplicit=40, maxMergedSegmentMB=12.7109375, floorSegmentMB=1.4296875, forceMergeDeletesPctAllowed=0.557539262176292, segmentsPerTier=37.0, maxCFSSegmentSizeMB=8.796093022207999E12, noCFSRatio=0.0
   [junit4]   2> 1739097 INFO  (coreLoadExecutor-7034-thread-1) [    ] o.a.s.s.SolrIndexSearcher Opening [Searcher@3818ead8[collection1] main]
   [junit4]   2> 1739098 INFO  (coreLoadExecutor-7034-thread-1) [    ] o.a.s.r.ManagedResourceStorage Configured ZooKeeperStorageIO with znodeBase: /configs/conf1
   [junit4]   2> 1739098 INFO  (coreLoadExecutor-7034-thread-1) [    ] o.a.s.r.ManagedResourceStorage Loaded null at path _rest_managed.json using ZooKeeperStorageIO:path=/configs/conf1
   [junit4]   2> 1739098 INFO  (coreLoadExecutor-7034-thread-1) [    ] o.a.s.h.ReplicationHandler Commits will be reserved for  10000
   [junit4]   2> 1739099 INFO  (searcherExecutor-7035-thread-1) [    ] o.a.s.c.SolrCore [collection1] Registered new searcher Searcher@3818ead8[collection1] main{ExitableDirectoryReader(UninvertingDirectoryReader())}
   [junit4]   2> 1739100 INFO  (coreLoadExecutor-7034-thread-1) [    ] o.a.s.u.UpdateLog Could not find max version in index or recent updates, using new clock 1559437947708637184
   [junit4]   2> 1739104 INFO  (coreZkRegister-7027-thread-1) [    ] o.a.s.c.ShardLeaderElectionContext Enough replicas found to continue.
   [junit4]   2> 1739104 INFO  (coreZkRegister-7027-thread-1) [    ] o.a.s.c.ShardLeaderElectionContext I may be the new leader - try and sync
   [junit4]   2> 1739104 INFO  (coreZkRegister-7027-thread-1) [    ] o.a.s.c.SyncStrategy Sync replicas to http://127.0.0.1:34899/collection1/
   [junit4]   2> 1739104 INFO  (coreZkRegister-7027-thread-1) [    ] o.a.s.c.SyncStrategy Sync Success - now sync replicas to me
   [junit4]   2> 1739104 INFO  (coreZkRegister-7027-thread-1) [    ] o.a.s.c.SyncStrategy http://127.0.0.1:34899/collection1/ has no replicas
   [junit4]   2> 1739106 INFO  (coreZkRegister-7027-thread-1) [    ] o.a.s.c.ShardLeaderElectionContext I am the new leader: http://127.0.0.1:34899/collection1/ shard1
   [junit4]   2> 1739256 INFO  (coreZkRegister-7027-thread-1) [    ] o.a.s.c.ZkController I am the leader, no recovery necessary
   [junit4]   2> 1739458 INFO  (TEST-PeerSyncReplicationTest.test-seed#[127C456CF0EA8BEA]) [    ] o.a.s.c.c.ZkStateReader Updated live nodes from ZooKeeper... (0) -> (1)
   [junit4]   2> 1739459 INFO  (TEST-PeerSyncReplicationTest.test-seed#[127C456CF0EA8BEA]) [    ] o.a.s.c.s.i.ZkClientClusterStateProvider Cluster at 127.0.0.1:38999/solr ready
   [junit4]   2> 1739459 INFO  (TEST-PeerSyncReplicationTest.test-seed#[127C456CF0EA8BEA]) [    ] o.a.s.c.ChaosMonkey monkey: init - expire sessions:false cause connection loss:false
   [junit4]   2> 1739459 INFO  (TEST-PeerSyncReplicationTest.test-seed#[127C456CF0EA8BEA]) [    ] o.a.s.c.AbstractFullDistribZkTestBase Creating collection1 with stateFormat=2
   [junit4]   2> 1740198 INFO  (TEST-PeerSyncReplicationTest.test-seed#[127C456CF0EA8BEA]) [    ] o.a.s.SolrTestCaseJ4 Writing core.properties file to /home/jenkins/workspace/Lucene-Solr-6.x-Linux/solr/build/solr-core/test/J0/temp/solr.cloud.PeerSyncReplicationTest_127C456CF0EA8BEA-001/shard-1-001/cores/collection1
   [junit4]   2> 1740199 INFO  (TEST-PeerSyncReplicationTest.test-seed#[127C456CF0EA8BEA]) [    ] o.a.s.c.AbstractFullDistribZkTestBase create jetty 1 in directory /home/jenkins/workspace/Lucene-Solr-6.x-Linux/solr/build/solr-core/test/J0/temp/solr.cloud.PeerSyncReplicationTest_127C456CF0EA8BEA-001/shard-1-001
   [junit4]   2> 1740199 INFO  (TEST-PeerSyncReplicationTest.test-seed#[127C456CF0EA8BEA]) [    ] o.e.j.s.Server jetty-9.3.14.v20161028
   [junit4]   2> 1740200 INFO  (TEST-PeerSyncReplicationTest.test-seed#[127C456CF0EA8BEA]) [    ] o.e.j.s.h.ContextHandler Started o.e.j.s.ServletContextHandler@2a2c158{/,null,AVAILABLE}
   [junit4]   2> 1740200 INFO  (TEST-PeerSyncReplicationTest.test-seed#[127C456CF0EA8BEA]) [    ] o.e.j.s.AbstractConnector Started ServerConnector@3994070c{HTTP/1.1,[http/1.1]}{127.0.0.1:43672}
   [junit4]   2> 1740201 INFO  (TEST-PeerSyncReplicationTest.test-seed#[127C456CF0EA8BEA]) [    ] o.e.j.s.Server Started @1742093ms
   [junit4]   2> 1740201 INFO  (TEST-PeerSyncReplicationTest.test-seed#[127C456CF0EA8BEA]) [    ] o.a.s.c.s.e.JettySolrRunner Jetty properties: {hostContext=/, solrconfig=solrconfig.xml, solr.data.dir=/home/jenkins/workspace/Lucene-Solr-6.x-Linux/solr/build/solr-core/test/J0/temp/solr.cloud.PeerSyncReplicationTest_127C456CF0EA8BEA-001/tempDir-001/jetty1, hostPort=43672, coreRootDirectory=/home/jenkins/workspace/Lucene-Solr-6.x-Linux/solr/build/solr-core/test/J0/../../../../../../../../../home/jenkins/workspace/Lucene-Solr-6.x-Linux/solr/build/solr-core/test/J0/temp/solr.cloud.PeerSyncReplicationTest_127C456CF0EA8BEA-001/shard-1-001/cores}
   [junit4]   2> 1740201 ERROR (TEST-PeerSyncReplicationTest.test-seed#[127C456CF0EA8BEA]) [    ] o.a.s.s.StartupLoggingUtils Missing Java Option solr.log.dir. Logging may be missing or incomplete.
   [junit4]   2> 1740201 INFO  (TEST-PeerSyncReplicationTest.test-seed#[127C456CF0EA8BEA]) [    ] o.a.s.s.SolrDispatchFilter  ___      _       Welcome to Apache Solr™ version 6.5.0
   [junit4]   2> 1740201 INFO  (TEST-PeerSyncReplicationTest.test-seed#[127C456CF0EA8BEA]) [    ] o.a.s.s.SolrDispatchFilter / __| ___| |_ _   Starting in cloud mode on port null
   [junit4]   2> 1740201 INFO  (TEST-PeerSyncReplicationTest.test-seed#[127C456CF0EA8BEA]) [    ] o.a.s.s.SolrDispatchFilter \__ \/ _ \ | '_|  Install dir: null
   [junit4]   2> 1740201 INFO  (TEST-PeerSyncReplicationTest.test-seed#[127C456CF0EA8BEA]) [    ] o.a.s.s.SolrDispatchFilter |___/\___/_|_|    Start time: 2017-02-15T21:58:39.860653Z
   [junit4]   2> 1740203 INFO  (TEST-PeerSyncReplicationTest.test-seed#[127C456CF0EA8BEA]) [    ] o.a.s.s.SolrDispatchFilter Loading solr.xml from SolrHome (not found in ZooKeeper)
   [junit4]   2> 1740203 INFO  (TEST-PeerSyncReplicationTest.test-seed#[127C456CF0EA8BEA]) [    ] o.a.s.c.SolrXmlConfig Loading container configuration from /home/jenkins/workspace/Lucene-Solr-6.x-Linux/solr/build/solr-core/test/J0/temp/solr.cloud.PeerSyncReplicationTest_127C456CF0EA8BEA-001/shard-1-001/solr.xml
   [junit4]   2> 1740208 INFO  (TEST-PeerSyncReplicationTest.test-seed#[127C456CF0EA8BEA]) [    ] o.a.s.u.UpdateShardHandler Creating UpdateShardHandler HTTP client with params: socketTimeout=340000&connTimeout=45000&retry=true
   [junit4]   2> 1740210 INFO  (TEST-PeerSyncReplicationTest.test-seed#[127C456CF0EA8BEA]) [    ] o.a.s.c.ZkContainer Zookeeper client=127.0.0.1:38999/solr
   [junit4]   2> 1740214 INFO  (TEST-PeerSyncReplicationTest.test-seed#[127C456CF0EA8BEA]) [    ] o.a.s.c.c.ZkStateReader Updated live nodes from ZooKeeper... (0) -> (1)
   [junit4]   2> 1740215 INFO  (TEST-PeerSyncReplicationTest.test-seed#[127C456CF0EA8BEA]) [    ] o.a.s.c.Overseer Overseer (id=null) closing
   [junit4]   2> 1740216 INFO  (TEST-PeerSyncReplicationTest.test-seed#[127C456CF0EA8BEA]) [    ] o.a.s.c.ZkController Register node as live in ZooKeeper:/live_nodes/127.0.0.1:43672_
   [junit4]   2> 1740216 INFO  (zkCallback-1839-thread-2) [    ] o.a.s.c.c.ZkStateReader Updated live nodes from ZooKeeper... (1) -> (2)
   [junit4]   2> 1740217 INFO  (zkCallback-1843-thread-1) [    ] o.a.s.c.c.ZkStateReader Updated live nodes from ZooKeeper... (1) -> (2)
   [junit4]   2> 1740217 INFO  (zkCallback-1849-thread-1) [    ] o.a.s.c.c.ZkStateReader Updated live nodes from ZooKeeper... (1) -> (2)
   [junit4]   2> 1740319 INFO  (TEST-PeerSyncReplicationTest.test-seed#[127C456CF0EA8BEA]) [    ] o.a.s.c.CorePropertiesLocator Found 1 core definitions underneath /home/jenkins/workspace/Lucene-Solr-6.x-Linux/solr/build/solr-core/test/J0/../../../../../../../../../home/jenkins/workspace/Lucene-Solr-6.x-Linux/solr/build/solr-core/test/J0/temp/solr.cloud.PeerSyncReplicationTest_127C456CF0EA8BEA-001/shard-1-001/cores
   [junit4]   2> 1740319 INFO  (TEST-PeerSyncReplicationTest.test-seed#[127C456CF0EA8BEA]) [    ] o.a.s.c.CorePropertiesLocator Cores are: [collection1]
   [junit4]   2> 1740320 INFO  (OverseerStateUpdate-97464871596589060-127.0.0.1:34899_-n_0000000000) [    ] o.a.s.c.o.ReplicaMutator Assigning new node to shard shard=shard1
   [junit4]   2> 1740422 INFO  (zkCallback-1849-thread-1) [    ] o.a.s.c.c.ZkStateReader A cluster state change: [WatchedEvent state:SyncConnected type:NodeDataChanged path:/collections/collection1/state.json] for collection [collection1] has occurred - updating... (live nodes size: [2])
   [junit4]   2> 1741326 WARN  (coreLoadExecutor-7045-thread-1) [    ] o.a.s.c.Config Beginning with Solr 5.5, <mergePolicy> is deprecated, use <mergePolicyFactory> instead.
   [junit4]   2> 1741326 INFO  (coreLoadExecutor-7045-thread-1) [    ] o.a.s.c.SolrConfig Using Lucene MatchVersion: 6.5.0
   [junit4]   2> 1741335 INFO  (coreLoadExecutor-7045-thread-1) [    ] o.a.s.s.IndexSchema [collection1] Schema name=test
   [junit4]   2> 1741391 WARN  (coreLoadExecutor-7045-thread-1) [    ] o.a.s.s.IndexSchema [collection1] default search field in schema is text. WARNING: Deprecated, please use 'df' on request instead.
   [junit4]   2> 1741393 INFO  (coreLoadExecutor-7045-thread-1) [    ] o.a.s.s.IndexSchema Loaded schema test/1.0 with uniqueid field id
   [junit4]   2> 1741397 INFO  (coreLoadExecutor-7045-thread-1) [    ] o.a.s.c.CoreContainer Creating SolrCore 'collection1' using configuration from collection collection1
   [junit4]   2> 1741398 INFO  (coreLoadExecutor-7045-thread-1) [    ] o.a.s.c.SolrCore [[collection1] ] Opening new SolrCore at [/home/jenkins/workspace/Lucene-Solr-6.x-Linux/solr/build/solr-core/test/J0/temp/solr.cloud.PeerSyncReplicationTest_127C456CF0EA8BEA-001/shard-1-001/cores/collection1], dataDir=[/home/jenkins/workspace/Lucene-Solr-6.x-Linux/solr/build/solr-core/test/J0/../../../../../../../../../home/jenkins/workspace/Lucene-Solr-6.x-Linux/solr/build/solr-core/test/J0/temp/solr.cloud.PeerSyncReplicationTest_127C456CF0EA8BEA-001/shard-1-001/cores/collection1/data/]
   [junit4]   2> 1741398 INFO  (coreLoadExecutor-7045-thread-1) [    ] o.a.s.c.JmxMonitoredMap JMX monitoring is enabled. Adding Solr mbeans to JMX Server: com.sun.jmx.mbeanserver.JmxMBeanServer@26be7889
   [junit4]   2> 1741403 INFO  (coreLoadExecutor-7045-thread-1) [    ] o.a.s.u.RandomMergePolicy RandomMergePolicy wrapping class org.apache.lucene.index.TieredMergePolicy: [TieredMergePolicy: maxMergeAtOnce=32, maxMergeAtOnceExplicit=14, maxMergedSegmentMB=9.9892578125, floorSegmentMB=1.96484375, forceMergeDeletesPctAllowed=26.95330187594849, segmentsPerTier=27.0, maxCFSSegmentSizeMB=8.796093022207999E12, noCFSRatio=0.4653509738578777
   [junit4]   2> 1741465 WARN  (coreLoadExecutor-7045-thread-1) [    ] o.a.s.c.RequestHandlers INVALID paramSet a in requestHandler {type = requestHandler,name = /dump,class = DumpRequestHandler,attributes = {initParams=a, name=/dump, class=DumpRequestHandler},args = {defaults={a=A,b=B}}}
   [junit4]   2> 1741577 INFO  (coreLoadExecutor-7045-thread-1) [    ] o.a.s.u.UpdateHandler Using UpdateLog implementation: org.apache.solr.update.UpdateLog
   [junit4]   2> 1741577 INFO  (coreLoadExecutor-7045-thread-1) [    ] o.a.s.u.UpdateLog Initializing UpdateLog: dataDir= defaultSyncLevel=FLUSH numRecordsToKeep=1000 maxNumLogsToKeep=10 numVersionBuckets=65536
   [junit4]   2> 1741579 INFO  (coreLoadExecutor-7045-thread-1) [    ] o.a.s.u.CommitTracker Hard AutoCommit: disabled
   [junit4]   2> 1741579 INFO  (coreLoadExecutor-7045-thread-1) [    ] o.a.s.u.CommitTracker Soft AutoCommit: disabled
   [junit4]   2> 1741580 INFO  (coreLoadExecutor-7045-thread-1) [    ] o.a.s.u.RandomMergePolicy RandomMergePolicy wrapping class org.apache.lucene.index.TieredMergePolicy: [TieredMergePolicy: maxMergeAtOnce=13, maxMergeAtOnceExplicit=40, maxMergedSegmentMB=12.7109375, floorSegmentMB=1.4296875, forceMergeDeletesPctAllowed=0.557539262176292, segmentsPerTier=37.0, maxCFSSegmentSizeMB=8.796093022207999E12, noCFSRatio=0.0
   [junit4]   2> 1741581 INFO  (coreLoadExecutor-7045-thread-1) [    ] o.a.s.s.SolrIndexSearcher Opening [Searcher@33f1e2cf[collection1] main]
   [junit4]   2> 1741581 INFO  (coreLoadExecutor-7045-thread-1) [    ] o.a.s.r.ManagedResourceStorage Configured ZooKeeperStorageIO with znodeBase: /configs/conf1
   [junit4]   2> 1741582 INFO  (coreLoadExecutor-7045-thread-1) [    ] o.a.s.r.ManagedResourceStorage Loaded null at path _rest_managed.json using ZooKeeperStorageIO:path=/configs/conf1
   [junit4]   2> 1741582 INFO  (coreLoadExecutor-7045-thread-1) [    ] o.a.s.h.ReplicationHandler Commits will be reserved for  10000
   [junit4]   2> 1741582 INFO  (searcherExecutor-7046-thread-1) [    ] o.a.s.c.SolrCore [collection1] Registered new searcher Searcher@33f1e2cf[collection1] main{ExitableDirectoryReader(UninvertingDirectoryReader())}
   [junit4]   2> 1741584 INFO  (coreLoadExecutor-7045-thread-1) [    ] o.a.s.u.UpdateLog Could not find max version in index or recent updates, using new clock 1559437950313299968
   [junit4]   2> 1741587 INFO  (coreZkRegister-7040-thread-1) [    ] o.a.s.c.ShardLeaderElectionContext Enough replicas found to continue.
   [junit4]   2> 1741587 INFO  (coreZkRegister-7040-thread-1) [    ] o.a.s.c.ShardLeaderElectionContext I may be the new leader - try and sync
   [junit4]   2> 1741587 INFO  (coreZkRegister-7040-thread-1) [    ] o.a.s.c.SyncStrategy Sync replicas to http://127.0.0.1:43672/collection1/
   [junit4]   2> 1741587 INFO  (coreZkRegister-7040-thread-1) [    ] o.a.s.c.SyncStrategy Sync Success - now sync replicas to me
   [junit4]   2> 1741587 INFO  (coreZkRegister-7040-thread-1) [    ] o.a.s.c.SyncStrategy http://127.0.0.1:43672/collection1/ has no replicas
   [junit4]   2> 1741589 INFO  (coreZkRegister-7040-thread-1) [    ] o.a.s.c.ShardLeaderElectionContext I am the new leader: http://127.0.0.1:43672/collection1/ shard1
   [junit4]   2> 1741690 INFO  (zkCallback-1849-thread-1) [    ] o.a.s.c.c.ZkStateReader A cluster state change: [WatchedEvent state:SyncConnected type:NodeDataChanged path:/collections/collection1/state.json] for collection [collection1] has occurred - updating... (live nodes size: [2])
   [junit4]   2> 1741740 INFO  (coreZkRegister-7040-thread-1) [    ] o.a.s.c.ZkController I am the leader, no recovery necessary
   [junit4]   2> 1741853 INFO  (zkCallback-1849-thread-1) [    ] o.a.s.c.c.ZkStateReader A cluster state change: [WatchedEvent state:SyncConnected type:NodeDataChanged path:/collections/collection1/state.json] for collection [collection1] has occurred - updating... (live nodes size: [2])
   [junit4]   2> 1742469 INFO  (TEST-PeerSyncReplicationTest.test-seed#[127C456CF0EA8BEA]) [    ] o.a.s.SolrTestCaseJ4 Writing core.properties file to /home/jenkins/workspace/Lucene-Solr-6.x-Linux/solr/build/solr-core/test/J0/temp/solr.cloud.PeerSyncReplicationTest_127C456CF0EA8BEA-001/shard-2-001/cores/collection1
   [junit4]   2> 1742470 INFO  (TEST-PeerSyncReplicationTest.test-seed#[127C456CF0EA8BEA]) [    ] o.a.s.c.AbstractFullDistribZkTestBase create jetty 2 in directory /home/jenkins/workspace/Lucene-Solr-6.x-Linux/solr/build/solr-core/test/J0/temp/solr.cloud.PeerSyncReplicationTest_127C456CF0EA8BEA-001/shard-2-001
   [junit4]   2> 1742471 INFO  (TEST-PeerSyncReplicationTest.test-seed#[127C456CF0EA8BEA]) [    ] o.e.j.s.Server jetty-9.3.14.v20161028
   [junit4]   2> 1742472 INFO  (TEST-PeerSyncReplicationTest.test-seed#[127C456CF0EA8BEA]) [    ] o.e.j.s.h.ContextHandler Started o.e.j.s.ServletContextHandler@4f1903e6{/,null,AVAILABLE}
   [junit4]   2> 1742472 INFO  (TEST-PeerSyncReplicationTest.test-seed#[127C456CF0EA8BEA]) [    ] o.e.j.s.AbstractConnector Started ServerConnector@23fd6979{HTTP/1.1,[http/1.1]}{127.0.0.1:37102}
   [junit4]   2> 1742472 INFO  (TEST-PeerSyncReplicationTest.test-seed#[127C456CF0EA8BEA]) [    ] o.e.j.s.Server Started @1744365ms
   [junit4]   2> 1742472 INFO  (TEST-PeerSyncReplicationTest.test-seed#[127C456CF0EA8BEA]) [    ] o.a.s.c.s.e.JettySolrRunner Jetty properties: {hostContext=/, solrconfig=solrconfig.xml, solr.data.dir=/home/jenkins/workspace/Lucene-Solr-6.x-Linux/solr/build/solr-core/test/J0/temp/solr.cloud.PeerSyncReplicationTest_127C456CF0EA8BEA-001/tempDir-001/jetty2, hostPort=37102, coreRootDirectory=/home/jenkins/workspace/Lucene-Solr-6.x-Linux/solr/build/solr-core/test/J0/temp/solr.cloud.PeerSyncReplicationTest_127C456CF0EA8BEA-001/shard-2-001/cores}
   [junit4]   2> 1742473 ERROR (TEST-PeerSyncReplicationTest.test-seed#[127C456CF0EA8BEA]) [    ] o.a.s.s.StartupLoggingUtils Missing Java Option solr.log.dir. Logging may be missing or incomplete.
   [junit4]   2> 1742473 INFO  (TEST-PeerSyncReplicationTest.test-seed#[127C456CF0EA8BEA]) [    ] o.a.s.s.SolrDispatchFilter  ___      _       Welcome to Apache Solr™ version 6.5.0
   [junit4]   2> 1742473 INFO  (TEST-PeerSyncReplicationTest.test-seed#[127C456CF0EA8BEA]) [    ] o.a.s.s.SolrDispatchFilter / __| ___| |_ _   Starting in cloud mode on port null
   [junit4]   2> 1742473 INFO  (TEST-PeerSyncReplicationTest.test-seed#[127C456CF0EA8BEA]) [    ] o.a.s.s.SolrDispatchFilter \__ \/ _ \ | '_|  Install dir: null
   [junit4]   2> 1742473 INFO  (TEST-PeerSyncReplicationTest.test-seed#[127C456CF0EA8BEA]) [    ] o.a.s.s.SolrDispatchFilter |___/\___/_|_|    Start time: 2017-02-15T21:58:42.132303Z
   [junit4]   2> 1742475 INFO  (TEST-PeerSyncReplicationTest.test-seed#[127C456CF0EA8BEA]) [    ] o.a.s.s.SolrDispatchFilter Loading solr.xml from SolrHome (not found in ZooKeeper)
   [junit4]   2> 1742475 INFO  (TEST-PeerSyncReplicationTest.test-seed#[127C456CF0EA8BEA]) [    ] o.a.s.c.SolrXmlConfig Loading container configuration from /home/jenkins/workspace/Lucene-Solr-6.x-Linux/solr/build/solr-core/test/J0/temp/solr.cloud.PeerSyncReplicationTest_127C456CF0EA8BEA-001/shard-2-001/solr.xml
   [junit4]   2> 1742480 INFO  (TEST-PeerSyncReplicationTest.test-seed#[127C456CF0EA8BEA]) [    ] o.a.s.u.UpdateShardHandler Creating UpdateShardHandler HTTP client with params: socketTimeout=340000&connTimeout=45000&retry=true
   [junit4]   2> 1742482 INFO  (TEST-PeerSyncReplicationTest.test-seed#[127C456CF0EA8BEA]) [    ] o.a.s.c.ZkContainer Zookeeper client=127.0.0.1:38999/solr
   [junit4]   2> 1742486 INFO  (TEST-PeerSyncReplicationTest.test-seed#[127C456CF0EA8BEA]) [    ] o.a.s.c.c.ZkStateReader Updated live nodes from ZooKeeper... (0) -> (2)
   [junit4]   2> 1742487 INFO  (TEST-PeerSyncReplicationTest.test-seed#[127C456CF0EA8BEA]) [    ] o.a.s.c.Overseer Overseer (id=null) closing
   [junit4]   2> 1742487 INFO  (TEST-PeerSyncReplicationTest.test-seed#[127C456CF0EA8BEA]) [    ] o.a.s.c.ZkController Register node as live in ZooKeeper:/live_nodes/127.0.0.1:37102_
   [junit4]   2> 1742488 INFO  (zkCallback-1843-thread-1) [    ] o.a.s.c.c.ZkStateReader Updated live nodes from ZooKeeper... (2) -> (3)
   [junit4]   2> 1742488 INFO  (zkCallback-1839-thread-1) [    ] o.a.s.c.c.ZkStateReader Updated live nodes from ZooKeeper... (2) -> (3)
   [junit4]   2> 1742488 INFO  (zkCallback-1849-thread-1) [    ] o.a.s.c.c.ZkStateReader Updated live nodes from ZooKeeper... (2) -> (3)
   [junit4]   2> 1742489 INFO  (zkCallback-1855-thread-1) [    ] o.a.s.c.c.ZkStateReader Updated live nodes from ZooKeeper... (2) -> (3)
   [junit4]   2> 1742591 INFO  (zkCallback-1849-thread-1) [    ] o.a.s.c.c.ZkStateReader A cluster state change: [WatchedEvent state:SyncConnected type:NodeDataChanged path:/collections/collection1/state.json] for collection [collection1] has occurred - updating... (live nodes size: [3])
   [junit4]   2> 1742596 INFO  (TEST-PeerSyncReplicationTest.test-seed#[127C456CF0EA8BEA]) [    ] o.a.s.c.CorePropertiesLocator Found 1 core definitions underneath /home/jenkins/workspace/Lucene-Solr-6.x-Linux/solr/build/solr-core/test/J0/temp/solr.cloud.PeerSyncReplicationTest_127C456CF0EA8BEA-001/shard-2-001/cores
   [junit4]   2> 1742596 INFO  (TEST-PeerSyncReplicationTest.test-seed#[127C456CF0EA8BEA]) [    ] o.a.s.c.CorePropertiesLocator Cores are: [collection1]
   [junit4]   2> 1742598 INFO  (OverseerStateUpdate-97464871596589060-127.0.0.1:34899_-n_0000000000) [    ] o.a.s.c.o.ReplicaMutator Assigning new node to shard shard=shard1
   [junit4]   2> 1742699 INFO  (zkCallback-1849-thread-1) [    ] o.a.s.c.c.ZkStateReader A cluster state change: [WatchedEvent state:SyncConnected type:NodeDataChanged path:/collections/collection1/state.json] for collection [collection1] has occurred - updating... (live nodes size: [3])
   [junit4]   2> 1742699 INFO  (zkCallback-1855-thread-1) [    ] o.a.s.c.c.ZkStateReader A cluster state change: [WatchedEvent state:SyncConnected type:NodeDataChanged path:/collections/collection1/state.json] for collection [collection1] has occurred - updating... (live nodes size: [3])
   [junit4]   2> 1743608 WARN  (coreLoadExecutor-7056-thread-1) [    ] o.a.s.c.Config Beginning with Solr 5.5, <mergePolicy> is deprecated, use <mergePolicyFactory> instead.
   [junit4]   2> 1743609 INFO  (coreLoadExecutor-7056-thread-1) [    ] o.a.s.c.SolrConfig Using Lucene MatchVersion: 6.5.0
   [junit4]   2> 1743622 INFO  (coreLoadExecutor-7056-thread-1) [    ] o.a.s.s.IndexSchema [collection1] Schema name=test
   [junit4]   2> 1743724 WARN  (coreLoadExecutor-7056-thread-1) [    ] o.a.s.s.IndexSchema [collection1] default search field in schema is text. WARNING: Deprecated, please use 'df' on request instead.
   [junit4]   2> 1743728 INFO  (coreLoadExecutor-7056-thread-1) [    ] o.a.s.s.IndexSchema Loaded schema test/1.0 with uniqueid field id
   [junit4]   2> 1743733 INFO  (coreLoadExecutor-7056-thread-1) [    ] o.a.s.c.CoreContainer Creating SolrCore 'collection1' using configuration from collection collection1
   [junit4]   2> 1743733 INFO  (coreLoadExecutor-7056-thread-1) [    ] o.a.s.c.SolrCore [[collection1] ] Opening new SolrCore at [/home/jenkins/workspace/Lucene-Solr-6.x-Linux/solr/build/solr-core/test/J0/temp/solr.cloud.PeerSyncReplicationTest_127C456CF0EA8BEA-001/shard-2-001/cores/collection1], dataDir=[/home/jenkins/workspace/Lucene-Solr-6.x-Linux/solr/build/solr-core/test/J0/temp/solr.cloud.PeerSyncReplicationTest_127C456CF0EA8BEA-001/shard-2-001/cores/collection1/data/]
   [junit4]   2> 1743734 INFO  (coreLoadExecutor-7056-thread-1) [    ] o.a.s.c.JmxMonitoredMap JMX monitoring is enabled. Adding Solr mbeans to JMX Server: com.sun.jmx.mbeanserver.JmxMBeanServer@26be7889
   [junit4]   2> 1743739 INFO  (coreLoadExecutor-7056-thread-1) [    ] o.a.s.u.RandomMergePolicy RandomMergePolicy wrapping class org.apache.lucene.index.TieredMergePolicy: [TieredMergePolicy: maxMergeAtOnce=32, maxMergeAtOnceExplicit=14, maxMergedSegmentMB=9.9892578125, floorSegmentMB=1.96484375, forceMergeDeletesPctAllowed=26.95330187594849, segmentsPerTier=27.0, maxCFSSegmentSizeMB=8.796093022207999E12, noCFSRatio=0.4653509738578777
   [junit4]   2> 1744490 WARN  (coreLoadExecutor-7056-thread-1) [    ] o.a.s.c.RequestHandlers INVALID paramSet a in requestHandler {type = requestHandler,name = /dump,class = DumpRequestHandler,attributes = {initParams=a, name=/dump, class=DumpRequestHandler},args = {defaults={a=A,b=B}}}
   [junit4]   2> 1744593 INFO  (coreLoadExecutor-7056-thread-1) [    ] o.a.s.u.UpdateHandler Using UpdateLog implementation: org.apache.solr.update.UpdateLog
   [junit4]   2> 1744593 INFO  (coreLoadExecutor-7056-thread-1) [    ] o.a.s.u.UpdateLog Initializing UpdateLog: dataDir= defaultSyncLevel=FLUSH numRecordsToKeep=1000 maxNumLogsToKeep=10 numVersionBuckets=65536
   [junit4]   2> 1744594 INFO  (coreLoadExecutor-7056-thread-1) [    ] o.a.s.u.CommitTracker Hard AutoCommit: disabled
   [junit4]   2> 1744594 INFO  (coreLoadExecutor-7056-thread-1) [    ] o.a.s.u.CommitTracker Soft AutoCommit: disabled
   [junit4]   2> 1744595 INFO  (coreLoadExecutor-7056-thread-1) [    ] o.a.s.u.RandomMergePolicy RandomMergePolicy wrapping class org.apache.lucene.index.TieredMergePolicy: [TieredMergePolicy: maxMergeAtOnce=13, maxMergeAtOnceExplicit=40, maxMergedSegmentMB=12.7109375, floorSegmentMB=1.4296875, forceMergeDeletesPctAllowed=0.557539262176292, segmentsPerTier=37.0, maxCFSSegmentSizeMB=8.796093022207999E12, noCFSRatio=0.0
   [junit4]   2> 1744596 INFO  (coreLoadExecutor-7056-thread-1) [    ] o.a.s.s.SolrIndexSearcher Opening [Searcher@22bb7b9d[collection1] main]
   [junit4]   2> 1744597 INFO  (coreLoadExecutor-7056-thread-1) [    ] o.a.s.r.ManagedResourceStorage Configured ZooKeeperStorageIO with znodeBase: /configs/conf1
   [junit4]   2> 1744597 INFO  (coreLoadExecutor-7056-thread-1) [    ] o.a.s.r.ManagedResourceStorage Loaded null at path _rest_managed.json using ZooKeeperStorageIO:path=/configs/conf1
   [junit4]   2> 1744597 INFO  (coreLoadExecutor-7056-thread-1) [    ] o.a.s.h.ReplicationHandler Commits will be reserved for  10000
   [junit4]   2> 1744598 INFO  (searcherExecutor-7057-thread-1) [    ] o.a.s.c.SolrCore [collection1] Registered new searcher Searcher@22bb7b9d[collection1] main{ExitableDirectoryReader(UninvertingDirectoryReader())}
   [junit4]   2> 1744599 INFO  (coreLoadExecutor-7056-thread-1) [    ] o.a.s.u.UpdateLog Could not find max version in index or recent updates, using new clock 1559437953474756608
   [junit4]   2> 1744602 INFO  (coreZkRegister-7051-thread-1) [    ] o.a.s.c.ZkController Core needs to recover:collection1
   [junit4]   2> 1744602 INFO  (updateExecutor-1852-thread-1) [    ] o.a.s.u.DefaultSolrCoreState Running recovery
   [junit4]   2> 1744602 INFO  (recoveryExecutor-1853-thread-1) [    ] o.a.s.c.RecoveryStrategy Starting recovery process. recoveringAfterStartup=true
   [junit4]   2> 1744603 INFO  (recoveryExecutor-1853-thread-1) [    ] o.a.s.c.RecoveryStrategy ###### startupVersions=[[]]
   [junit4]   2> 1744603 INFO  (recoveryExecutor-1853-thread-1) [    ] o.a.s.c.RecoveryStrategy Begin buffering updates. core=[collection1]
   [junit4]   2> 1744603 INFO  (recoveryExecutor-1853-thread-1) [    ] o.a.s.u.UpdateLog Starting to buffer updates. FSUpdateLog{state=ACTIVE, tlog=null}
   [junit4]   2> 1744603 INFO  (recoveryExecutor-1853-thread-1) [    ] o.a.s.c.RecoveryStrategy Publishing state of core [collection1] as recovering, leader is [http://127.0.0.1:43672/collection1/] and I am [http://127.0.0.1:37102/collection1/]
   [junit4]   2> 1744604 INFO  (zkCallback-1855-thread-1) [    ] o.a.s.c.c.ZkStateReader A cluster state change: [WatchedEvent state:SyncConnected type:NodeDataChanged path:/collections/collection1/state.json] for collection [collection1] has occurred - updating... (live nodes size: [3])
   [junit4]   2> 1744604 INFO  (zkCallback-1849-thread-1) [    ] o.a.s.c.c.ZkStateReader A cluster state change: [WatchedEvent state:SyncConnected type:NodeDataChanged path:/collections/collection1/state.json] for collection [collection1] has occurred - updating... (live nodes size: [3])
   [junit4]   2> 1744605 INFO  (recoveryExecutor-1853-thread-1) [    ] o.a.s.c.RecoveryStrategy Sending prep recovery command to [http://127.0.0.1:43672]; [WaitForState: action=PREPRECOVERY&core=collection1&nodeName=127.0.0.1:37102_&coreNodeName=core_node2&state=recovering&checkLive=true&onlyIfLeader=true&onlyIfLeaderActive=true]
   [junit4]   2> 1744607 INFO  (qtp971686569-12993) [    ] o.a.s.h.a.PrepRecoveryOp Going to wait for coreNodeName: core_node2, state: recovering, checkLive: true, onlyIfLeader: true, onlyIfLeaderActive: true
   [junit4]   2> 1744607 INFO  (qtp971686569-12993) [    ] o.a.s.h.a.PrepRecoveryOp Will wait a max of 183 seconds to see collection1 (shard1 of collection1) have state: recovering
   [junit4]   2> 1744607 INFO  (qtp971686569-12993) [    ] o.a.s.h.a.PrepRecoveryOp In WaitForState(recovering): collection=collection1, shard=shard1, thisCore=collection1, leaderDoesNotNeedRecovery=false, isLeader? true, live=true, checkLive=true, currentState=recovering, localState=active, nodeName=127.0.0.1:37102_, coreNodeName=core_node2, onlyIfActiveCheckResult=false, nodeProps: core_node2:{"core":"collection1","base_url":"http://127.0.0.1:37102","node_name":"127.0.0.1:37102_","state":"recovering"}
   [junit4]   2> 1744607 INFO  (qtp971686569-12993) [    ] o.a.s.h.a.PrepRecoveryOp Waited coreNodeName: core_node2, state: recovering, checkLive: true, onlyIfLeader: true for: 0 seconds.
   [junit4]   2> 1744607 INFO  (qtp971686569-12993) [    ] o.a.s.s.HttpSolrCall [admin] webapp=null path=/admin/cores params={nodeName=127.0.0.1:37102_&onlyIfLeaderActive=true&core=collection1&coreNodeName=core_node2&action=PREPRECOVERY&checkLive=true&state=recovering&onlyIfLeader=true&wt=javabin&version=2} status=0 QTime=0
   [junit4]   2> 1745107 INFO  (recoveryExecutor-1853-thread-1) [    ] o.a.s.c.RecoveryStrategy Attempting to PeerSync from [http://127.0.0.1:43672/collection1/] - recoveringAfterStartup=[true]
   [junit4]   2> 1745108 INFO  (recoveryExecutor-1853-thread-1) [    ] o.a.s.u.PeerSync PeerSync: core=collection1 url=http://127.0.0.1:37102 START replicas=[http://127.0.0.1:43672/collection1/] nUpdates=1000
   [junit4]   2> 1745110 INFO  (qtp971686569-12993) [    ] o.a.s.u.IndexFingerprint IndexFingerprint millis:0.0 result:{maxVersionSpecified=9223372036854775807, maxVersionEncountered=0, maxInHash=0, versionsHash=0, numVersions=0, numDocs=0, maxDoc=0}
   [junit4]   2> 1745110 INFO  (qtp971686569-12993) [    ] o.a.s.c.S.Request [collection1]  webapp= path=/get params={distrib=false&qt=/get&getFingerprint=9223372036854775807&wt=javabin&version=2} status=0 QTime=0
   [junit4]   2> 1745111 INFO  (recoveryExecutor-1853-thread-1) [    ] o.a.s.u.IndexFingerprint IndexFingerprint millis:0.0 result:{maxVersionSpecified=9223372036854775807, maxVersionEncountered=0, maxInHash=0, versionsHash=0, numVersions=0, numDocs=0, maxDoc=0}
   [junit4]   2> 1745111 INFO  (recoveryExecutor-1853-thread-1) [    ] o.a.s.u.PeerSync We are already in sync. No need to do a PeerSync 
   [junit4]   2> 1745111 INFO  (recoveryExecutor-1853-thread-1) [    ] o.a.s.u.DirectUpdateHandler2 start commit{,optimize=false,openSearcher=true,waitSearcher=true,expungeDeletes=false,softCommit=false,prepareCommit=false}
   [junit4]   2> 1745111 INFO  (recoveryExecutor-1853-thread-1) [    ] o.a.s.u.DirectUpdateHandler2 No uncommitted changes. Skipping IW.commit.
   [junit4]   2> 1745111 INFO  (recoveryExecutor-1853-thread-1) [    ] o.a.s.u.DirectUpdateHandler2 end_commit_flush
   [junit4]   2> 1745112 INFO  (recoveryExecutor-1853-thread-1) [    ] o.a.s.c.RecoveryStrategy PeerSync stage of recovery was successful.
   [junit4]   2> 1745112 INFO  (recoveryExecutor-1853-thread-1) [    ] o.a.s.c.RecoveryStrategy Replaying updates buffered during PeerSync.
   [junit4]   2> 1745112 INFO  (recoveryExecutor-1853-thread-1) [    ] o.a.s.c.RecoveryStrategy No replay needed.
   [junit4]   2> 1745112 INFO  (recoveryExecutor-1853-thread-1) [    ] o.a.s.c.RecoveryStrategy Registering as Active after recovery.
   [junit4]   2> 1745214 INFO  (zkCallback-1855-thread-1) [    ] o.a.s.c.c.ZkStateReader A cluster state change: [WatchedEvent state:SyncConnected type:NodeDataChanged path:/collections/collection1/state.json] for collection [collection1] has occurred - updating... (live nodes size: [3])
   [junit4]   2> 1745214 INFO  (zkCallback-1849-thread-1) [    ] o.a.s.c.c.ZkStateReader A cluster state change: [WatchedEvent state:SyncConnected type:NodeDataChanged path:/collections/collection1/state.json] for collection [collection1] has occurred - updating... (live nodes size: [3])
   [junit4]   2> 1745331 INFO  (TEST-PeerSyncReplicationTest.test-seed#[127C456CF0EA8BEA]) [    ] o.a.s.SolrTestCaseJ4 Writing core.properties file to /home/jenkins/workspace/Lucene-Solr-6.x-Linux/solr/build/solr-core/test/J0/temp/solr.cloud.PeerSyncReplicationTest_127C456CF0EA8BEA-001/shard-3-001/cores/collection1
   [junit4]   2> 1745332 INFO  (TEST-PeerSyncReplicationTest.test-seed#[127C456CF0EA8BEA]) [    ] o.a.s.c.AbstractFullDistribZkTestBase create jetty 3 in directory /home/jenkins/workspace/Lucene-Solr-6.x-Linux/solr/build/solr-core/test/J0/temp/solr.cloud.PeerSyncReplicationTest_127C456CF0EA8BEA-001/shard-3-001
   [junit4]   2> 1745333 INFO  (TEST-PeerSyncReplicationTest.test-seed#[127C456CF0EA8BEA]) [    ] o.e.j.s.Server jetty-9.3.14.v20161028
   [junit4]   2> 1745333 INFO  (TEST-PeerSyncReplicationTest.test-seed#[127C456CF0EA8BEA]) [    ] o.e.j.s.h.ContextHandler Started o.e.j.s.ServletContextHandler@4588bbdf{/,null,AVAILABLE}
   [junit4]   2> 1745333 INFO  (TEST-PeerSyncReplicationTest.test-seed#[127C456CF0EA8BEA]) [    ] o.e.j.s.AbstractConnector Started ServerConnector@1f184fc0{HTTP/1.1,[http/1.1]}{127.0.0.1:40736}
   [junit4]   2> 1745334 INFO  (TEST-PeerSyncReplicationTest.test-seed#[127C456CF0EA8BEA]) [    ] o.e.j.s.Server Started @1747226ms
   [junit4]   2> 1745334 INFO  (TEST-PeerSyncReplicationTest.test-seed#[127C456CF0EA8BEA]) [    ] o.a.s.c.s.e.JettySolrRunner Jetty properties: {hostContext=/, solrconfig=solrconfig.xml, solr.data.dir=/home/jenkins/workspace/Lucene-Solr-6.x-Linux/solr/build/solr-core/test/J0/temp/solr.cloud.PeerSyncReplicationTest_127C456CF0EA8BEA-001/tempDir-001/jetty3, hostPort=40736, coreRootDirectory=/home/jenkins/workspace/Lucene-Solr-6.x-Linux/solr/build/solr-core/test/J0/../../../../../../../../../home/jenkins/workspace/Lucene-Solr-6.x-Linux/solr/build/solr-core/test/J0/temp/solr.cloud.PeerSyncReplicationTest_127C456CF0EA8BEA-001/shard-3-001/cores}
   [junit4]   2> 1745334 ERROR (TEST-PeerSyncReplicationTest.test-seed#[127C456CF0EA8BEA]) [    ] o.a.s.s.StartupLoggingUtils Missing Java Option solr.log.dir. Logging may be missing or incomplete.
   [junit4]   2> 1745334 INFO  (TEST-PeerSyncReplicationTest.test-seed#[127C456CF0EA8BEA]) [    ] o.a.s.s.SolrDispatchFilter  ___      _       Welcome to Apache Solr™ version 6.5.0
   [junit4]   2> 1745334 INFO  (TEST-PeerSyncReplicationTest.test-seed#[127C456CF0EA8BEA]) [    ] o.a.s.s.SolrDispatchFilter / __| ___| |_ _   Starting in cloud mode on port null
   [junit4]   2> 1745334 INFO  (TEST-PeerSyncReplicationTest.test-seed#[127C456CF0EA8BEA]) [    ] o.a.s.s.SolrDispatchFilter \__ \/ _ \ | '_|  Install dir: null
   [junit4]   2> 1745334 INFO  (TEST-PeerSyncReplicationTest.test-seed#[127C456CF0EA8BEA]) [    ] o.a.s.s.SolrDispatchFilter |___/\___/_|_|    Start time: 2017-02-15T21:58:44.993855Z
   [junit4]   2> 1745336 INFO  (TEST-PeerSyncReplicationTest.test-seed#[127C456CF0EA8BEA]) [    ] o.a.s.s.SolrDispatchFilter Loading solr.xml from SolrHome (not found in ZooKeeper)
   [junit4]   2> 1745336 INFO  (TEST-PeerSyncReplicationTest.test-seed#[127C456CF0EA8BEA]) [    ] o.a.s.c.SolrXmlConfig Loading container configuration from /home/jenkins/workspace/Lucene-Solr-6.x-Linux/solr/build/solr-core/test/J0/temp/solr.cloud.PeerSyncReplicationTest_127C456CF0EA8BEA-001/shard-3-001/solr.xml
   [junit4]   2> 1745342 INFO  (TEST-PeerSyncReplicationTest.test-seed#[127C456CF0EA8BEA]) [    ] o.a.s.u.UpdateShardHandler Creating UpdateShardHandler HTTP client with params: socketTimeout=340000&connTimeout=45000&retry=true
   [junit4]   2> 1745343 INFO  (TEST-PeerSyncReplicationTest.test-seed#[127C456CF0EA8BEA]) [    ] o.a.s.c.ZkContainer Zookeeper client=127.0.0.1:38999/solr
   [junit4]   2> 1745348 INFO  (TEST-PeerSyncReplicationTest.test-seed#[127C456CF0EA8BEA]) [    ] o.a.s.c.c.ZkStateReader Updated live nodes from ZooKeeper... (0) -> (3)
   [junit4]   2> 1745349 INFO  (TEST-PeerSyncReplicationTest.test-seed#[127C456CF0EA8BEA]) [    ] o.a.s.c.Overseer Overseer (id=null) closing
   [junit4]   2> 1745350 INFO  (TEST-PeerSyncReplicationTest.test-seed#[127C456CF0EA8BEA]) [    ] o.a.s.c.ZkController Register node as live in ZooKeeper:/live_nodes/127.0.0.1:40736_
   [junit4]   2> 1745350 INFO  (zkCallback-1855-thread-1) [    ] o.a.s.c.c.ZkStateReader Updated live nodes from ZooKeeper... (3) -> (4)
   [junit4]   2> 1745350 INFO  (zkCallback-1839-thread-1) [    ] o.a.s.c.c.ZkStateReader Updated live nodes from ZooKeeper... (3) -> (4)
   [junit4]   2> 1745351 INFO  (zkCallback-1843-thread-1) [    ] o.a.s.c.c.ZkStateReader Updated live nodes from ZooKeeper... (3) -> (4)
   [junit4]   2> 1745350 INFO  (zkCallback-1849-thread-1) [    ] o.a.s.c.c.ZkStateReader Updated live nodes from ZooKeeper... (3) -> (4)
   [junit4]   2> 1745351 INFO  (zkCallback-1862-thread-1) [    ] o.a.s.c.c.ZkStateReader Updated live nodes from ZooKeeper... (3) -> (4)
   [junit4]   2> 1745437 INFO  (TEST-PeerSyncReplicationTest.test-seed#[127C456CF0EA8BEA]) [    ] o.a.s.c.CorePropertiesLocator Found 1 core definitions underneath /home/jenkins/workspace/Lucene-Solr-6.x-Linux/solr/build/solr-core/test/J0/../../../../../../../../../home/jenkins/workspace/Lucene-Solr-6.x-Linux/solr/build/solr-core/test/J0/temp/solr.cloud.PeerSyncReplicationTest_127C456CF0EA8BEA-001/shard-3-001/cores
   [junit4]   2> 1745438 INFO  (TEST-PeerSyncReplicationTest.test-seed#[127C456CF0EA8BEA]) [    ] o.a.s.c.CorePropertiesLocator Cores are: [collection1]
   [junit4]   2> 1745439 INFO  (OverseerStateUpdate-97464871596589060-127.0.0.1:34899_-n_0000000000) [    ] o.a.s.c.o.ReplicaMutator Assigning new node to shard shard=shard1
   [junit4]   2> 1745541 INFO  (zkCallback-1862-thread-1) [    ] o.a.s.c.c.ZkStateReader A cluster state change: [WatchedEvent state:SyncConnected type:NodeDataChanged path:/collections/collection1/state.json] for collection [collection1] has occurred - updating... (live nodes size: [4])
   [junit4]   2> 1745541 INFO  (zkCallback-1849-thread-1) [    ] o.a.s.c.c.ZkStateReader A cluster state change: [WatchedEvent state:SyncConnected type:NodeDataChanged path:/collections/collection1/state.json] for collection [collection1] has occurred - updating... (live nodes size: [4])
   [junit4]   2> 1745541 INFO  (zkCallback-1855-thread-1) [    ] o.a.s.c.c.ZkStateReader A cluster state change: [WatchedEvent state:SyncConnected type:NodeDataChanged path:/collections/collection1/state.json] for collection [collection1] has occurred - updating... (live nodes size: [4])
   [junit4]   2> 1746445 WARN  (coreLoadExecutor-7067-thread-1) [    ] o.a.s.c.Config Beginning with Solr 5.5, <mergePolicy> is deprecated, use <mergePolicyFactory> instead.
   [junit4]   2> 1746446 INFO  (coreLoadExecutor-7067-thread-1) [    ] o.a.s.c.SolrConfig Using Lucene MatchVersion: 6.5.0
   [junit4]   2> 1746455 INFO  (coreLoadExecutor-7067-thread-1) [    ] o.a.s.s.IndexSchema [collection1] Schema name=test
   [junit4]   2> 1746510 WARN  (coreLoadExecutor-7067-thread-1) [    ] o.a.s.s.IndexSchema [collection1] default search field in schema is text. WARNING: Deprecated, please use 'df' on request instead.
   [junit4]   2> 1746511 INFO  (coreLoadExecutor-7067-thread-1) [    ] o.a.s.s.IndexSchema Loaded schema test/1.0 with uniqueid field id
   [junit4]   2> 1746516 INFO  (coreLoadExecutor-7067-thread-1) [    ] o.a.s.c.CoreContainer Creating SolrCore 'collection1' using configuration from collection collection1
   [junit4]   2> 1746516 INFO  (coreLoadExecutor-7067-thread-1) [    ] o.a.s.c.SolrCore [[collection1] ] Opening new SolrCore at [/home/jenkins/workspace/Lucene-Solr-6.x-Linux/solr/build/solr-core/test/J0/temp/solr.cloud.PeerSyncReplicationTest_127C456CF0EA8BEA-001/shard-3-001/cores/collection1], dataDir=[/home/jenkins/workspace/Lucene-Solr-6.x-Linux/solr/build/solr-core/test/J0/../../../../../../../../../home/jenkins/workspace/Lucene-Solr-6.x-Linux/solr/build/solr-core/test/J0/temp/solr.cloud.PeerSyncReplicationTest_127C456CF0EA8BEA-001/shard-3-001/cores/collection1/data/]
   [junit4]   2> 1746517 INFO  (coreLoadExecutor-7067-thread-1) [    ] o.a.s.c.JmxMonitoredMap JMX monitoring is enabled. Adding Solr mbeans to JMX Server: com.sun.jmx.mbeanserver.JmxMBeanServer@26be7889
   [junit4]   2> 1746522 INFO  (coreLoadExecutor-7067-thread-1) [    ] o.a.s.u.RandomMergePolicy RandomMergePolicy wrapping class org.apache.lucene.index.TieredMergePolicy: [TieredMergePolicy: maxMergeAtOnce=32, maxMergeAtOnceExplicit=14, maxMergedSegmentMB=9.9892578125, floorSegmentMB=1.96484375, forceMergeDeletesPctAllowed=26.95330187594849, segmentsPerTier=27.0, maxCFSSegmentSizeMB=8.796093022207999E12, noCFSRatio=0.4653509738578777
   [junit4]   2> 1746577 WARN  (coreLoadExecutor-7067-thread-1) [    ] o.a.s.c.RequestHandlers INVALID paramSet a in requestHandler {type = requestHandler,name = /dump,class = DumpRequestHandler,attributes = {initParams=a, name=/dump, class=DumpRequestHandler},args = {defaults={a=A,b=B}}}
   [junit4]   2> 1746674 INFO  (coreLoadExecutor-7067-thread-1) [    ] o.a.s.u.UpdateHandler Using UpdateLog implementation: org.apache.solr.update.UpdateLog
   [junit4]   2> 1746674 INFO  (coreLoadExecutor-7067-thread-1) [    ] o.a.s.u.UpdateLog Initializing UpdateLog: dataDir= defaultSyncLevel=FLUSH numRecordsToKeep=1000 maxNumLogsToKeep=10 numVersionBuckets=65536
   [junit4]   2> 1746675 INFO  (coreLoadExecutor-7067-thread-1) [    ] o.a.s.u.CommitTracker Hard AutoCommit: disabled
   [junit4]   2> 1746675 INFO  (coreLoadExecutor-7067-thread-1) [    ] o.a.s.u.CommitTracker Soft AutoCommit: disabled
   [junit4]   2> 1746676 INFO  (coreLoadExecutor-7067-thread-1) [    ] o.a.s.u.RandomMergePolicy RandomMergePolicy wrapping class org.apache.lucene.index.TieredMergePolicy: [TieredMergePolicy: maxMergeAtOnce=13, maxMergeAtOnceExplicit=40, maxMergedSegmentMB=12.7109375, floorSegmentMB=1.4296875, forceMergeDeletesPctAllowed=0.557539262176292, segmentsPerTier=37.0, maxCFSSegmentSizeMB=8.796093022207999E12, noCFSRatio=0.0
   [junit4]   2> 1746678 INFO  (coreLoadExecutor-7067-thread-1) [    ] o.a.s.s.SolrIndexSearcher Opening [Searcher@6afc52d1[collection1] main]
   [junit4]   2> 1746678 INFO  (coreLoadExecutor-7067-thread-1) [    ] o.a.s.r.ManagedResourceStorage Configured ZooKeeperStorageIO with znodeBase: /configs/conf1
   [junit4]   2> 1746678 INFO  (coreLoadExecutor-7067-thread-1) [    ] o.a.s.r.ManagedResourceStorage Loaded null at path _rest_managed.json using ZooKeeperStorageIO:path=/configs/conf1
   [junit4]   2> 1746678 INFO  (coreLoadExecutor-7067-thread-1) [    ] o.a.s.h.ReplicationHandler Commits will be reserved for  10000
   [junit4]   2> 1746679 INFO  (searcherExecutor-7068-thread-1) [    ] o.a.s.c.SolrCore [collection1] Registered new searcher Searcher@6afc52d1[collection1] main{ExitableDirectoryReader(UninvertingDirectoryReader())}
   [junit4]   2> 1746681 INFO  (coreLoadExecutor-7067-thread-1) [    ] o.a.s.u.UpdateLog Could not find max version in index or recent updates, using new clock 1559437955657891840
   [junit4]   2> 1746683 INFO  (coreZkRegister-7062-thread-1) [    ] o.a.s.c.ZkController Core needs to recover:collection1
   [junit4]   2> 1746683 INFO  (updateExecutor-1859-thread-1) [    ] o.a.s.u.DefaultSolrCoreState Running recovery
   [junit4]   2> 1746684 INFO  (recoveryExecutor-1860-thread-1) [    ] o.a.s.c.RecoveryStrategy Starting recovery process. recoveringAfterStartup=true
   [junit4]   2> 1746684 INFO  (recoveryExecutor-1860-thread-1) [    ] o.a.s.c.RecoveryStrategy ###### startupVersions=[[]]
   [junit4]   2> 1746684 INFO  (recoveryExecutor-1860-thread-1) [    ] o.a.s.c.RecoveryStrategy Begin buffering updates. core=[collection1]
   [junit4]   2> 1746684 INFO  (recoveryExecutor-1860-thread-1) [    ] o.a.s.u.UpdateLog Starting to buffer updates. FSUpdateLog{state=ACTIVE, tlog=null}
   [junit4]   2> 1746684 INFO  (recoveryExecutor-1860-thread-1) [    ] o.a.s.c.RecoveryStrategy Publishing state of core [collection1] as recovering, leader is [http://127.0.0.1:43672/collection1/] and I am [http://127.0.0.1:40736/collection1/]
   [junit4]   2> 1746685 INFO  (recoveryExecutor-1860-thread-1) [    ] o.a.s.c.RecoveryStrategy Sending prep recovery command to [http://127.0.0.1:43672]; [WaitForState: action=PREPRECOVERY&core=collection1&nodeName=127.0.0.1:40736_&coreNodeName=core_node3&state=recovering&checkLive=true&onlyIfLeader=true&onlyIfLeaderActive=true]
   [junit4]   2> 1746686 INFO  (qtp971686569-12988) [    ] o.a.s.h.a.PrepRecoveryOp Going to wait for coreNodeName: core_node3, state: recovering, checkLive: true, onlyIfLeader: true, onlyIfLeaderActive: true
   [junit4]   2> 1746686 INFO  (qtp971686569-12988) [    ] o.a.s.h.a.PrepRecoveryOp Will wait a max of 183 seconds to see collection1 (shard1 of collection1) have state: recovering
   [junit4]   2> 1746686 INFO  (qtp971686569-12988) [    ] o.a.s.h.a.PrepRecoveryOp In WaitForState(recovering): collection=collection1, shard=shard1, thisCore=collection1, leaderDoesNotNeedRecovery=false, isLeader? true, live=true, checkLive=true, currentState=down, localState=active, nodeName=127.0.0.1:40736_, coreNodeName=core_node3, onlyIfActiveCheckResult=false, nodeProps: core_node3:{"core":"collection1","base_url":"http://127.0.0.1:40736","node_name":"127.0.0.1:40736_","state":"down"}
   [junit4]   2> 1746785 INFO  (zkCallback-1855-thread-1) [    ] o.a.s.c.c.ZkStateReader A cluster state change: [WatchedEvent state:SyncConnected type:NodeDataChanged path:/collections/collection1/state.json] for collection [collection1] has occurred - updating... (live nodes size: [4])
   [junit4]   2> 1746786 INFO  (zkCallback-1849-thread-1) [    ] o.a.s.c.c.ZkStateReader A cluster state change: [WatchedEvent state:SyncConnected type:NodeDataChanged path:/collections/collection1/state.json] for collection [collection1] has occurred - updating... (live nodes size: [4])
   [junit4]   2> 1746785 INFO  (zkCallback-1862-thread-1) [    ] o.a.s.c.c.ZkStateReader A cluster state change: [WatchedEvent state:SyncConnected type:NodeDataChanged path:/collections/collection1/state.json] for collection [collection1] has occurred - updating... (live nodes size: [4])
   [junit4]   2> 1747046 INFO  (TEST-PeerSyncReplicationTest.test-seed#[127C456CF0EA8BEA]) [    ] o.a.s.SolrTestCaseJ4 ###Starting test
   [junit4]   2> 1747046 INFO  (TEST-PeerSyncReplicationTest.test-seed#[127C456CF0EA8BEA]) [    ] o.a.s.c.AbstractFullDistribZkTestBase Wait for recoveries to finish - wait 30 for each attempt
   [junit4]   2> 1747046 INFO  (TEST-PeerSyncReplicationTest.test-seed#[127C456CF0EA8BEA]) [    ] o.a.s.c.AbstractDistribZkTestBase Wait for recoveries to finish - collection: collection1 failOnTimeout:true timeout (sec):30
   [junit4]   2> 1747687 INFO  (qtp971686569-12988) [    ] o.a.s.h.a.PrepRecoveryOp In WaitForState(recovering): collection=collection1, shard=shard1, thisCore=collection1, leaderDoesNotNeedRecovery=false, isLeader? true, live=true, checkLive=true, currentState=recovering, localState=active, nodeName=127.0.0.1:40736_, coreNodeName=core_node3, onlyIfActiveCheckResult=false, nodeProps: core_node3:{"core":"collection1","base_url":"http://127.0.0.1:40736","node_name":"127.0.0.1:40736_","state":"recovering"}
   [junit4]   2> 1747687 INFO  (qtp971686569-12988) [    ] o.a.s.h.a.PrepRecoveryOp Waited coreNodeName: core_node3, state: recovering, checkLive: true, onlyIfLeader: true for: 1 seconds.
   [junit4]   2> 1747687 INFO  (qtp971686569-12988) [    ] o.a.s.s.HttpSolrCall [admin] webapp=null path=/admin/cores params={nodeName=127.0.0.1:40736_&onlyIfLeaderActive=true&core=collection1&coreNodeName=core_node3&action=PREPRECOVERY&checkLive=true&state=recovering&onlyIfLeader=true&wt=javabin&version=2} status=0 QTime=1000
   [junit4]   2> 1748187 INFO  (recoveryExecutor-1860-thread-1) [    ] o.a.s.c.RecoveryStrategy Attempting to PeerSync from [http://127.0.0.1:43672/collection1/] - recoveringAfterStartup=[true]
   [junit4]   2> 1748187 INFO  (recoveryExecutor-1860-thread-1) [    ] o.a.s.u.PeerSync PeerSync: core=collection1 url=http://127.0.0.1:40736 START replicas=[http://127.0.0.1:43672/collection1/] nUpdates=1000
   [junit4]   2> 1748189 INFO  (qtp971686569-12988) [    ] o.a.s.u.IndexFingerprint IndexFingerprint millis:0.0 result:{maxVersionSpecified=9223372036854775807, maxVersionEncountered=0, maxInHash=0, versionsHash=0, numVersions=0, numDocs=0, maxDoc=0}
   [junit4]   2> 1748190 INFO  (qtp971686569-12988) [    ] o.a.s.c.S.Request [collection1]  webapp= path=/get params={distrib=false&qt=/get&getFingerprint=9223372036854775807&wt=javabin&version=2} status=0 QTime=0
   [junit4]   2> 1748190 INFO  (recoveryExecutor-1860-thread-1) [    ] o.a.s.u.IndexFingerprint IndexFingerprint millis:0.0 result:{maxVersionSpecified=9223372036854775807, maxVersionEncountered=0, maxInHash=0, versionsHash=0, numVersions=0, numDocs=0, maxDoc=0}
   [junit4]   2> 1748190 INFO  (recoveryExecutor-1860-thread-1) [    ] o.a.s.u.PeerSync We are already in sync. No need to do a PeerSync 
   [junit4]   2> 1748190 INFO  (recoveryExecutor-1860-thread-1) [    ] o.a.s.u.DirectUpdateHandler2 start commit{,optimize=false,openSearcher=true,waitSearcher=true,expungeDeletes=false,softCommit=false,prepareCommit=false}
   [junit4]   2> 1748190 INFO  (recoveryExecutor-1860-thread-1) [    ] o.a.s.u.DirectUpdateHandler2 No uncommitted changes. Skipping IW.commit.
   [junit4]   2> 1748191 INFO  (recoveryExecutor-1860-thread-1) [    ] o.a.s.u.DirectUpdateHandler2 end_commit_flush
   [junit4]   2> 1748191 INFO  (recoveryExecutor-1860-thread-1) [    ] o.a.s.c.RecoveryStrategy PeerSync stage of recovery was successful.
   [junit4]   2> 1748191 INFO  (recoveryExecutor-1860-thread-1) [    ] o.a.s.c.RecoveryStrategy Replaying updates buffered during PeerSync.
   [junit4]   2> 1748191 INFO  (recoveryExecutor-1860-thread-1) [    ] o.a.s.c.RecoveryStrategy No replay needed.
   [junit4]   2> 1748191 INFO  (recoveryExecutor-1860-thread-1) [    ] o.a.s.c.RecoveryStrategy Registering as Active after recovery.
   [junit4]   2> 1748293 INFO  (zkCallback-1849-thread-1) [    ] o.a.s.c.c.ZkStateReader A cluster state change: [WatchedEvent state:SyncConnected type:NodeDataChanged path:/collections/collection1/state.json] for collection [collection1] has occurred - updating... (live nodes size: [4])
   [junit4]   2> 1748293 INFO  (zkCallback-1862-thread-1) [    ] o.a.s.c.c.ZkStateReader A cluster state change: [WatchedEvent state:SyncConnected type:NodeDataChanged path:/collections/collection1/state.json] for collection [collection1] has occurred - updating... (live nodes size: [4])
   [junit4]   2> 1748293 INFO  (zkCallback-1855-thread-1) [    ] o.a.s.c.c.ZkStateReader A cluster state change: [WatchedEvent state:SyncConnected type:NodeDataChanged path:/collections/collection1/state.json] for collection [collection1] has occurred - updating... (live nodes size: [4])
   [junit4]   2> 1749047 INFO  (TEST-PeerSyncReplicationTest.test-seed#[127C456CF0EA8BEA]) [    ] o.a.s.c.AbstractDistribZkTestBase Recoveries finished - collection: collection1
   [junit4]   2> 1749048 INFO  (qtp563418713-12956) [    ] o.a.s.u.DirectUpdateHandler2 start commit{,optimize=false,openSearcher=true,waitSearcher=true,expungeDeletes=false,softCommit=false,prepareCommit=false}
   [junit4]   2> 1749048 INFO  (qtp563418713-12956) [    ] o.a.s.u.DirectUpdateHandler2 No uncommitted changes. Skipping IW.commit.
   [junit4]   2> 1749049 INFO  (qtp563418713-12956) [    ] o.a.s.u.DirectUpdateHandler2 end_commit_flush
   [junit4]   2> 1749049 INFO  (qtp563418713-12956) [    ] o.a.s.u.p.LogUpdateProcessorFactory [collection1]  webapp= path=/update params={waitSearcher=true&commit=true&softCommit=false&wt=javabin&version=2}{commit=} 0 1
   [junit4]   2> 1749052 INFO  (qtp971686569-12988) [    ] o.a.s.u.DirectUpdateHandler2 start commit{,optimize=false,openSearcher=true,waitSearcher=true,expungeDeletes=false,softCommit=false,prepareCommit=false}
   [junit4]   2> 1749052 INFO  (qtp971686569-12988) [    ] o.a.s.u.DirectUpdateHandler2 No uncommitted changes. Skipping IW.commit.
   [junit4]   2> 1749052 INFO  (qtp1258130897-13021) [    ] o.a.s.u.DirectUpdateHandler2 start commit{,optimize=false,openSearcher=true,waitSearcher=true,expungeDeletes=false,softCommit=false,prepareCommit=false}
   [junit4]   2> 1749052 INFO  (qtp1782222136-13056) [    ] o.a.s.u.DirectUpdateHandler2 start commit{,optimize=false,openSearcher=true,waitSearcher=true,expungeDeletes=false,softCommit=false,prepareCommit=false}
   [junit4]   2> 1749052 INFO  (qtp1258130897-13021) [    ] o.a.s.u.DirectUpdateHandler2 No uncommitted changes. Skipping IW.commit.
   [junit4]   2> 1749052 INFO  (qtp1782222136-13056) [    ] o.a.s.u.DirectUpdateHandler2 No uncommitted changes. Skipping IW.commit.
   [junit4]   2> 1749053 INFO  (qtp971686569-12988) [    ] o.a.s.u.DirectUpdateHandler2 end_commit_flush
   [junit4]   2> 1749053 INFO  (qtp971686569-12988) [    ] o.a.s.u.p.LogUpdateProcessorFactory [collection1]  webapp= path=/update params={update.distrib=FROMLEADER&waitSearcher=true&openSearcher=true&commit=true&softCommit=false&distrib.from=http://127.0.0.1:43672/collection1/&commit_end_point=true&wt=javabin&version=2&expungeDeletes=false}{commit=} 0 1
   [junit4]   2> 1749053 INFO  (qtp1258130897-13021) [    ] o.a.s.u.DirectUpdateHandler2 end_commit_flush
   [junit4]   2> 1749053 INFO  (qtp1258130897-13021) [    ] o.a.s.u.p.LogUpdateProcessorFactory [collection1]  webapp= path=/update params={update.distrib=FROMLEADER&waitSearcher=true&openSearcher=true&commit=true&softCommit=false&distrib.from=http://127.0.0.1:43672/collection1/&commit_end_point=true&wt=javabin&version=2&expungeDeletes=false}{commit=} 0 1
   [junit4]   2> 1749053 INFO  (qtp1782222136-13056) [    ] o.a.s.u.DirectUpdateHandler2 end_commit_flush
   [junit4]   2> 1749053 INFO  (qtp1782222136-13056) [    ] o.a.s.u.p.LogUpdateProcessorFactory [collection1]  webapp= path=/update params={update.distrib=FROMLEADER&waitSearcher=true&openSearcher=true&commit=true&softCommit=false&distrib.from=http://127.0.0.1:43672/collection1/&commit_end_point=true&wt=javabin&version=2&expungeDeletes=false}{commit=} 0 1
   [junit4]   2> 1749054 INFO  (qtp971686569-12990) [    ] o.a.s.u.p.LogUpdateProcessorFactory [collection1]  webapp= path=/update params={_stateVer_=collection1:11&waitSearcher=true&commit=true&softCommit=false&wt=javabin&version=2}{commit=} 0 3
   [junit4]   2> 1749055 INFO  (qtp971686569-12994) [    ] o.a.s.c.S.Request [collection1]  webapp= path=/select params={q=*:*&distrib=false&tests=checkShardConsistency&rows=0&wt=javabin&version=2} hits=0 status=0 QTime=0
   [junit4]   2> 1749055 INFO  (qtp1258130897-13023) [    ] o.a.s.c.S.Request [collection1]  webapp= path=/select params={q=*:*&distrib=false&tests=checkShardConsistency&rows=0&wt=javabin&version=2} hits=0 status=0 QTime=0
   [junit4]   2> 1749056 INFO  (qtp1782222136-13058) [    ] o.a.s.c.S.Request [collection1]  webapp= path=/select params={q=*:*&distrib=false&tests=checkShardConsistency&rows=0&wt=javabin&version=2} hits=0 status=0 QTime=0
   [junit4]   2> 1751062 INFO  (qtp563418713-12957) [    ] o.a.s.u.p.LogUpdateProcessorFactory [collection1]  webapp= path=/update params={wt=javabin&version=2}{deleteByQuery=*:* (-1559437960248557568)} 0 3
   [junit4]   2> 1751071 INFO  (qtp1258130897-13022) [    ] o.a.s.u.p.LogUpdateProcessorFactory [collection1]  webapp= path=/update params={update.distrib=FROMLEADER&_version_=-1559437960253800448&distrib.from=http://127.0.0.1:43672/collection1/&wt=javabin&version=2}{deleteByQuery=*:* (-1559437960253800448)} 0 3
   [junit4]   2> 1751071 INFO  (qtp1782222136-13057) [    ] o.a.s.u.p.LogUpdateProcessorFactory [collection1]  webapp= path=/update params={update.distrib=FROMLEADER&_version_=-1559437960253800448&distrib.from=http://127.0.0.1:43672/collection1/&wt=javabin&version=2}{deleteByQuery=*:* (-1559437960253800448)} 0 3
   [junit4]   2> 1751072 INFO  (qtp971686569-12991) [    ] o.a.s.u.p.LogUpdateProcessorFactory [collection1]  webapp= path=/update params={wt=javabin&version=2}{deleteByQuery=*:* (-1559437960253800448)} 0 8
   [junit4]   2> 1751083 INFO  (qtp1258130897-13021) [    ] o.a.s.u.p.LogUpdateProcessorFactory [collection1]  webapp= path=/update params={update.distrib=FROMLEADER&distrib.from=http://127.0.0.1:43672/collection1/&wt=javabin&version=2}{add=[0 (1559437960265334784)]} 0 3
   [junit4]   2> 1751083 INFO  (qtp1782222136-13056) [    ] o.a.s.u.p.LogUpdateProcessorFactory [collection1]  webapp= path=/update params={update.distrib=FROMLEADER&distrib.from=http://127.0.0.1:43672/collection1/&wt=javabin&version=2}{add=[0 (1559437960265334784)]} 0 3
   [junit4]   2> 1751083 INFO  (qtp971686569-12990) [    ] o.a.s.u.p.LogUpdateProcessorFactory [collection1]  webapp= path=/update params={_stateVer_=collection1:11&wt=javabin&version=2}{add=[0 (1559437960265334784)]} 0 8
   [junit4]   2> 1751087 INFO  (qtp1782222136-13052) [    ] o.a.s.u.p.LogUpdateProcessorFactory [collection1]  webapp= path=/update params={update.distrib=FROMLEADER&distrib.from=http://127.0.0.1:43672/collection1/&wt=javabin&version=2}{add=[1 (1559437960275820544)]} 0 0
   [junit4]   2> 1751087 INFO  (qtp1258130897-13017) [    ] o.a.s.u.p.LogUpdateProcessorFactory [collection1]  webapp= path=/update params={update.distrib=FROMLEADER&distrib.from=http://127.0.0.1:43672/collection1/&wt=javabin&version=2}{add=[1 (1559437960275820544)]} 0 0
   [junit4]   2> 1751087 INFO  (qtp971686569-12993) [    ] o.a.s.u.p.LogUpdateProcessorFactory [collection1]  webapp= path=/update params={_stateVer_=collection1:11&wt=javabin&version=2}{add=[1 (1559437960275820544)]} 0 2
   [junit4]   2> 1751091 INFO  (qtp1258130897-13023) [    ] o.a.s.u.p.LogUpdateProcessorFactory [collection1]  webapp= path=/update params={update.distrib=FROMLEADER&distrib.from=http://127.0.0.1:43672/collection1/&wt=javabin&version=2}{add=[2 (1559437960280014848)]} 0 0
   [junit4]   2> 1751091 INFO  (qtp1782222136-13058) [    ] o.a.s.u.p.LogUpdateProcessorFactory [collection1]  webapp= path=/update params={update.distrib=FROMLEADER&distrib.from=http://127.0.0.1:43672/collection1/&wt=javabin&version=2}{add=[2 (1559437960280014848)]} 0 0
   [junit4]   2> 1751091 INFO  (qtp971686569-12994) [    ] o.a.s.u.p.LogUpdateProcessorFactory [collection1]  webapp= path=/update params={_stateVer_=collection1:11&wt=javabin&version=2}{add=[2 (1559437960280014848)]} 0 2
   [junit4]   2> 1751094 INFO  (qtp1258130897-13023) [    ] o.a.s.u.p.LogUpdateProcessorFactory [collection1]  webapp= path=/update params={update.distrib=FROMLEADER&distrib.from=http://127.0.0.1:43672/collection1/&wt=javabin&version=2}{add=[3 (1559437960284209152)]} 0 0
   [junit4]   2> 1751095 INFO  (qtp1782222136-13057) [    ] o.a.s.u.p.LogUpdateProcessorFactory [collection1]  webapp= path=/update params={update.distrib=FROMLEADER&distrib.from=http://127.0.0.1:43672/collection1/&wt=javabin&version=2}{add=[3 (1559437960284209152)]} 0 0
   [junit4]   2> 1751095 INFO  (qtp971686569-12991) [    ] o.a.s.u.p.LogUpdateProcessorFactory [collection1]  webapp= path=/update params={_stateVer_=collection1:11&wt=javabin&version=2}{add=[3 (1559437960284209152)]} 0 2
   [junit4]   2> 1751099 INFO  (qtp1258130897-13021) [    ] o.a.s.u.p.LogUpdateProcessorFactory [collection1]  webapp= path=/update params={update.distrib=FROMLEADER&distrib.from=http://127.0.0.1:43672/collection1/&wt=javabin&version=2}{add=[4 (1559437960288403456)]} 0 0
   [junit4]   2> 1751099 INFO  (qtp1782222136-13057) [    ] o.a.s.u.p.LogUpdateProcessorFactory [collection1]  webapp= path=/update params={update.distrib=FROMLEADER&distrib.from=http://127.0.0.1:43672/collection1/&wt=javabin&version=2}{add=[4 (1559437960288403456)]} 0 0
   [junit4]   2> 1751099 INFO  (qtp971686569-12990) [    ] o.a.s.u.p.LogUpdateProcessorFactory [collection1]  webapp= path=/update params={_stateVer_=collection1:11&wt=javabin&version=2}{add=[4 (1559437960288403456)]} 0 2
   [junit4]   2> 1751103 INFO  (qtp1782222136-13052) [    ] o.a.s.u.p.LogUpdateProcessorFactory [collection1]  webapp= path=/update params={update.distrib=FROMLEADER&distrib.from=http://127.0.0.1:43672/collection1/&wt=javabin&version=2}{add=[5 (1559437960292597760)]} 0 0
   [junit4]   2> 1751103 INFO  (qtp1258130897-13021) [    ] o.a.s.u.p.LogUpdateProcessorFactory [collection1]  webapp= path=/update params={update.distrib=FROMLEADER&distrib.from=http://127.0.0.1:43672/collection1/&wt=javabin&version=2}{add=[5 (1559437960292597760)]} 0 0
   [junit4]   2> 1751103 INFO  (qtp971686569-12993) [    ] o.a.s.u.p.LogUpdateProcessorFactory [collection1]  webapp= path=/update params={_stateVer_=collection1:11&wt=javabin&version=2}{add=[5 (1559437960292597760)]} 0 2
   [junit4]   2> 1751107 INFO  (qtp1782222136-13058) [    ] o.a.s.u.p.LogUpdateProcessorFactory [collection1]  webapp= path=/update params={update.distrib=FROMLEADER&distrib.from=http://127.0.0.1:43672/collection1/&wt=javabin&version=2}{add=[6 (1559437960296792064)]} 0 0
   [junit4]   2> 1751107 INFO  (qtp1258130897-13021) [    ] o.a.s.u.p.LogUpdateProcessorFactory [collection1]  webapp= path=/update params={update.distrib=FROMLEADER&distrib.from=http://127.0.0.1:43672/collection1/&wt=javabin&version=2}{add=[6 (1559437960296792064)]} 0 0
   [junit4]   2> 1751108 INFO  (qtp971686569-12994) [    ] o.a.s.u.p.LogUpdateProcessorFactory [collection1]  webapp= path=/update params={_stateVer_=collection1:11&wt=javabin&version=2}{add=[6 (1559437960296792064)]} 0 2
   [junit4]   2> 1751111 INFO  (qtp1782222136-13056) [    ] o.a.s.u.p.LogUpdateProcessorFactory [collection1]  webapp= path=/update params={update.distrib=FROMLEADER&distrib.from=http://127.0.0.1:43672/collection1/&wt=javabin&version=2}{add=[7 (1559437960300986368)]} 0 0
   [junit4]   2> 1751111 INFO  (qtp1258130897-13021) [    ] o.a.s.u.p.LogUpdateProcessorFactory [collection1]  webapp= path=/update params={update.distrib=FROMLEADER&distrib.from=http://127.0.0.1:43672/collection1/&wt=javabin&version=2}{add=[7 (1559437960300986368)]} 0 0
   [junit4]   2> 1751111 INFO  (qtp971686569-12991) [    ] o.a.s.u.p.LogUpdateProcessorFactory [collection1]  webapp= path=/update params={_stateVer_=collection1:11&wt=javabin&version=2}{add=[7 (1559437960300986368)]} 0 2
   [junit4]   2> 1751115 INFO  (qtp1782222136-13057) [    ] o.a.s.u.p.LogUpdateProcessorFactory [collection1]  webapp= path=/update params={update.distrib=FROMLEADER&distrib.from=http://127.0.0.1:43672/collection1/&wt=javabin&version=2}{add=[8 (1559437960305180672)]} 0 0
   [junit4]   2> 1751115 INFO  (qtp1258130897-13017) [    ] o.a.s.u.p.LogUpdateProcessorFactory [collection1]  webapp= path=/update params={update.distrib=FROMLEADER&distrib.from=http://127.0.0.1:43672/collection1/&wt=javabin&version=2}{add=[8 (1559437960305180672)]} 0 0
   [junit4]   2> 1751115 INFO  (qtp971686569-12990) [    ] o.a.s.u.p.LogUpdateProcessorFactory [collection1]  webapp= path=/update params={_stateVer_=collection1:11&wt=javabin&version=2}{add=[8 (1559437960305180672)]} 0 2
   [junit4]   2> 1751119 INFO  (qtp1782222136-13052) [    ] o.a.s.u.p.LogUpdateProcessorFactory [collection1]  webapp= path=/update params={update.distrib=FROMLEADER&distrib.from=http://127.0.0.1:43672/collection1/&wt=javabin&version=2}{add=[9 (1559437960309374976)]} 0 0
   [junit4]   2> 1751119 INFO  (qtp1258130897-13022) [    ] o.a.s.u.p.LogUpdateProcessorFactory [collection1]  webapp= path=/update params={update.distrib=FROMLEADER&distrib.from=http://127.0.0.1:43672/collection1/&wt=javabin&version=2}{add=[9 (1559437960309374976)]} 0 0
   [junit4]   2> 1751119 INFO  (qtp971686569-12993) [    ] o.a.s.u.p.LogUpdateProcessorFactory [collection1]  webapp= path=/update params={_stateVer_=collection1:11&wt=javabin&version=2}{add=[9 (1559437960309374976)]} 0 2
   [junit4]   2> 1751123 INFO  (qtp1258130897-13023) [    ] o.a.s.u.p.LogUpdateProcessorFactory [collection1]  webapp= path=/update params={update.distrib=FROMLEADER&distrib.from=http://127.0.0.1:43672/collection1/&wt=javabin&version=2}{add=[10 (1559437960313569280)]} 0 0
   [junit4]   2> 1751123 INFO  (qtp1782222136-13058) [    ] o.a.s.u.p.LogUpdateProcessorFactory [collection1]  webapp= path=/update params={update.distrib=FROMLEADER&distrib.from=http://127.0.0.1:43672/collection1/&wt=javabin&version=2}{add=[10 (1559437960313569280)]} 0 0
   [junit4]   2> 1751124 INFO  (qtp971686569-12994) [    ] o.a.s.u.p.LogUpdateProcessorFactory [collection1]  webapp= path=/update params={_stateVer_=collection1:11&wt=javabin&version=2}{add=[10 (1559437960313569280)]} 0 2
   [junit4]   2> 1751127 INFO  (qtp1782222136-13056) [    ] o.a.s.u.p.LogUpdateProcessorFactory [collection1]  webapp= path=/update params={update.distrib=FROMLEADER&distrib.from=http://127.0.0.1:43672/collection1/&wt=javabin&version=2}{add=[11 (1559437960317763584)]} 0 0
   [junit4]   2> 1751127 INFO  (qtp1258130897-13023) [    ] o.a.s.u.p.LogUpdateProcessorFactory [collection1]  webapp= path=/update params={update.distrib=FROMLEADER&distrib.from=http://127.0.0.1:43672/collection1/&wt=javabin&version=2}{add=[11 (1559437960317763584)]} 0 0
   [junit4]   2> 1751128 INFO  (qtp971686569-12991) [    ] o.a.s.u.p.LogUpdateProcessorFactory [collection1]  webapp= path=/update params={_stateVer_=collection1:11&wt=javabin&version=2}{add=[11 (1559437960317763584)]} 0 2
   [junit4]   2> 1751131 INFO  (qtp1782222136-13057) [    ] o.a.s.u.p.LogUpdateProcessorFactory [collection1]  webapp= path=/update params={update.distrib=FROMLEADER&distrib.from=http://127.0.0.1:43672/collection1/&wt=javabin&version=2}{add=[12 (1559437960321957888)]} 0 0
   [junit4]   2> 1751131 INFO  (qtp1258130897-13023) [    ] o.a.s.u.p.LogUpdateProcessorFactory [collection1]  webapp= path=/update params={update.distrib=FROMLEADER&distrib.from=http://127.0.0.1:43672/collection1/&wt=javabin&version=2}{add=[12 (1559437960321957888)]} 0 0
   [junit4]   2> 1751131 INFO  (qtp971686569-12990) [    ] o.a.s.u.p.LogUpdateProcessorFactory [collection1]  webapp= path=/update params={_stateVer_=collection1:11&wt=javabin&version=2}{add=[12 (1559437960321957888)]} 0 2
   [junit4]   2> 1751134 INFO  (qtp1782222136-13052) [    ] o.a.s.u.p.LogUpdateProcessorFactory [collection1]  webapp= path=/update params={update.distrib=FROMLEADER&distrib.from=http://127.0.0.1:43672/collection1/&wt=javabin&version=2}{add=[13 (1559437960326152192)]} 0 0
   [junit4]   2> 1751135 INFO  (qtp1258130897-13022) [    ] o.a.s.u.p.LogUpdateProcessorFactory [collection1]  webapp= path=/update params={update.distrib=FROMLEADER&distrib.from=http://127.0.0.1:43672/collection1/&wt=javabin&version=2}{add=[13 (1559437960326152192)]} 0 0
   [junit4]   2> 1751135 INFO  (qtp971686569-12993) [    ] o.a.s.u.p.LogUpdateProcessorFactory [collection1]  webapp= path=/update params={_stateVer_=collection1:11&wt=javabin&version=2}{add=[13 (1559437960326152192)]} 0 2
   [junit4]   2> 1751138 INFO  (qtp1258130897-13021) [    ] o.a.s.u.p.LogUpdateProcessorFactory [collection1]  webapp= path=/update params={update.distrib=FROMLEADER&distrib.from=http://127.0.0.1:43672/collection1/&wt=javabin&version=2}{add=[14 (1559437960329297920)]} 0 0
   [junit4]   2> 1751138 INFO  (qtp1782222136-13058) [    ] o.a.s.u.p.LogUpdateProcessorFactory [collection1]  webapp= path=/update params={update.distrib=FROMLEADER&distrib.from=http://127.0.0.1:43672/collection1/&wt=javabin&version=2}{add=[14 (1559437960329297920)]} 0 0
   [junit4]   2> 1751138 INFO  (qtp971686569-12994) [    ] o.a.s.u.p.LogUpdateProcessorFactory [collection1]  webapp= path=/update params={_stateVer_=collection1:

[...truncated too long message...]

olicy1, SolrInfoMBeanTest, DisMaxRequestHandlerTest, TestReversedWildcardFilterFactory, TestQueryTypes, TestOmitPositions, XmlUpdateRequestHandlerTest, TestIndexingPerformance, MoreLikeThisHandlerTest, TestSolrQueryParser, LoggingHandlerTest, IndexSchemaTest, TestCollationField, ReturnFieldsTest, JSONWriterTest, TestAnalyzedSuggestions, TestPHPSerializedResponseWriter, SearchHandlerTest, HighlighterConfigTest, TestSolrIndexConfig, TestQuerySenderNoQuery, TestStressRecovery, MultiTermTest, SampleTest, TestDocSet, TestBinaryField, TestSearchPerf, NumericFieldsTest, TestElisionMultitermQuery, TestConfig, OutputWriterTest, ExternalFileFieldSortTest, NotRequiredUniqueKeyTest, TestXIncludeConfig, TestDFRSimilarityFactory, TimeZoneUtilsTest, TestFastOutputStream, URLClassifyProcessorTest, PluginInfoTest, TestSystemIdResolver, PrimUtilsTest, TestSuggestSpellingConverter, DateFieldTest, TestLRUCache, ZkNodePropsTest, UUIDFieldTest, CircularListTest, DistributedMLTComponentTest, TestHighlightDedupGrouping, TestSimpleTrackingShardHandler, AsyncCallRequestStatusResponseTest, CloudExitableDirectoryReaderTest, ConcurrentDeleteAndCreateCollectionTest, ConnectionManagerTest, DeleteLastCustomShardedReplicaTest, DeleteStatusTest, DistribCursorPagingTest, ForceLeaderTest, MultiThreadedOCPTest, PeerSyncReplicationTest]
   [junit4] Completed [514/692 (1!)] on J0 in 41.49s, 1 test, 1 failure <<< FAILURES!

[...truncated 160 lines...]
   [junit4] Suite: org.apache.solr.handler.admin.TestApiFramework
   [junit4]   2> Creating dataDir: /home/jenkins/workspace/Lucene-Solr-6.x-Linux/solr/build/solr-core/test/J2/temp/solr.handler.admin.TestApiFramework_127C456CF0EA8BEA-001/init-core-data-001
   [junit4]   2> 2047285 INFO  (SUITE-TestApiFramework-seed#[127C456CF0EA8BEA]-worker) [    ] o.a.s.SolrTestCaseJ4 Using TrieFields
   [junit4]   2> 2047286 INFO  (SUITE-TestApiFramework-seed#[127C456CF0EA8BEA]-worker) [    ] o.a.s.SolrTestCaseJ4 Randomized ssl (true) and clientAuth (true) via: @org.apache.solr.util.RandomizeSSL(reason="", ssl=0.0/0.0, value=0.0/0.0, clientAuth=0.0/0.0)
   [junit4]   2> 2047289 INFO  (TEST-TestApiFramework.testTrailingTemplatePaths-seed#[127C456CF0EA8BEA]) [    ] o.a.s.SolrTestCaseJ4 ###Starting testTrailingTemplatePaths
   [junit4]   2> 2047289 INFO  (TEST-TestApiFramework.testTrailingTemplatePaths-seed#[127C456CF0EA8BEA]) [    ] o.a.s.SolrTestCaseJ4 ###Ending testTrailingTemplatePaths
   [junit4]   2> 2047290 INFO  (TEST-TestApiFramework.testFramework-seed#[127C456CF0EA8BEA]) [    ] o.a.s.SolrTestCaseJ4 ###Starting testFramework
   [junit4]   2> 2047326 INFO  (TEST-TestApiFramework.testFramework-seed#[127C456CF0EA8BEA]) [    ] o.a.s.SolrTestCaseJ4 ###Ending testFramework
   [junit4]   2> NOTE: reproduce with: ant test  -Dtestcase=TestApiFramework -Dtests.method=testFramework -Dtests.seed=127C456CF0EA8BEA -Dtests.multiplier=3 -Dtests.slow=true -Dtests.locale=en-MS -Dtests.timezone=America/Indiana/Vincennes -Dtests.asserts=true -Dtests.file.encoding=UTF-8
   [junit4] ERROR   0.04s J2 | TestApiFramework.testFramework <<<
   [junit4]    > Throwable #1: java.lang.ExceptionInInitializerError
   [junit4]    > 	at __randomizedtesting.SeedInfo.seed([127C456CF0EA8BEA:50A8F4BF63E67D7]:0)
   [junit4]    > 	at net.sf.cglib.core.KeyFactory$Generator.generateClass(KeyFactory.java:166)
   [junit4]    > 	at net.sf.cglib.core.DefaultGeneratorStrategy.generate(DefaultGeneratorStrategy.java:25)
   [junit4]    > 	at net.sf.cglib.core.AbstractClassGenerator.create(AbstractClassGenerator.java:216)
   [junit4]    > 	at net.sf.cglib.core.KeyFactory$Generator.create(KeyFactory.java:144)
   [junit4]    > 	at net.sf.cglib.core.KeyFactory.create(KeyFactory.java:116)
   [junit4]    > 	at net.sf.cglib.core.KeyFactory.create(KeyFactory.java:108)
   [junit4]    > 	at net.sf.cglib.core.KeyFactory.create(KeyFactory.java:104)
   [junit4]    > 	at net.sf.cglib.proxy.Enhancer.<clinit>(Enhancer.java:69)
   [junit4]    > 	at org.easymock.internal.ClassProxyFactory.createEnhancer(ClassProxyFactory.java:259)
   [junit4]    > 	at org.easymock.internal.ClassProxyFactory.createProxy(ClassProxyFactory.java:174)
   [junit4]    > 	at org.easymock.internal.MocksControl.createMock(MocksControl.java:60)
   [junit4]    > 	at org.easymock.EasyMock.createMock(EasyMock.java:104)
   [junit4]    > 	at org.apache.solr.handler.admin.TestCoreAdminApis.getCoreContainerMock(TestCoreAdminApis.java:83)
   [junit4]    > 	at org.apache.solr.handler.admin.TestApiFramework.testFramework(TestApiFramework.java:59)
   [junit4]    > 	at java.base/jdk.internal.reflect.NativeMethodAccessorImpl.invoke0(Native Method)
   [junit4]    > 	at java.base/jdk.internal.reflect.NativeMethodAccessorImpl.invoke(NativeMethodAccessorImpl.java:62)
   [junit4]    > 	at java.base/jdk.internal.reflect.DelegatingMethodAccessorImpl.invoke(DelegatingMethodAccessorImpl.java:43)
   [junit4]    > 	at java.base/java.lang.reflect.Method.invoke(Method.java:543)
   [junit4]    > 	at java.base/java.lang.Thread.run(Thread.java:844)
   [junit4]    > Caused by: java.lang.reflect.InaccessibleObjectException: Unable to make protected final java.lang.Class java.lang.ClassLoader.defineClass(java.lang.String,byte[],int,int,java.security.ProtectionDomain) throws java.lang.ClassFormatError accessible: module java.base does not "opens java.lang" to unnamed module @7cb9a136
   [junit4]    > 	at java.base/java.lang.reflect.AccessibleObject.checkCanSetAccessible(AccessibleObject.java:207)
   [junit4]    > 	at java.base/java.lang.reflect.Method.checkCanSetAccessible(Method.java:192)
   [junit4]    > 	at java.base/java.lang.reflect.Method.setAccessible(Method.java:186)
   [junit4]    > 	at net.sf.cglib.core.ReflectUtils$2.run(ReflectUtils.java:56)
   [junit4]    > 	at java.base/java.security.AccessController.doPrivileged(Native Method)
   [junit4]    > 	at net.sf.cglib.core.ReflectUtils.<clinit>(ReflectUtils.java:46)
   [junit4]    > 	... 52 more
   [junit4]   2> 2047328 INFO  (SUITE-TestApiFramework-seed#[127C456CF0EA8BEA]-worker) [    ] o.a.s.SolrTestCaseJ4 ###deleteCore
   [junit4]   2> NOTE: leaving temporary files on disk at: /home/jenkins/workspace/Lucene-Solr-6.x-Linux/solr/build/solr-core/test/J2/temp/solr.handler.admin.TestApiFramework_127C456CF0EA8BEA-001
   [junit4]   2> NOTE: test params are: codec=Asserting(Lucene62): {}, docValues:{}, maxPointsInLeafNode=549, maxMBSortInHeap=7.2206470610135565, sim=RandomSimilarity(queryNorm=false,coord=no): {}, locale=en-MS, timezone=America/Indiana/Vincennes
   [junit4]   2> NOTE: Linux 4.4.0-53-generic amd64/Oracle Corporation 9-ea (64-bit)/cpus=12,threads=1,free=187172696,total=536870912
   [junit4]   2> NOTE: All tests run in this JVM: [TestTolerantSearch, HdfsCollectionsAPIDistributedZkTest, DOMUtilTest, CheckHdfsIndexTest, BaseCdcrDistributedZkTest, LeaderElectionTest, CoreAdminCreateDiscoverTest, HdfsDirectoryTest, SpellPossibilityIteratorTest, CloudMLTQParserTest, SuggesterTSTTest, MetricUtilsTest, RequestHandlersTest, CoreAdminHandlerTest, DocExpirationUpdateProcessorFactoryTest, TestPhraseSuggestions, TestNRTOpen, TestMacroExpander, SegmentsInfoRequestHandlerTest, TestFieldTypeResource, BadComponentTest, OverseerRolesTest, TestManagedResource, TestSolrCloudSnapshots, TestHashQParserPlugin, TestIndexSearcher, UpdateParamsTest, BasicDistributedZk2Test, TestScoreJoinQPNoScore, LukeRequestHandlerTest, TestExceedMaxTermLength, DocValuesMultiTest, OverseerTest, TestStandardQParsers, TestRecovery, DistanceUnitsTest, TestConfigSetsAPI, TestSha256AuthenticationProvider, ConfigSetsAPITest, BlockJoinFacetRandomTest, TestStressReorder, NoCacheHeaderTest, DistributedDebugComponentTest, TestCorePropertiesReload, TestFieldCollectionResource, ZkStateReaderTest, TestSort, TestSearcherReuse, PeerSyncWithIndexFingerprintCachingTest, ResponseLogComponentTest, TestSSLRandomization, SimpleFacetsTest, TestTolerantUpdateProcessorCloud, CollectionsAPIAsyncDistributedZkTest, TestCollectionAPIs, AutoCommitTest, TestSchemaSimilarityResource, QueryResultKeyTest, TestReRankQParserPlugin, TestSortByMinMaxFunction, TestMergePolicyConfig, SolrPluginUtilsTest, TestWriterPerf, BooleanFieldTest, TestLRUStatsCache, CurrencyFieldXmlFileTest, DistributedFacetPivotSmallTest, SOLR749Test, CollectionReloadTest, TestCloudInspectUtil, RuleEngineTest, TestXmlQParser, TestSchemalessBufferedUpdates, FullSolrCloudDistribCmdsTest, ShardSplitTest, TestLeaderElectionWithEmptyReplica, DocValuesNotIndexedTest, TestFileDictionaryLookup, SuggesterTest, InfixSuggestersTest, MergeStrategyTest, TestTrackingShardHandlerFactory, MissingSegmentRecoveryTest, HdfsRecoveryZkTest, HLLSerializationTest, TestPostingsSolrHighlighter, TestSubQueryTransformer, TestUtils, SubstringBytesRefFilterTest, TestSolrConfigHandler, SimpleCollectionCreateDeleteTest, MinimalSchemaTest, TestCoreDiscovery, DirectUpdateHandlerTest, AnalyticsMergeStrategyTest, TestFieldCache, TestLMJelinekMercerSimilarityFactory, ConjunctionSolrSpellCheckerTest, QueryParsingTest, TestSQLHandler, StatsComponentTest, TestReplicationHandlerBackup, CustomCollectionTest, TestManagedSchemaThreadSafety, TestReplicaProperties, TestAuthorizationFramework, InfoHandlerTest, LeaderInitiatedRecoveryOnCommitTest, TestConfigSetImmutable, UtilsToolTest, TestSolrJ, TestRTimerTree, CdcrBootstrapTest, DistribJoinFromCollectionTest, DistributedQueueTest, HttpPartitionTest, ReplaceNodeTest, SSLMigrationTest, SolrCLIZkUtilsTest, SolrCloudExampleTest, TestCollectionAPI, TestLockTree, TestMiniSolrCloudClusterSSL, TestShortCircuitedRequests, TestSolrCloudWithSecureImpersonation, TriLevelCompositeIdRoutingTest, HdfsBasicDistributedZkTest, HdfsChaosMonkeyNothingIsSafeTest, HdfsNNFailoverTest, HdfsThreadLeakTest, HdfsWriteToMultipleCollectionsTest, TestClusterStateMutator, ZkStateWriterTest, RulesTest, TestBlobHandler, CoreAdminRequestStatusTest, SecurityConfHandlerTest, TestApiFramework]
   [junit4] Completed [566/692 (2!)] on J2 in 0.06s, 2 tests, 1 error <<< FAILURES!

[...truncated 52076 lines...]


Mime
View raw message