lucene-dev mailing list archives

Site index · List index
Message view « Date » · « Thread »
Top « Date » · « Thread »
From Apache Jenkins Server <jenk...@builds.apache.org>
Subject [JENKINS] Lucene-Solr-NightlyTests-master - Build # 1283 - Still Unstable
Date Tue, 18 Apr 2017 03:56:54 GMT
Build: https://builds.apache.org/job/Lucene-Solr-NightlyTests-master/1283/

4 tests failed.
FAILED:  junit.framework.TestSuite.org.apache.solr.cloud.CdcrBootstrapTest

Error Message:
ObjectTracker found 1 object(s) that were not released!!! [RawDirectoryWrapper] org.apache.solr.common.util.ObjectReleaseTracker$ObjectTrackerException: org.apache.lucene.store.RawDirectoryWrapper  at org.apache.solr.common.util.ObjectReleaseTracker.track(ObjectReleaseTracker.java:42)  at org.apache.solr.core.CachingDirectoryFactory.get(CachingDirectoryFactory.java:347)  at org.apache.solr.handler.IndexFetcher.fetchLatestIndex(IndexFetcher.java:461)  at org.apache.solr.handler.IndexFetcher.fetchLatestIndex(IndexFetcher.java:326)  at org.apache.solr.handler.ReplicationHandler.doFetch(ReplicationHandler.java:415)  at org.apache.solr.handler.CdcrRequestHandler$BootstrapCallable.call(CdcrRequestHandler.java:757)  at org.apache.solr.handler.CdcrRequestHandler$BootstrapCallable.call(CdcrRequestHandler.java:712)  at com.codahale.metrics.InstrumentedExecutorService$InstrumentedCallable.call(InstrumentedExecutorService.java:197)  at java.util.concurrent.FutureTask.run(FutureTask.java:266)  at org.apache.solr.common.util.ExecutorUtil$MDCAwareThreadPoolExecutor.lambda$execute$0(ExecutorUtil.java:229)  at java.util.concurrent.ThreadPoolExecutor.runWorker(ThreadPoolExecutor.java:1142)  at java.util.concurrent.ThreadPoolExecutor$Worker.run(ThreadPoolExecutor.java:617)  at java.lang.Thread.run(Thread.java:745)  

Stack Trace:
java.lang.AssertionError: ObjectTracker found 1 object(s) that were not released!!! [RawDirectoryWrapper]
org.apache.solr.common.util.ObjectReleaseTracker$ObjectTrackerException: org.apache.lucene.store.RawDirectoryWrapper
	at org.apache.solr.common.util.ObjectReleaseTracker.track(ObjectReleaseTracker.java:42)
	at org.apache.solr.core.CachingDirectoryFactory.get(CachingDirectoryFactory.java:347)
	at org.apache.solr.handler.IndexFetcher.fetchLatestIndex(IndexFetcher.java:461)
	at org.apache.solr.handler.IndexFetcher.fetchLatestIndex(IndexFetcher.java:326)
	at org.apache.solr.handler.ReplicationHandler.doFetch(ReplicationHandler.java:415)
	at org.apache.solr.handler.CdcrRequestHandler$BootstrapCallable.call(CdcrRequestHandler.java:757)
	at org.apache.solr.handler.CdcrRequestHandler$BootstrapCallable.call(CdcrRequestHandler.java:712)
	at com.codahale.metrics.InstrumentedExecutorService$InstrumentedCallable.call(InstrumentedExecutorService.java:197)
	at java.util.concurrent.FutureTask.run(FutureTask.java:266)
	at org.apache.solr.common.util.ExecutorUtil$MDCAwareThreadPoolExecutor.lambda$execute$0(ExecutorUtil.java:229)
	at java.util.concurrent.ThreadPoolExecutor.runWorker(ThreadPoolExecutor.java:1142)
	at java.util.concurrent.ThreadPoolExecutor$Worker.run(ThreadPoolExecutor.java:617)
	at java.lang.Thread.run(Thread.java:745)


	at __randomizedtesting.SeedInfo.seed([42E99CA6451700F9]:0)
	at org.junit.Assert.fail(Assert.java:93)
	at org.junit.Assert.assertTrue(Assert.java:43)
	at org.junit.Assert.assertNull(Assert.java:551)
	at org.apache.solr.SolrTestCaseJ4.teardownTestCases(SolrTestCaseJ4.java:302)
	at sun.reflect.GeneratedMethodAccessor61.invoke(Unknown Source)
	at sun.reflect.DelegatingMethodAccessorImpl.invoke(DelegatingMethodAccessorImpl.java:43)
	at java.lang.reflect.Method.invoke(Method.java:498)
	at com.carrotsearch.randomizedtesting.RandomizedRunner.invoke(RandomizedRunner.java:1713)
	at com.carrotsearch.randomizedtesting.RandomizedRunner$7.evaluate(RandomizedRunner.java:870)
	at com.carrotsearch.randomizedtesting.rules.StatementAdapter.evaluate(StatementAdapter.java:36)
	at com.carrotsearch.randomizedtesting.rules.SystemPropertiesRestoreRule$1.evaluate(SystemPropertiesRestoreRule.java:57)
	at org.apache.lucene.util.AbstractBeforeAfterRule$1.evaluate(AbstractBeforeAfterRule.java:45)
	at com.carrotsearch.randomizedtesting.rules.StatementAdapter.evaluate(StatementAdapter.java:36)
	at org.apache.lucene.util.TestRuleStoreClassName$1.evaluate(TestRuleStoreClassName.java:41)
	at com.carrotsearch.randomizedtesting.rules.NoShadowingOrOverridesOnMethodsRule$1.evaluate(NoShadowingOrOverridesOnMethodsRule.java:40)
	at com.carrotsearch.randomizedtesting.rules.NoShadowingOrOverridesOnMethodsRule$1.evaluate(NoShadowingOrOverridesOnMethodsRule.java:40)
	at com.carrotsearch.randomizedtesting.rules.StatementAdapter.evaluate(StatementAdapter.java:36)
	at com.carrotsearch.randomizedtesting.rules.StatementAdapter.evaluate(StatementAdapter.java:36)
	at com.carrotsearch.randomizedtesting.rules.StatementAdapter.evaluate(StatementAdapter.java:36)
	at org.apache.lucene.util.TestRuleAssertionsRequired$1.evaluate(TestRuleAssertionsRequired.java:53)
	at org.apache.lucene.util.TestRuleMarkFailure$1.evaluate(TestRuleMarkFailure.java:47)
	at org.apache.lucene.util.TestRuleIgnoreAfterMaxFailures$1.evaluate(TestRuleIgnoreAfterMaxFailures.java:64)
	at org.apache.lucene.util.TestRuleIgnoreTestSuites$1.evaluate(TestRuleIgnoreTestSuites.java:54)
	at com.carrotsearch.randomizedtesting.rules.StatementAdapter.evaluate(StatementAdapter.java:36)
	at com.carrotsearch.randomizedtesting.ThreadLeakControl$StatementRunner.run(ThreadLeakControl.java:368)
	at java.lang.Thread.run(Thread.java:745)


FAILED:  org.apache.solr.cloud.TestStressCloudBlindAtomicUpdates.test_dv

Error Message:
java.lang.RuntimeException: Error from server at http://127.0.0.1:58070/solr/test_col: Async exception during distributed update: Error from server at http://127.0.0.1:32886/solr/test_col_shard5_replica2: Server Error    request: http://127.0.0.1:32886/solr/test_col_shard5_replica2/update?update.distrib=TOLEADER&distrib.from=http%3A%2F%2F127.0.0.1%3A58070%2Fsolr%2Ftest_col_shard5_replica1%2F&wt=javabin&version=2 Remote error message: Failed synchronous update on shard StdNode: http://127.0.0.1:58070/solr/test_col_shard5_replica1/ update: org.apache.solr.client.solrj.request.UpdateRequest@6210d956

Stack Trace:
java.util.concurrent.ExecutionException: java.lang.RuntimeException: Error from server at http://127.0.0.1:58070/solr/test_col: Async exception during distributed update: Error from server at http://127.0.0.1:32886/solr/test_col_shard5_replica2: Server Error



request: http://127.0.0.1:32886/solr/test_col_shard5_replica2/update?update.distrib=TOLEADER&distrib.from=http%3A%2F%2F127.0.0.1%3A58070%2Fsolr%2Ftest_col_shard5_replica1%2F&wt=javabin&version=2
Remote error message: Failed synchronous update on shard StdNode: http://127.0.0.1:58070/solr/test_col_shard5_replica1/ update: org.apache.solr.client.solrj.request.UpdateRequest@6210d956
	at __randomizedtesting.SeedInfo.seed([42E99CA6451700F9:74FDFEE0CF4A3AE8]:0)
	at java.util.concurrent.FutureTask.report(FutureTask.java:122)
	at java.util.concurrent.FutureTask.get(FutureTask.java:192)
	at org.apache.solr.cloud.TestStressCloudBlindAtomicUpdates.checkField(TestStressCloudBlindAtomicUpdates.java:281)
	at org.apache.solr.cloud.TestStressCloudBlindAtomicUpdates.test_dv(TestStressCloudBlindAtomicUpdates.java:193)
	at sun.reflect.NativeMethodAccessorImpl.invoke0(Native Method)
	at sun.reflect.NativeMethodAccessorImpl.invoke(NativeMethodAccessorImpl.java:62)
	at sun.reflect.DelegatingMethodAccessorImpl.invoke(DelegatingMethodAccessorImpl.java:43)
	at java.lang.reflect.Method.invoke(Method.java:498)
	at com.carrotsearch.randomizedtesting.RandomizedRunner.invoke(RandomizedRunner.java:1713)
	at com.carrotsearch.randomizedtesting.RandomizedRunner$8.evaluate(RandomizedRunner.java:907)
	at com.carrotsearch.randomizedtesting.RandomizedRunner$9.evaluate(RandomizedRunner.java:943)
	at com.carrotsearch.randomizedtesting.RandomizedRunner$10.evaluate(RandomizedRunner.java:957)
	at com.carrotsearch.randomizedtesting.rules.SystemPropertiesRestoreRule$1.evaluate(SystemPropertiesRestoreRule.java:57)
	at org.apache.lucene.util.TestRuleSetupTeardownChained$1.evaluate(TestRuleSetupTeardownChained.java:49)
	at org.apache.lucene.util.AbstractBeforeAfterRule$1.evaluate(AbstractBeforeAfterRule.java:45)
	at org.apache.lucene.util.TestRuleThreadAndTestName$1.evaluate(TestRuleThreadAndTestName.java:48)
	at org.apache.lucene.util.TestRuleIgnoreAfterMaxFailures$1.evaluate(TestRuleIgnoreAfterMaxFailures.java:64)
	at org.apache.lucene.util.TestRuleMarkFailure$1.evaluate(TestRuleMarkFailure.java:47)
	at com.carrotsearch.randomizedtesting.rules.StatementAdapter.evaluate(StatementAdapter.java:36)
	at com.carrotsearch.randomizedtesting.ThreadLeakControl$StatementRunner.run(ThreadLeakControl.java:368)
	at com.carrotsearch.randomizedtesting.ThreadLeakControl.forkTimeoutingTask(ThreadLeakControl.java:817)
	at com.carrotsearch.randomizedtesting.ThreadLeakControl$3.evaluate(ThreadLeakControl.java:468)
	at com.carrotsearch.randomizedtesting.RandomizedRunner.runSingleTest(RandomizedRunner.java:916)
	at com.carrotsearch.randomizedtesting.RandomizedRunner$5.evaluate(RandomizedRunner.java:802)
	at com.carrotsearch.randomizedtesting.RandomizedRunner$6.evaluate(RandomizedRunner.java:852)
	at com.carrotsearch.randomizedtesting.RandomizedRunner$7.evaluate(RandomizedRunner.java:863)
	at com.carrotsearch.randomizedtesting.rules.StatementAdapter.evaluate(StatementAdapter.java:36)
	at com.carrotsearch.randomizedtesting.rules.SystemPropertiesRestoreRule$1.evaluate(SystemPropertiesRestoreRule.java:57)
	at org.apache.lucene.util.AbstractBeforeAfterRule$1.evaluate(AbstractBeforeAfterRule.java:45)
	at com.carrotsearch.randomizedtesting.rules.StatementAdapter.evaluate(StatementAdapter.java:36)
	at org.apache.lucene.util.TestRuleStoreClassName$1.evaluate(TestRuleStoreClassName.java:41)
	at com.carrotsearch.randomizedtesting.rules.NoShadowingOrOverridesOnMethodsRule$1.evaluate(NoShadowingOrOverridesOnMethodsRule.java:40)
	at com.carrotsearch.randomizedtesting.rules.NoShadowingOrOverridesOnMethodsRule$1.evaluate(NoShadowingOrOverridesOnMethodsRule.java:40)
	at com.carrotsearch.randomizedtesting.rules.StatementAdapter.evaluate(StatementAdapter.java:36)
	at com.carrotsearch.randomizedtesting.rules.StatementAdapter.evaluate(StatementAdapter.java:36)
	at com.carrotsearch.randomizedtesting.rules.StatementAdapter.evaluate(StatementAdapter.java:36)
	at org.apache.lucene.util.TestRuleAssertionsRequired$1.evaluate(TestRuleAssertionsRequired.java:53)
	at org.apache.lucene.util.TestRuleMarkFailure$1.evaluate(TestRuleMarkFailure.java:47)
	at org.apache.lucene.util.TestRuleIgnoreAfterMaxFailures$1.evaluate(TestRuleIgnoreAfterMaxFailures.java:64)
	at org.apache.lucene.util.TestRuleIgnoreTestSuites$1.evaluate(TestRuleIgnoreTestSuites.java:54)
	at com.carrotsearch.randomizedtesting.rules.StatementAdapter.evaluate(StatementAdapter.java:36)
	at com.carrotsearch.randomizedtesting.ThreadLeakControl$StatementRunner.run(ThreadLeakControl.java:368)
	at java.lang.Thread.run(Thread.java:745)
Caused by: java.lang.RuntimeException: Error from server at http://127.0.0.1:58070/solr/test_col: Async exception during distributed update: Error from server at http://127.0.0.1:32886/solr/test_col_shard5_replica2: Server Error



request: http://127.0.0.1:32886/solr/test_col_shard5_replica2/update?update.distrib=TOLEADER&distrib.from=http%3A%2F%2F127.0.0.1%3A58070%2Fsolr%2Ftest_col_shard5_replica1%2F&wt=javabin&version=2
Remote error message: Failed synchronous update on shard StdNode: http://127.0.0.1:58070/solr/test_col_shard5_replica1/ update: org.apache.solr.client.solrj.request.UpdateRequest@6210d956
	at org.apache.solr.cloud.TestStressCloudBlindAtomicUpdates$Worker.run(TestStressCloudBlindAtomicUpdates.java:409)
	at java.util.concurrent.Executors$RunnableAdapter.call(Executors.java:511)
	at java.util.concurrent.FutureTask.run(FutureTask.java:266)
	at org.apache.solr.common.util.ExecutorUtil$MDCAwareThreadPoolExecutor.lambda$execute$0(ExecutorUtil.java:229)
	at java.util.concurrent.ThreadPoolExecutor.runWorker(ThreadPoolExecutor.java:1142)
	at java.util.concurrent.ThreadPoolExecutor$Worker.run(ThreadPoolExecutor.java:617)
	... 1 more
Caused by: org.apache.solr.client.solrj.impl.HttpSolrClient$RemoteSolrException: Error from server at http://127.0.0.1:58070/solr/test_col: Async exception during distributed update: Error from server at http://127.0.0.1:32886/solr/test_col_shard5_replica2: Server Error



request: http://127.0.0.1:32886/solr/test_col_shard5_replica2/update?update.distrib=TOLEADER&distrib.from=http%3A%2F%2F127.0.0.1%3A58070%2Fsolr%2Ftest_col_shard5_replica1%2F&wt=javabin&version=2
Remote error message: Failed synchronous update on shard StdNode: http://127.0.0.1:58070/solr/test_col_shard5_replica1/ update: org.apache.solr.client.solrj.request.UpdateRequest@6210d956
	at org.apache.solr.client.solrj.impl.HttpSolrClient.executeMethod(HttpSolrClient.java:627)
	at org.apache.solr.client.solrj.impl.HttpSolrClient.request(HttpSolrClient.java:279)
	at org.apache.solr.client.solrj.impl.HttpSolrClient.request(HttpSolrClient.java:268)
	at org.apache.solr.client.solrj.SolrRequest.process(SolrRequest.java:160)
	at org.apache.solr.client.solrj.SolrRequest.process(SolrRequest.java:177)
	at org.apache.solr.cloud.TestStressCloudBlindAtomicUpdates$Worker.doRandomAtomicUpdate(TestStressCloudBlindAtomicUpdates.java:368)
	at org.apache.solr.cloud.TestStressCloudBlindAtomicUpdates$Worker.run(TestStressCloudBlindAtomicUpdates.java:397)
	... 6 more


FAILED:  org.apache.solr.cloud.hdfs.HdfsRecoveryZkTest.test

Error Message:
Mismatch in counts between replicas

Stack Trace:
java.lang.AssertionError: Mismatch in counts between replicas
	at __randomizedtesting.SeedInfo.seed([42E99CA6451700F9:CABDA37CEBEB6D01]:0)
	at org.junit.Assert.fail(Assert.java:93)
	at org.apache.solr.cloud.RecoveryZkTest.assertShardConsistency(RecoveryZkTest.java:143)
	at org.apache.solr.cloud.RecoveryZkTest.test(RecoveryZkTest.java:126)
	at sun.reflect.NativeMethodAccessorImpl.invoke0(Native Method)
	at sun.reflect.NativeMethodAccessorImpl.invoke(NativeMethodAccessorImpl.java:62)
	at sun.reflect.DelegatingMethodAccessorImpl.invoke(DelegatingMethodAccessorImpl.java:43)
	at java.lang.reflect.Method.invoke(Method.java:498)
	at com.carrotsearch.randomizedtesting.RandomizedRunner.invoke(RandomizedRunner.java:1713)
	at com.carrotsearch.randomizedtesting.RandomizedRunner$8.evaluate(RandomizedRunner.java:907)
	at com.carrotsearch.randomizedtesting.RandomizedRunner$9.evaluate(RandomizedRunner.java:943)
	at com.carrotsearch.randomizedtesting.RandomizedRunner$10.evaluate(RandomizedRunner.java:957)
	at com.carrotsearch.randomizedtesting.rules.SystemPropertiesRestoreRule$1.evaluate(SystemPropertiesRestoreRule.java:57)
	at org.apache.lucene.util.TestRuleSetupTeardownChained$1.evaluate(TestRuleSetupTeardownChained.java:49)
	at org.apache.lucene.util.AbstractBeforeAfterRule$1.evaluate(AbstractBeforeAfterRule.java:45)
	at org.apache.lucene.util.TestRuleThreadAndTestName$1.evaluate(TestRuleThreadAndTestName.java:48)
	at org.apache.lucene.util.TestRuleIgnoreAfterMaxFailures$1.evaluate(TestRuleIgnoreAfterMaxFailures.java:64)
	at org.apache.lucene.util.TestRuleMarkFailure$1.evaluate(TestRuleMarkFailure.java:47)
	at com.carrotsearch.randomizedtesting.rules.StatementAdapter.evaluate(StatementAdapter.java:36)
	at com.carrotsearch.randomizedtesting.ThreadLeakControl$StatementRunner.run(ThreadLeakControl.java:368)
	at com.carrotsearch.randomizedtesting.ThreadLeakControl.forkTimeoutingTask(ThreadLeakControl.java:817)
	at com.carrotsearch.randomizedtesting.ThreadLeakControl$3.evaluate(ThreadLeakControl.java:468)
	at com.carrotsearch.randomizedtesting.RandomizedRunner.runSingleTest(RandomizedRunner.java:916)
	at com.carrotsearch.randomizedtesting.RandomizedRunner$5.evaluate(RandomizedRunner.java:802)
	at com.carrotsearch.randomizedtesting.RandomizedRunner$6.evaluate(RandomizedRunner.java:852)
	at com.carrotsearch.randomizedtesting.RandomizedRunner$7.evaluate(RandomizedRunner.java:863)
	at com.carrotsearch.randomizedtesting.rules.StatementAdapter.evaluate(StatementAdapter.java:36)
	at com.carrotsearch.randomizedtesting.rules.SystemPropertiesRestoreRule$1.evaluate(SystemPropertiesRestoreRule.java:57)
	at org.apache.lucene.util.AbstractBeforeAfterRule$1.evaluate(AbstractBeforeAfterRule.java:45)
	at com.carrotsearch.randomizedtesting.rules.StatementAdapter.evaluate(StatementAdapter.java:36)
	at org.apache.lucene.util.TestRuleStoreClassName$1.evaluate(TestRuleStoreClassName.java:41)
	at com.carrotsearch.randomizedtesting.rules.NoShadowingOrOverridesOnMethodsRule$1.evaluate(NoShadowingOrOverridesOnMethodsRule.java:40)
	at com.carrotsearch.randomizedtesting.rules.NoShadowingOrOverridesOnMethodsRule$1.evaluate(NoShadowingOrOverridesOnMethodsRule.java:40)
	at com.carrotsearch.randomizedtesting.rules.StatementAdapter.evaluate(StatementAdapter.java:36)
	at com.carrotsearch.randomizedtesting.rules.StatementAdapter.evaluate(StatementAdapter.java:36)
	at com.carrotsearch.randomizedtesting.rules.StatementAdapter.evaluate(StatementAdapter.java:36)
	at org.apache.lucene.util.TestRuleAssertionsRequired$1.evaluate(TestRuleAssertionsRequired.java:53)
	at org.apache.lucene.util.TestRuleMarkFailure$1.evaluate(TestRuleMarkFailure.java:47)
	at org.apache.lucene.util.TestRuleIgnoreAfterMaxFailures$1.evaluate(TestRuleIgnoreAfterMaxFailures.java:64)
	at org.apache.lucene.util.TestRuleIgnoreTestSuites$1.evaluate(TestRuleIgnoreTestSuites.java:54)
	at com.carrotsearch.randomizedtesting.rules.StatementAdapter.evaluate(StatementAdapter.java:36)
	at com.carrotsearch.randomizedtesting.ThreadLeakControl$StatementRunner.run(ThreadLeakControl.java:368)
	at java.lang.Thread.run(Thread.java:745)


FAILED:  org.apache.solr.handler.TestReplicationHandler.doTestReplicateAfterCoreReload

Error Message:
expected:<[{indexVersion=1492484053196,generation=2,filelist=[_0.cfe, _0.cfs, _0.si, _1.cfe, _1.cfs, _1.si, _2.cfe, _2.cfs, _2.si, _3.cfe, _3.cfs, _3.si, _4.cfe, _4.cfs, _4.si, _5.cfe, _5.cfs, _5.si, segments_2]}]> but was:<[{indexVersion=1492484053196,generation=2,filelist=[_0.cfe, _0.cfs, _0.si, _1.cfe, _1.cfs, _1.si, _2.cfe, _2.cfs, _2.si, _3.cfe, _3.cfs, _3.si, _4.cfe, _4.cfs, _4.si, _5.cfe, _5.cfs, _5.si, segments_2]}, {indexVersion=1492484053196,generation=3,filelist=[_6.fdt, _6.fdx, _6.fnm, _6.nvd, _6.nvm, _6.si, _6_Lucene50_0.doc, _6_Lucene50_0.tim, _6_Lucene50_0.tip, segments_3]}]>

Stack Trace:
java.lang.AssertionError: expected:<[{indexVersion=1492484053196,generation=2,filelist=[_0.cfe, _0.cfs, _0.si, _1.cfe, _1.cfs, _1.si, _2.cfe, _2.cfs, _2.si, _3.cfe, _3.cfs, _3.si, _4.cfe, _4.cfs, _4.si, _5.cfe, _5.cfs, _5.si, segments_2]}]> but was:<[{indexVersion=1492484053196,generation=2,filelist=[_0.cfe, _0.cfs, _0.si, _1.cfe, _1.cfs, _1.si, _2.cfe, _2.cfs, _2.si, _3.cfe, _3.cfs, _3.si, _4.cfe, _4.cfs, _4.si, _5.cfe, _5.cfs, _5.si, segments_2]}, {indexVersion=1492484053196,generation=3,filelist=[_6.fdt, _6.fdx, _6.fnm, _6.nvd, _6.nvm, _6.si, _6_Lucene50_0.doc, _6_Lucene50_0.tim, _6_Lucene50_0.tip, segments_3]}]>
	at __randomizedtesting.SeedInfo.seed([42E99CA6451700F9:673E8796355F0EFA]:0)
	at org.junit.Assert.fail(Assert.java:93)
	at org.junit.Assert.failNotEquals(Assert.java:647)
	at org.junit.Assert.assertEquals(Assert.java:128)
	at org.junit.Assert.assertEquals(Assert.java:147)
	at org.apache.solr.handler.TestReplicationHandler.doTestReplicateAfterCoreReload(TestReplicationHandler.java:1279)
	at sun.reflect.NativeMethodAccessorImpl.invoke0(Native Method)
	at sun.reflect.NativeMethodAccessorImpl.invoke(NativeMethodAccessorImpl.java:62)
	at sun.reflect.DelegatingMethodAccessorImpl.invoke(DelegatingMethodAccessorImpl.java:43)
	at java.lang.reflect.Method.invoke(Method.java:498)
	at com.carrotsearch.randomizedtesting.RandomizedRunner.invoke(RandomizedRunner.java:1713)
	at com.carrotsearch.randomizedtesting.RandomizedRunner$8.evaluate(RandomizedRunner.java:907)
	at com.carrotsearch.randomizedtesting.RandomizedRunner$9.evaluate(RandomizedRunner.java:943)
	at com.carrotsearch.randomizedtesting.RandomizedRunner$10.evaluate(RandomizedRunner.java:957)
	at com.carrotsearch.randomizedtesting.rules.SystemPropertiesRestoreRule$1.evaluate(SystemPropertiesRestoreRule.java:57)
	at org.apache.lucene.util.TestRuleSetupTeardownChained$1.evaluate(TestRuleSetupTeardownChained.java:49)
	at org.apache.lucene.util.AbstractBeforeAfterRule$1.evaluate(AbstractBeforeAfterRule.java:45)
	at org.apache.lucene.util.TestRuleThreadAndTestName$1.evaluate(TestRuleThreadAndTestName.java:48)
	at org.apache.lucene.util.TestRuleIgnoreAfterMaxFailures$1.evaluate(TestRuleIgnoreAfterMaxFailures.java:64)
	at org.apache.lucene.util.TestRuleMarkFailure$1.evaluate(TestRuleMarkFailure.java:47)
	at com.carrotsearch.randomizedtesting.rules.StatementAdapter.evaluate(StatementAdapter.java:36)
	at com.carrotsearch.randomizedtesting.ThreadLeakControl$StatementRunner.run(ThreadLeakControl.java:368)
	at com.carrotsearch.randomizedtesting.ThreadLeakControl.forkTimeoutingTask(ThreadLeakControl.java:817)
	at com.carrotsearch.randomizedtesting.ThreadLeakControl$3.evaluate(ThreadLeakControl.java:468)
	at com.carrotsearch.randomizedtesting.RandomizedRunner.runSingleTest(RandomizedRunner.java:916)
	at com.carrotsearch.randomizedtesting.RandomizedRunner$5.evaluate(RandomizedRunner.java:802)
	at com.carrotsearch.randomizedtesting.RandomizedRunner$6.evaluate(RandomizedRunner.java:852)
	at com.carrotsearch.randomizedtesting.RandomizedRunner$7.evaluate(RandomizedRunner.java:863)
	at com.carrotsearch.randomizedtesting.rules.StatementAdapter.evaluate(StatementAdapter.java:36)
	at com.carrotsearch.randomizedtesting.rules.SystemPropertiesRestoreRule$1.evaluate(SystemPropertiesRestoreRule.java:57)
	at org.apache.lucene.util.AbstractBeforeAfterRule$1.evaluate(AbstractBeforeAfterRule.java:45)
	at com.carrotsearch.randomizedtesting.rules.StatementAdapter.evaluate(StatementAdapter.java:36)
	at org.apache.lucene.util.TestRuleStoreClassName$1.evaluate(TestRuleStoreClassName.java:41)
	at com.carrotsearch.randomizedtesting.rules.NoShadowingOrOverridesOnMethodsRule$1.evaluate(NoShadowingOrOverridesOnMethodsRule.java:40)
	at com.carrotsearch.randomizedtesting.rules.NoShadowingOrOverridesOnMethodsRule$1.evaluate(NoShadowingOrOverridesOnMethodsRule.java:40)
	at com.carrotsearch.randomizedtesting.rules.StatementAdapter.evaluate(StatementAdapter.java:36)
	at com.carrotsearch.randomizedtesting.rules.StatementAdapter.evaluate(StatementAdapter.java:36)
	at com.carrotsearch.randomizedtesting.rules.StatementAdapter.evaluate(StatementAdapter.java:36)
	at org.apache.lucene.util.TestRuleAssertionsRequired$1.evaluate(TestRuleAssertionsRequired.java:53)
	at org.apache.lucene.util.TestRuleMarkFailure$1.evaluate(TestRuleMarkFailure.java:47)
	at org.apache.lucene.util.TestRuleIgnoreAfterMaxFailures$1.evaluate(TestRuleIgnoreAfterMaxFailures.java:64)
	at org.apache.lucene.util.TestRuleIgnoreTestSuites$1.evaluate(TestRuleIgnoreTestSuites.java:54)
	at com.carrotsearch.randomizedtesting.rules.StatementAdapter.evaluate(StatementAdapter.java:36)
	at com.carrotsearch.randomizedtesting.ThreadLeakControl$StatementRunner.run(ThreadLeakControl.java:368)
	at java.lang.Thread.run(Thread.java:745)




Build Log:
[...truncated 11679 lines...]
   [junit4] Suite: org.apache.solr.cloud.TestStressCloudBlindAtomicUpdates
   [junit4]   2> Creating dataDir: /x1/jenkins/jenkins-slave/workspace/Lucene-Solr-NightlyTests-master/checkout/solr/build/solr-core/test/J1/temp/solr.cloud.TestStressCloudBlindAtomicUpdates_42E99CA6451700F9-001/init-core-data-001
   [junit4]   2> 51182 WARN  (SUITE-TestStressCloudBlindAtomicUpdates-seed#[42E99CA6451700F9]-worker) [    ] o.a.s.SolrTestCaseJ4 startTrackingSearchers: numOpens=1 numCloses=1
   [junit4]   2> 51183 INFO  (SUITE-TestStressCloudBlindAtomicUpdates-seed#[42E99CA6451700F9]-worker) [    ] o.a.s.SolrTestCaseJ4 Using TrieFields
   [junit4]   2> 51186 INFO  (SUITE-TestStressCloudBlindAtomicUpdates-seed#[42E99CA6451700F9]-worker) [    ] o.a.s.SolrTestCaseJ4 Randomized ssl (false) and clientAuth (false) via: @org.apache.solr.SolrTestCaseJ4$SuppressSSL(bugUrl=SSL overhead seems to cause OutOfMemory when stress testing)
   [junit4]   2> 51191 INFO  (SUITE-TestStressCloudBlindAtomicUpdates-seed#[42E99CA6451700F9]-worker) [    ] o.a.s.c.MiniSolrCloudCluster Starting cluster of 10 servers in /x1/jenkins/jenkins-slave/workspace/Lucene-Solr-NightlyTests-master/checkout/solr/build/solr-core/test/J1/temp/solr.cloud.TestStressCloudBlindAtomicUpdates_42E99CA6451700F9-001/tempDir-001
   [junit4]   2> 51192 INFO  (SUITE-TestStressCloudBlindAtomicUpdates-seed#[42E99CA6451700F9]-worker) [    ] o.a.s.c.ZkTestServer STARTING ZK TEST SERVER
   [junit4]   2> 51298 INFO  (Thread-11) [    ] o.a.s.c.ZkTestServer client port:0.0.0.0/0.0.0.0:0
   [junit4]   2> 51298 INFO  (Thread-11) [    ] o.a.s.c.ZkTestServer Starting server
   [junit4]   2> 51340 INFO  (SUITE-TestStressCloudBlindAtomicUpdates-seed#[42E99CA6451700F9]-worker) [    ] o.a.s.c.ZkTestServer start zk server on port:46794
   [junit4]   2> 52380 INFO  (jetty-launcher-26-thread-9) [    ] o.e.j.s.Server jetty-9.3.14.v20161028
   [junit4]   2> 52388 INFO  (jetty-launcher-26-thread-10) [    ] o.e.j.s.Server jetty-9.3.14.v20161028
   [junit4]   2> 52396 INFO  (jetty-launcher-26-thread-1) [    ] o.e.j.s.Server jetty-9.3.14.v20161028
   [junit4]   2> 52614 INFO  (jetty-launcher-26-thread-2) [    ] o.e.j.s.Server jetty-9.3.14.v20161028
   [junit4]   2> 52615 INFO  (jetty-launcher-26-thread-3) [    ] o.e.j.s.Server jetty-9.3.14.v20161028
   [junit4]   2> 52616 INFO  (jetty-launcher-26-thread-6) [    ] o.e.j.s.Server jetty-9.3.14.v20161028
   [junit4]   2> 52616 INFO  (jetty-launcher-26-thread-5) [    ] o.e.j.s.Server jetty-9.3.14.v20161028
   [junit4]   2> 52617 INFO  (jetty-launcher-26-thread-4) [    ] o.e.j.s.Server jetty-9.3.14.v20161028
   [junit4]   2> 52618 INFO  (jetty-launcher-26-thread-8) [    ] o.e.j.s.Server jetty-9.3.14.v20161028
   [junit4]   2> 52621 INFO  (jetty-launcher-26-thread-7) [    ] o.e.j.s.Server jetty-9.3.14.v20161028
   [junit4]   2> 53146 INFO  (jetty-launcher-26-thread-1) [    ] o.e.j.s.h.ContextHandler Started o.e.j.s.ServletContextHandler@649367a4{/solr,null,AVAILABLE}
   [junit4]   2> 53146 INFO  (jetty-launcher-26-thread-10) [    ] o.e.j.s.h.ContextHandler Started o.e.j.s.ServletContextHandler@70054823{/solr,null,AVAILABLE}
   [junit4]   2> 53146 INFO  (jetty-launcher-26-thread-8) [    ] o.e.j.s.h.ContextHandler Started o.e.j.s.ServletContextHandler@3c2eb478{/solr,null,AVAILABLE}
   [junit4]   2> 53209 INFO  (jetty-launcher-26-thread-2) [    ] o.e.j.s.h.ContextHandler Started o.e.j.s.ServletContextHandler@628a882d{/solr,null,AVAILABLE}
   [junit4]   2> 53150 INFO  (jetty-launcher-26-thread-9) [    ] o.e.j.s.h.ContextHandler Started o.e.j.s.ServletContextHandler@381816e5{/solr,null,AVAILABLE}
   [junit4]   2> 53232 INFO  (jetty-launcher-26-thread-3) [    ] o.e.j.s.h.ContextHandler Started o.e.j.s.ServletContextHandler@6fde00db{/solr,null,AVAILABLE}
   [junit4]   2> 53271 INFO  (jetty-launcher-26-thread-7) [    ] o.e.j.s.h.ContextHandler Started o.e.j.s.ServletContextHandler@ddd897a{/solr,null,AVAILABLE}
   [junit4]   2> 53301 INFO  (jetty-launcher-26-thread-4) [    ] o.e.j.s.h.ContextHandler Started o.e.j.s.ServletContextHandler@68da7da1{/solr,null,AVAILABLE}
   [junit4]   2> 53317 INFO  (jetty-launcher-26-thread-5) [    ] o.e.j.s.h.ContextHandler Started o.e.j.s.ServletContextHandler@6cf54549{/solr,null,AVAILABLE}
   [junit4]   2> 53329 INFO  (jetty-launcher-26-thread-6) [    ] o.e.j.s.h.ContextHandler Started o.e.j.s.ServletContextHandler@d105a5e{/solr,null,AVAILABLE}
   [junit4]   2> 53365 INFO  (jetty-launcher-26-thread-3) [    ] o.e.j.s.AbstractConnector Started ServerConnector@1eacaeb2{HTTP/1.1,[http/1.1]}{127.0.0.1:59203}
   [junit4]   2> 53365 INFO  (jetty-launcher-26-thread-3) [    ] o.e.j.s.Server Started @61363ms
   [junit4]   2> 53365 INFO  (jetty-launcher-26-thread-3) [    ] o.a.s.c.s.e.JettySolrRunner Jetty properties: {hostContext=/solr, hostPort=59203}
   [junit4]   2> 53368 INFO  (jetty-launcher-26-thread-2) [    ] o.e.j.s.AbstractConnector Started ServerConnector@21fd9d5{HTTP/1.1,[http/1.1]}{127.0.0.1:59189}
   [junit4]   2> 53371 INFO  (jetty-launcher-26-thread-2) [    ] o.e.j.s.Server Started @61370ms
   [junit4]   2> 53371 INFO  (jetty-launcher-26-thread-2) [    ] o.a.s.c.s.e.JettySolrRunner Jetty properties: {hostContext=/solr, hostPort=59189}
   [junit4]   2> 53368 INFO  (jetty-launcher-26-thread-1) [    ] o.e.j.s.AbstractConnector Started ServerConnector@7f271c9f{HTTP/1.1,[http/1.1]}{127.0.0.1:58070}
   [junit4]   2> 53372 INFO  (jetty-launcher-26-thread-1) [    ] o.e.j.s.Server Started @61370ms
   [junit4]   2> 53368 INFO  (jetty-launcher-26-thread-7) [    ] o.e.j.s.AbstractConnector Started ServerConnector@76fde472{HTTP/1.1,[http/1.1]}{127.0.0.1:57099}
   [junit4]   2> 53372 INFO  (jetty-launcher-26-thread-7) [    ] o.e.j.s.Server Started @61371ms
   [junit4]   2> 53369 INFO  (jetty-launcher-26-thread-4) [    ] o.e.j.s.AbstractConnector Started ServerConnector@67e27c1b{HTTP/1.1,[http/1.1]}{127.0.0.1:60879}
   [junit4]   2> 53372 INFO  (jetty-launcher-26-thread-4) [    ] o.e.j.s.Server Started @61371ms
   [junit4]   2> 53369 INFO  (jetty-launcher-26-thread-5) [    ] o.e.j.s.AbstractConnector Started ServerConnector@69a22c35{HTTP/1.1,[http/1.1]}{127.0.0.1:32886}
   [junit4]   2> 53373 INFO  (jetty-launcher-26-thread-5) [    ] o.e.j.s.Server Started @61371ms
   [junit4]   2> 53369 INFO  (jetty-launcher-26-thread-6) [    ] o.e.j.s.AbstractConnector Started ServerConnector@766c2be9{HTTP/1.1,[http/1.1]}{127.0.0.1:42348}
   [junit4]   2> 53373 INFO  (jetty-launcher-26-thread-6) [    ] o.e.j.s.Server Started @61371ms
   [junit4]   2> 53369 INFO  (jetty-launcher-26-thread-10) [    ] o.e.j.s.AbstractConnector Started ServerConnector@18d1a429{HTTP/1.1,[http/1.1]}{127.0.0.1:33891}
   [junit4]   2> 53373 INFO  (jetty-launcher-26-thread-10) [    ] o.e.j.s.Server Started @61372ms
   [junit4]   2> 53369 INFO  (jetty-launcher-26-thread-9) [    ] o.e.j.s.AbstractConnector Started ServerConnector@274c3c6d{HTTP/1.1,[http/1.1]}{127.0.0.1:56645}
   [junit4]   2> 53376 INFO  (jetty-launcher-26-thread-9) [    ] o.e.j.s.Server Started @61375ms
   [junit4]   2> 53370 INFO  (jetty-launcher-26-thread-8) [    ] o.e.j.s.AbstractConnector Started ServerConnector@7136fd51{HTTP/1.1,[http/1.1]}{127.0.0.1:55631}
   [junit4]   2> 53384 INFO  (jetty-launcher-26-thread-8) [    ] o.e.j.s.Server Started @61382ms
   [junit4]   2> 53372 INFO  (jetty-launcher-26-thread-1) [    ] o.a.s.c.s.e.JettySolrRunner Jetty properties: {hostContext=/solr, hostPort=58070}
   [junit4]   2> 53372 INFO  (jetty-launcher-26-thread-7) [    ] o.a.s.c.s.e.JettySolrRunner Jetty properties: {hostContext=/solr, hostPort=57099}
   [junit4]   2> 53372 INFO  (jetty-launcher-26-thread-4) [    ] o.a.s.c.s.e.JettySolrRunner Jetty properties: {hostContext=/solr, hostPort=60879}
   [junit4]   2> 53373 INFO  (jetty-launcher-26-thread-5) [    ] o.a.s.c.s.e.JettySolrRunner Jetty properties: {hostContext=/solr, hostPort=32886}
   [junit4]   2> 53373 INFO  (jetty-launcher-26-thread-6) [    ] o.a.s.c.s.e.JettySolrRunner Jetty properties: {hostContext=/solr, hostPort=42348}
   [junit4]   2> 53373 INFO  (jetty-launcher-26-thread-10) [    ] o.a.s.c.s.e.JettySolrRunner Jetty properties: {hostContext=/solr, hostPort=33891}
   [junit4]   2> 53376 INFO  (jetty-launcher-26-thread-9) [    ] o.a.s.c.s.e.JettySolrRunner Jetty properties: {hostContext=/solr, hostPort=56645}
   [junit4]   2> 53384 INFO  (jetty-launcher-26-thread-8) [    ] o.a.s.c.s.e.JettySolrRunner Jetty properties: {hostContext=/solr, hostPort=55631}
   [junit4]   2> 53482 ERROR (jetty-launcher-26-thread-3) [    ] o.a.s.s.StartupLoggingUtils Missing Java Option solr.log.dir. Logging may be missing or incomplete.
   [junit4]   2> 53482 INFO  (jetty-launcher-26-thread-3) [    ] o.a.s.s.SolrDispatchFilter  ___      _       Welcome to Apache Solr™ version 7.0.0
   [junit4]   2> 53482 INFO  (jetty-launcher-26-thread-3) [    ] o.a.s.s.SolrDispatchFilter / __| ___| |_ _   Starting in cloud mode on port null
   [junit4]   2> 53483 INFO  (jetty-launcher-26-thread-3) [    ] o.a.s.s.SolrDispatchFilter \__ \/ _ \ | '_|  Install dir: null
   [junit4]   2> 53491 ERROR (jetty-launcher-26-thread-8) [    ] o.a.s.s.StartupLoggingUtils Missing Java Option solr.log.dir. Logging may be missing or incomplete.
   [junit4]   2> 53669 INFO  (jetty-launcher-26-thread-8) [    ] o.a.s.s.SolrDispatchFilter  ___      _       Welcome to Apache Solr™ version 7.0.0
   [junit4]   2> 53670 INFO  (jetty-launcher-26-thread-8) [    ] o.a.s.s.SolrDispatchFilter / __| ___| |_ _   Starting in cloud mode on port null
   [junit4]   2> 53670 INFO  (jetty-launcher-26-thread-8) [    ] o.a.s.s.SolrDispatchFilter \__ \/ _ \ | '_|  Install dir: null
   [junit4]   2> 53491 ERROR (jetty-launcher-26-thread-9) [    ] o.a.s.s.StartupLoggingUtils Missing Java Option solr.log.dir. Logging may be missing or incomplete.
   [junit4]   2> 53670 INFO  (jetty-launcher-26-thread-9) [    ] o.a.s.s.SolrDispatchFilter  ___      _       Welcome to Apache Solr™ version 7.0.0
   [junit4]   2> 53670 INFO  (jetty-launcher-26-thread-9) [    ] o.a.s.s.SolrDispatchFilter / __| ___| |_ _   Starting in cloud mode on port null
   [junit4]   2> 53670 INFO  (jetty-launcher-26-thread-9) [    ] o.a.s.s.SolrDispatchFilter \__ \/ _ \ | '_|  Install dir: null
   [junit4]   2> 53491 ERROR (jetty-launcher-26-thread-10) [    ] o.a.s.s.StartupLoggingUtils Missing Java Option solr.log.dir. Logging may be missing or incomplete.
   [junit4]   2> 53670 INFO  (jetty-launcher-26-thread-10) [    ] o.a.s.s.SolrDispatchFilter  ___      _       Welcome to Apache Solr™ version 7.0.0
   [junit4]   2> 53670 INFO  (jetty-launcher-26-thread-10) [    ] o.a.s.s.SolrDispatchFilter / __| ___| |_ _   Starting in cloud mode on port null
   [junit4]   2> 53670 INFO  (jetty-launcher-26-thread-10) [    ] o.a.s.s.SolrDispatchFilter \__ \/ _ \ | '_|  Install dir: null
   [junit4]   2> 53491 ERROR (jetty-launcher-26-thread-6) [    ] o.a.s.s.StartupLoggingUtils Missing Java Option solr.log.dir. Logging may be missing or incomplete.
   [junit4]   2> 53671 INFO  (jetty-launcher-26-thread-6) [    ] o.a.s.s.SolrDispatchFilter  ___      _       Welcome to Apache Solr™ version 7.0.0
   [junit4]   2> 53671 INFO  (jetty-launcher-26-thread-6) [    ] o.a.s.s.SolrDispatchFilter / __| ___| |_ _   Starting in cloud mode on port null
   [junit4]   2> 53671 INFO  (jetty-launcher-26-thread-6) [    ] o.a.s.s.SolrDispatchFilter \__ \/ _ \ | '_|  Install dir: null
   [junit4]   2> 53492 ERROR (jetty-launcher-26-thread-5) [    ] o.a.s.s.StartupLoggingUtils Missing Java Option solr.log.dir. Logging may be missing or incomplete.
   [junit4]   2> 53671 INFO  (jetty-launcher-26-thread-5) [    ] o.a.s.s.SolrDispatchFilter  ___      _       Welcome to Apache Solr™ version 7.0.0
   [junit4]   2> 53671 INFO  (jetty-launcher-26-thread-5) [    ] o.a.s.s.SolrDispatchFilter / __| ___| |_ _   Starting in cloud mode on port null
   [junit4]   2> 53671 INFO  (jetty-launcher-26-thread-5) [    ] o.a.s.s.SolrDispatchFilter \__ \/ _ \ | '_|  Install dir: null
   [junit4]   2> 53492 ERROR (jetty-launcher-26-thread-4) [    ] o.a.s.s.StartupLoggingUtils Missing Java Option solr.log.dir. Logging may be missing or incomplete.
   [junit4]   2> 53672 INFO  (jetty-launcher-26-thread-4) [    ] o.a.s.s.SolrDispatchFilter  ___      _       Welcome to Apache Solr™ version 7.0.0
   [junit4]   2> 53672 INFO  (jetty-launcher-26-thread-4) [    ] o.a.s.s.SolrDispatchFilter / __| ___| |_ _   Starting in cloud mode on port null
   [junit4]   2> 53672 INFO  (jetty-launcher-26-thread-4) [    ] o.a.s.s.SolrDispatchFilter \__ \/ _ \ | '_|  Install dir: null
   [junit4]   2> 53492 ERROR (jetty-launcher-26-thread-7) [    ] o.a.s.s.StartupLoggingUtils Missing Java Option solr.log.dir. Logging may be missing or incomplete.
   [junit4]   2> 53672 INFO  (jetty-launcher-26-thread-7) [    ] o.a.s.s.SolrDispatchFilter  ___      _       Welcome to Apache Solr™ version 7.0.0
   [junit4]   2> 53672 INFO  (jetty-launcher-26-thread-7) [    ] o.a.s.s.SolrDispatchFilter / __| ___| |_ _   Starting in cloud mode on port null
   [junit4]   2> 53672 INFO  (jetty-launcher-26-thread-7) [    ] o.a.s.s.SolrDispatchFilter \__ \/ _ \ | '_|  Install dir: null
   [junit4]   2> 53492 ERROR (jetty-launcher-26-thread-1) [    ] o.a.s.s.StartupLoggingUtils Missing Java Option solr.log.dir. Logging may be missing or incomplete.
   [junit4]   2> 53672 INFO  (jetty-launcher-26-thread-1) [    ] o.a.s.s.SolrDispatchFilter  ___      _       Welcome to Apache Solr™ version 7.0.0
   [junit4]   2> 53673 INFO  (jetty-launcher-26-thread-1) [    ] o.a.s.s.SolrDispatchFilter / __| ___| |_ _   Starting in cloud mode on port null
   [junit4]   2> 53673 INFO  (jetty-launcher-26-thread-1) [    ] o.a.s.s.SolrDispatchFilter \__ \/ _ \ | '_|  Install dir: null
   [junit4]   2> 53691 ERROR (jetty-launcher-26-thread-2) [    ] o.a.s.s.StartupLoggingUtils Missing Java Option solr.log.dir. Logging may be missing or incomplete.
   [junit4]   2> 53691 INFO  (jetty-launcher-26-thread-2) [    ] o.a.s.s.SolrDispatchFilter  ___      _       Welcome to Apache Solr™ version 7.0.0
   [junit4]   2> 53691 INFO  (jetty-launcher-26-thread-2) [    ] o.a.s.s.SolrDispatchFilter / __| ___| |_ _   Starting in cloud mode on port null
   [junit4]   2> 53691 INFO  (jetty-launcher-26-thread-2) [    ] o.a.s.s.SolrDispatchFilter \__ \/ _ \ | '_|  Install dir: null
   [junit4]   2> 53721 INFO  (jetty-launcher-26-thread-2) [    ] o.a.s.s.SolrDispatchFilter |___/\___/_|_|    Start time: 2017-04-18T01:50:03.776Z
   [junit4]   2> 53723 INFO  (jetty-launcher-26-thread-6) [    ] o.a.s.s.SolrDispatchFilter |___/\___/_|_|    Start time: 2017-04-18T01:50:03.754Z
   [junit4]   2> 53723 INFO  (jetty-launcher-26-thread-3) [    ] o.a.s.s.SolrDispatchFilter |___/\___/_|_|    Start time: 2017-04-18T01:50:03.568Z
   [junit4]   2> 53728 INFO  (jetty-launcher-26-thread-5) [    ] o.a.s.s.SolrDispatchFilter |___/\___/_|_|    Start time: 2017-04-18T01:50:03.754Z
   [junit4]   2> 53732 INFO  (jetty-launcher-26-thread-4) [    ] o.a.s.s.SolrDispatchFilter |___/\___/_|_|    Start time: 2017-04-18T01:50:03.755Z
   [junit4]   2> 53732 INFO  (jetty-launcher-26-thread-9) [    ] o.a.s.s.SolrDispatchFilter |___/\___/_|_|    Start time: 2017-04-18T01:50:03.753Z
   [junit4]   2> 53732 INFO  (jetty-launcher-26-thread-10) [    ] o.a.s.s.SolrDispatchFilter |___/\___/_|_|    Start time: 2017-04-18T01:50:03.753Z
   [junit4]   2> 53733 INFO  (jetty-launcher-26-thread-7) [    ] o.a.s.s.SolrDispatchFilter |___/\___/_|_|    Start time: 2017-04-18T01:50:03.755Z
   [junit4]   2> 53734 INFO  (jetty-launcher-26-thread-1) [    ] o.a.s.s.SolrDispatchFilter |___/\___/_|_|    Start time: 2017-04-18T01:50:03.756Z
   [junit4]   2> 53734 INFO  (jetty-launcher-26-thread-8) [    ] o.a.s.s.SolrDispatchFilter |___/\___/_|_|    Start time: 2017-04-18T01:50:03.753Z
   [junit4]   2> 53736 INFO  (jetty-launcher-26-thread-2) [    ] o.a.s.c.SolrResourceLoader solr home defaulted to 'solr/' (could not find system property or JNDI)
   [junit4]   2> 54284 INFO  (jetty-launcher-26-thread-1) [    ] o.a.s.s.SolrDispatchFilter solr.xml found in ZooKeeper. Loading...
   [junit4]   2> 54284 INFO  (jetty-launcher-26-thread-4) [    ] o.a.s.s.SolrDispatchFilter solr.xml found in ZooKeeper. Loading...
   [junit4]   2> 54284 INFO  (jetty-launcher-26-thread-7) [    ] o.a.s.s.SolrDispatchFilter solr.xml found in ZooKeeper. Loading...
   [junit4]   2> 54287 INFO  (jetty-launcher-26-thread-5) [    ] o.a.s.s.SolrDispatchFilter solr.xml found in ZooKeeper. Loading...
   [junit4]   2> 54292 INFO  (jetty-launcher-26-thread-6) [    ] o.a.s.s.SolrDispatchFilter solr.xml found in ZooKeeper. Loading...
   [junit4]   2> 54362 INFO  (jetty-launcher-26-thread-10) [    ] o.a.s.s.SolrDispatchFilter solr.xml found in ZooKeeper. Loading...
   [junit4]   2> 54363 INFO  (jetty-launcher-26-thread-9) [    ] o.a.s.s.SolrDispatchFilter solr.xml found in ZooKeeper. Loading...
   [junit4]   2> 54397 INFO  (jetty-launcher-26-thread-3) [    ] o.a.s.s.SolrDispatchFilter solr.xml found in ZooKeeper. Loading...
   [junit4]   2> 54409 WARN  (NIOServerCxn.Factory:0.0.0.0/0.0.0.0:0) [    ] o.a.z.s.NIOServerCnxn caught end of stream exception
   [junit4]   2> EndOfStreamException: Unable to read additional data from client sessionid 0x15b7ec092cb0009, likely client has closed socket
   [junit4]   2> 	at org.apache.zookeeper.server.NIOServerCnxn.doIO(NIOServerCnxn.java:228)
   [junit4]   2> 	at org.apache.zookeeper.server.NIOServerCnxnFactory.run(NIOServerCnxnFactory.java:208)
   [junit4]   2> 	at java.lang.Thread.run(Thread.java:745)
   [junit4]   2> 54410 WARN  (NIOServerCxn.Factory:0.0.0.0/0.0.0.0:0) [    ] o.a.z.s.NIOServerCnxn caught end of stream exception
   [junit4]   2> EndOfStreamException: Unable to read additional data from client sessionid 0x15b7ec092cb0003, likely client has closed socket
   [junit4]   2> 	at org.apache.zookeeper.server.NIOServerCnxn.doIO(NIOServerCnxn.java:228)
   [junit4]   2> 	at org.apache.zookeeper.server.NIOServerCnxnFactory.run(NIOServerCnxnFactory.java:208)
   [junit4]   2> 	at java.lang.Thread.run(Thread.java:745)
   [junit4]   2> 54410 WARN  (NIOServerCxn.Factory:0.0.0.0/0.0.0.0:0) [    ] o.a.z.s.NIOServerCnxn caught end of stream exception
   [junit4]   2> EndOfStreamException: Unable to read additional data from client sessionid 0x15b7ec092cb0004, likely client has closed socket
   [junit4]   2> 	at org.apache.zookeeper.server.NIOServerCnxn.doIO(NIOServerCnxn.java:228)
   [junit4]   2> 	at org.apache.zookeeper.server.NIOServerCnxnFactory.run(NIOServerCnxnFactory.java:208)
   [junit4]   2> 	at java.lang.Thread.run(Thread.java:745)
   [junit4]   2> 54410 WARN  (NIOServerCxn.Factory:0.0.0.0/0.0.0.0:0) [    ] o.a.z.s.NIOServerCnxn caught end of stream exception
   [junit4]   2> EndOfStreamException: Unable to read additional data from client sessionid 0x15b7ec092cb0007, likely client has closed socket
   [junit4]   2> 	at org.apache.zookeeper.server.NIOServerCnxn.doIO(NIOServerCnxn.java:228)
   [junit4]   2> 	at org.apache.zookeeper.server.NIOServerCnxnFactory.run(NIOServerCnxnFactory.java:208)
   [junit4]   2> 	at java.lang.Thread.run(Thread.java:745)
   [junit4]   2> 54411 WARN  (NIOServerCxn.Factory:0.0.0.0/0.0.0.0:0) [    ] o.a.z.s.NIOServerCnxn caught end of stream exception
   [junit4]   2> EndOfStreamException: Unable to read additional data from client sessionid 0x15b7ec092cb000a, likely client has closed socket
   [junit4]   2> 	at org.apache.zookeeper.server.NIOServerCnxn.doIO(NIOServerCnxn.java:228)
   [junit4]   2> 	at org.apache.zookeeper.server.NIOServerCnxnFactory.run(NIOServerCnxnFactory.java:208)
   [junit4]   2> 	at java.lang.Thread.run(Thread.java:745)
   [junit4]   2> 54411 WARN  (NIOServerCxn.Factory:0.0.0.0/0.0.0.0:0) [    ] o.a.z.s.NIOServerCnxn caught end of stream exception
   [junit4]   2> EndOfStreamException: Unable to read additional data from client sessionid 0x15b7ec092cb0005, likely client has closed socket
   [junit4]   2> 	at org.apache.zookeeper.server.NIOServerCnxn.doIO(NIOServerCnxn.java:228)
   [junit4]   2> 	at org.apache.zookeeper.server.NIOServerCnxnFactory.run(NIOServerCnxnFactory.java:208)
   [junit4]   2> 	at java.lang.Thread.run(Thread.java:745)
   [junit4]   2> 54411 WARN  (NIOServerCxn.Factory:0.0.0.0/0.0.0.0:0) [    ] o.a.z.s.NIOServerCnxn caught end of stream exception
   [junit4]   2> EndOfStreamException: Unable to read additional data from client sessionid 0x15b7ec092cb0001, likely client has closed socket
   [junit4]   2> 	at org.apache.zookeeper.server.NIOServerCnxn.doIO(NIOServerCnxn.java:228)
   [junit4]   2> 	at org.apache.zookeeper.server.NIOServerCnxnFactory.run(NIOServerCnxnFactory.java:208)
   [junit4]   2> 	at java.lang.Thread.run(Thread.java:745)
   [junit4]   2> 54458 INFO  (jetty-launcher-26-thread-2) [    ] o.a.s.s.SolrDispatchFilter solr.xml found in ZooKeeper. Loading...
   [junit4]   2> 54458 INFO  (jetty-launcher-26-thread-8) [    ] o.a.s.s.SolrDispatchFilter solr.xml found in ZooKeeper. Loading...
   [junit4]   2> 54636 INFO  (jetty-launcher-26-thread-10) [    ] o.a.s.c.ZkContainer Zookeeper client=127.0.0.1:46794/solr
   [junit4]   2> 54660 INFO  (jetty-launcher-26-thread-6) [    ] o.a.s.c.ZkContainer Zookeeper client=127.0.0.1:46794/solr
   [junit4]   2> 54907 INFO  (jetty-launcher-26-thread-8) [    ] o.a.s.c.ZkContainer Zookeeper client=127.0.0.1:46794/solr
   [junit4]   2> 54961 INFO  (jetty-launcher-26-thread-2) [    ] o.a.s.c.ZkContainer Zookeeper client=127.0.0.1:46794/solr
   [junit4]   2> 55070 INFO  (jetty-launcher-26-thread-5) [    ] o.a.s.c.ZkContainer Zookeeper client=127.0.0.1:46794/solr
   [junit4]   2> 55145 INFO  (jetty-launcher-26-thread-3) [    ] o.a.s.c.ZkContainer Zookeeper client=127.0.0.1:46794/solr
   [junit4]   2> 55191 INFO  (jetty-launcher-26-thread-1) [    ] o.a.s.c.ZkContainer Zookeeper client=127.0.0.1:46794/solr
   [junit4]   2> 55232 INFO  (jetty-launcher-26-thread-9) [    ] o.a.s.c.ZkContainer Zookeeper client=127.0.0.1:46794/solr
   [junit4]   2> 55250 INFO  (jetty-launcher-26-thread-7) [    ] o.a.s.c.ZkContainer Zookeeper client=127.0.0.1:46794/solr
   [junit4]   2> 55197 WARN  (NIOServerCxn.Factory:0.0.0.0/0.0.0.0:0) [    ] o.a.z.s.NIOServerCnxn caught end of stream exception
   [junit4]   2> EndOfStreamException: Unable to read additional data from client sessionid 0x15b7ec092cb000d, likely client has closed socket
   [junit4]   2> 	at org.apache.zookeeper.server.NIOServerCnxn.doIO(NIOServerCnxn.java:228)
   [junit4]   2> 	at org.apache.zookeeper.server.NIOServerCnxnFactory.run(NIOServerCnxnFactory.java:208)
   [junit4]   2> 	at java.lang.Thread.run(Thread.java:745)
   [junit4]   2> 54961 INFO  (jetty-launcher-26-thread-4) [    ] o.a.s.c.ZkContainer Zookeeper client=127.0.0.1:46794/solr
   [junit4]   2> 55354 WARN  (NIOServerCxn.Factory:0.0.0.0/0.0.0.0:0) [    ] o.a.z.s.NIOServerCnxn caught end of stream exception
   [junit4]   2> EndOfStreamException: Unable to read additional data from client sessionid 0x15b7ec092cb000c, likely client has closed socket
   [junit4]   2> 	at org.apache.zookeeper.server.NIOServerCnxn.doIO(NIOServerCnxn.java:228)
   [junit4]   2> 	at org.apache.zookeeper.server.NIOServerCnxnFactory.run(NIOServerCnxnFactory.java:208)
   [junit4]   2> 	at java.lang.Thread.run(Thread.java:745)
   [junit4]   2> 55355 WARN  (NIOServerCxn.Factory:0.0.0.0/0.0.0.0:0) [    ] o.a.z.s.NIOServerCnxn caught end of stream exception
   [junit4]   2> EndOfStreamException: Unable to read additional data from client sessionid 0x15b7ec092cb000f, likely client has closed socket
   [junit4]   2> 	at org.apache.zookeeper.server.NIOServerCnxn.doIO(NIOServerCnxn.java:228)
   [junit4]   2> 	at org.apache.zookeeper.server.NIOServerCnxnFactory.run(NIOServerCnxnFactory.java:208)
   [junit4]   2> 	at java.lang.Thread.run(Thread.java:745)
   [junit4]   2> 55734 WARN  (NIOServerCxn.Factory:0.0.0.0/0.0.0.0:0) [    ] o.a.z.s.NIOServerCnxn caught end of stream exception
   [junit4]   2> EndOfStreamException: Unable to read additional data from client sessionid 0x15b7ec092cb0010, likely client has closed socket
   [junit4]   2> 	at org.apache.zookeeper.server.NIOServerCnxn.doIO(NIOServerCnxn.java:228)
   [junit4]   2> 	at org.apache.zookeeper.server.NIOServerCnxnFactory.run(NIOServerCnxnFactory.java:208)
   [junit4]   2> 	at java.lang.Thread.run(Thread.java:745)
   [junit4]   2> 55782 WARN  (NIOServerCxn.Factory:0.0.0.0/0.0.0.0:0) [    ] o.a.z.s.NIOServerCnxn caught end of stream exception
   [junit4]   2> EndOfStreamException: Unable to read additional data from client sessionid 0x15b7ec092cb0016, likely client has closed socket
   [junit4]   2> 	at org.apache.zookeeper.server.NIOServerCnxn.doIO(NIOServerCnxn.java:228)
   [junit4]   2> 	at org.apache.zookeeper.server.NIOServerCnxnFactory.run(NIOServerCnxnFactory.java:208)
   [junit4]   2> 	at java.lang.Thread.run(Thread.java:745)
   [junit4]   2> 55790 INFO  (jetty-launcher-26-thread-8) [n:127.0.0.1:55631_solr    ] o.a.s.c.Overseer Overseer (id=null) closing
   [junit4]   2> 55791 INFO  (jetty-launcher-26-thread-2) [n:127.0.0.1:59189_solr    ] o.a.s.c.Overseer Overseer (id=null) closing
   [junit4]   2> 55792 INFO  (jetty-launcher-26-thread-10) [n:127.0.0.1:33891_solr    ] o.a.s.c.Overseer Overseer (id=null) closing
   [junit4]   2> 55794 INFO  (jetty-launcher-26-thread-8) [n:127.0.0.1:55631_solr    ] o.a.s.c.OverseerElectionContext I am going to be the leader 127.0.0.1:55631_solr
   [junit4]   2> 55799 INFO  (jetty-launcher-26-thread-2) [n:127.0.0.1:59189_solr    ] o.a.s.c.ZkController Register node as live in ZooKeeper:/live_nodes/127.0.0.1:59189_solr
   [junit4]   2> 55800 INFO  (jetty-launcher-26-thread-10) [n:127.0.0.1:33891_solr    ] o.a.s.c.ZkController Register node as live in ZooKeeper:/live_nodes/127.0.0.1:33891_solr
   [junit4]   2> 55804 INFO  (jetty-launcher-26-thread-1) [n:127.0.0.1:58070_solr    ] o.a.s.c.c.ZkStateReader Updated live nodes from ZooKeeper... (0) -> (1)
   [junit4]   2> 55808 INFO  (jetty-launcher-26-thread-1) [n:127.0.0.1:58070_solr    ] o.a.s.c.Overseer Overseer (id=null) closing
   [junit4]   2> 55824 INFO  (zkCallback-68-thread-1-processing-n:127.0.0.1:59189_solr) [n:127.0.0.1:59189_solr    ] o.a.s.c.c.ZkStateReader Updated live nodes from ZooKeeper... (0) -> (2)
   [junit4]   2> 55884 INFO  (zkCallback-65-thread-1-processing-n:127.0.0.1:33891_solr) [n:127.0.0.1:33891_solr    ] o.a.s.c.c.ZkStateReader Updated live nodes from ZooKeeper... (0) -> (2)
   [junit4]   2> 55902 INFO  (jetty-launcher-26-thread-6) [n:127.0.0.1:42348_solr    ] o.a.s.c.c.ZkStateReader Updated live nodes from ZooKeeper... (0) -> (2)
   [junit4]   2> 55905 INFO  (jetty-launcher-26-thread-6) [n:127.0.0.1:42348_solr    ] o.a.s.c.Overseer Overseer (id=null) closing
   [junit4]   2> 55923 INFO  (jetty-launcher-26-thread-1) [n:127.0.0.1:58070_solr    ] o.a.s.c.ZkController Register node as live in ZooKeeper:/live_nodes/127.0.0.1:58070_solr
   [junit4]   2> 55924 INFO  (jetty-launcher-26-thread-8) [n:127.0.0.1:55631_solr    ] o.a.s.c.Overseer Overseer (id=97811182480195604-127.0.0.1:55631_solr-n_0000000000) starting
   [junit4]   2> 55935 INFO  (zkCallback-68-thread-1-processing-n:127.0.0.1:59189_solr) [n:127.0.0.1:59189_solr    ] o.a.s.c.c.ZkStateReader Updated live nodes from ZooKeeper... (2) -> (3)
   [junit4]   2> 55941 INFO  (zkCallback-65-thread-1-processing-n:127.0.0.1:33891_solr) [n:127.0.0.1:33891_solr    ] o.a.s.c.c.ZkStateReader Updated live nodes from ZooKeeper... (2) -> (3)
   [junit4]   2> 55946 INFO  (jetty-launcher-26-thread-6) [n:127.0.0.1:42348_solr    ] o.a.s.c.ZkController Register node as live in ZooKeeper:/live_nodes/127.0.0.1:42348_solr
   [junit4]   2> 55960 INFO  (zkCallback-68-thread-1-processing-n:127.0.0.1:59189_solr) [n:127.0.0.1:59189_solr    ] o.a.s.c.c.ZkStateReader Updated live nodes from ZooKeeper... (3) -> (4)
   [junit4]   2> 55961 INFO  (zkCallback-65-thread-1-processing-n:127.0.0.1:33891_solr) [n:127.0.0.1:33891_solr    ] o.a.s.c.c.ZkStateReader Updated live nodes from ZooKeeper... (3) -> (4)
   [junit4]   2> 55970 INFO  (jetty-launcher-26-thread-5) [n:127.0.0.1:32886_solr    ] o.a.s.c.c.ZkStateReader Updated live nodes from ZooKeeper... (0) -> (4)
   [junit4]   2> 55973 INFO  (jetty-launcher-26-thread-3) [n:127.0.0.1:59203_solr    ] o.a.s.c.c.ZkStateReader Updated live nodes from ZooKeeper... (0) -> (4)
   [junit4]   2> 55994 INFO  (zkCallback-75-thread-1-processing-n:127.0.0.1:58070_solr) [n:127.0.0.1:58070_solr    ] o.a.s.c.c.ZkStateReader Updated live nodes from ZooKeeper... (1) -> (4)
   [junit4]   2> 55994 INFO  (zkCallback-67-thread-1-processing-n:127.0.0.1:55631_solr) [n:127.0.0.1:55631_solr    ] o.a.s.c.c.ZkStateReader Updated live nodes from ZooKeeper... (0) -> (2)
   [junit4]   2> 55994 INFO  (zkCallback-72-thread-1-processing-n:127.0.0.1:42348_solr) [n:127.0.0.1:42348_solr    ] o.a.s.c.c.ZkStateReader Updated live nodes from ZooKeeper... (2) -> (3)
   [junit4]   2> 56010 INFO  (zkCallback-67-thread-2-processing-n:127.0.0.1:55631_solr) [n:127.0.0.1:55631_solr    ] o.a.s.c.c.ZkStateReader Updated live nodes from ZooKeeper... (2) -> (4)
   [junit4]   2> 56012 INFO  (jetty-launcher-26-thread-5) [n:127.0.0.1:32886_solr    ] o.a.s.c.Overseer Overseer (id=null) closing
   [junit4]   2> 56013 INFO  (jetty-launcher-26-thread-9) [n:127.0.0.1:56645_solr    ] o.a.s.c.c.ZkStateReader Updated live nodes from ZooKeeper... (0) -> (4)
   [junit4]   2> 56017 INFO  (jetty-launcher-26-thread-3) [n:127.0.0.1:59203_solr    ] o.a.s.c.Overseer Overseer (id=null) closing
   [junit4]   2> 56130 INFO  (jetty-launcher-26-thread-5) [n:127.0.0.1:32886_solr    ] o.a.s.c.ZkController Register node as live in ZooKeeper:/live_nodes/127.0.0.1:32886_solr
   [junit4]   2> 56133 INFO  (jetty-launcher-26-thread-3) [n:127.0.0.1:59203_solr    ] o.a.s.c.ZkController Register node as live in ZooKeeper:/live_nodes/127.0.0.1:59203_solr
   [junit4]   2> 56135 INFO  (jetty-launcher-26-thread-9) [n:127.0.0.1:56645_solr    ] o.a.s.c.Overseer Overseer (id=null) closing
   [junit4]   2> 56135 INFO  (zkCallback-68-thread-1-processing-n:127.0.0.1:59189_solr) [n:127.0.0.1:59189_solr    ] o.a.s.c.c.ZkStateReader Updated live nodes from ZooKeeper... (4) -> (5)
   [junit4]   2> 56135 INFO  (zkCallback-65-thread-1-processing-n:127.0.0.1:33891_solr) [n:127.0.0.1:33891_solr    ] o.a.s.c.c.ZkStateReader Updated live nodes from ZooKeeper... (4) -> (5)
   [junit4]   2> 56144 INFO  (zkCallback-72-thread-2-processing-n:127.0.0.1:42348_solr) [n:127.0.0.1:42348_solr    ] o.a.s.c.c.ZkStateReader Updated live nodes from ZooKeeper... (3) -> (5)
   [junit4]   2> 56147 INFO  (zkCallback-68-thread-1-processing-n:127.0.0.1:59189_solr) [n:127.0.0.1:59189_solr    ] o.a.s.c.c.ZkStateReader Updated live nodes from ZooKeeper... (5) -> (6)
   [junit4]   2> 56147 INFO  (zkCallback-65-thread-1-processing-n:127.0.0.1:33891_solr) [n:127.0.0.1:33891_solr    ] o.a.s.c.c.ZkStateReader Updated live nodes from ZooKeeper... (5) -> (6)
   [junit4]   2> 56152 INFO  (jetty-launcher-26-thread-7) [n:127.0.0.1:57099_solr    ] o.a.s.c.c.ZkStateReader Updated live nodes from ZooKeeper... (0) -> (6)
   [junit4]   2> 56156 INFO  (jetty-launcher-26-thread-9) [n:127.0.0.1:56645_solr    ] o.a.s.c.ZkController Register node as live in ZooKeeper:/live_nodes/127.0.0.1:56645_solr
   [junit4]   2> 56159 INFO  (zkCallback-65-thread-1-processing-n:127.0.0.1:33891_solr) [n:127.0.0.1:33891_solr    ] o.a.s.c.c.ZkStateReader Updated live nodes from ZooKeeper... (6) -> (7)
   [junit4]   2> 56159 INFO  (zkCallback-68-thread-1-processing-n:127.0.0.1:59189_solr) [n:127.0.0.1:59189_solr    ] o.a.s.c.c.ZkStateReader Updated live nodes from ZooKeeper... (6) -> (7)
   [junit4]   2> 56161 INFO  (jetty-launcher-26-thread-7) [n:127.0.0.1:57099_solr    ] o.a.s.c.Overseer Overseer (id=null) closing
   [junit4]   2> 56165 INFO  (jetty-launcher-26-thread-7) [n:127.0.0.1:57099_solr    ] o.a.s.c.ZkController Register node as live in ZooKeeper:/live_nodes/127.0.0.1:57099_solr
   [junit4]   2> 56167 INFO  (zkCallback-65-thread-1-processing-n:127.0.0.1:33891_solr) [n:127.0.0.1:33891_solr    ] o.a.s.c.c.ZkStateReader Updated live nodes from ZooKeeper... (7) -> (8)
   [junit4]   2> 56167 INFO  (zkCallback-68-thread-1-processing-n:127.0.0.1:59189_solr) [n:127.0.0.1:59189_solr    ] o.a.s.c.c.ZkStateReader Updated live nodes from ZooKeeper... (7) -> (8)
   [junit4]   2> 56661 INFO  (zkCallback-72-thread-2-processing-n:127.0.0.1:42348_solr) [n:127.0.0.1:42348_solr    ] o.a.s.c.c.ZkStateReader Updated live nodes from ZooKeeper... (5) -> (8)
   [junit4]   2> 56680 INFO  (zkCallback-75-thread-2-processing-n:127.0.0.1:58070_solr) [n:127.0.0.1:58070_solr    ] o.a.s.c.c.ZkStateReader Updated live nodes from ZooKeeper... (4) -> (8)
   [junit4]   2> 56681 INFO  (zkCallback-67-thread-2-processing-n:127.0.0.1:55631_solr) [n:127.0.0.1:55631_solr    ] o.a.s.c.c.ZkStateReader Updated live nodes from ZooKeeper... (4) -> (8)
   [junit4]   2> 56696 INFO  (zkCallback-76-thread-1-processing-n:127.0.0.1:56645_solr) [n:127.0.0.1:56645_solr    ] o.a.s.c.c.ZkStateReader Updated live nodes from ZooKeeper... (4) -> (8)
   [junit4]   2> 56697 INFO  (zkCallback-73-thread-1-processing-n:127.0.0.1:32886_solr) [n:127.0.0.1:32886_solr    ] o.a.s.c.c.ZkStateReader Updated live nodes from ZooKeeper... (4) -> (8)
   [junit4]   2> 56697 INFO  (zkCallback-80-thread-1-processing-n:127.0.0.1:59203_solr) [n:127.0.0.1:59203_solr    ] o.a.s.c.c.ZkStateReader Updated live nodes from ZooKeeper... (4) -> (8)
   [junit4]   2> 56697 INFO  (zkCallback-81-thread-1-processing-n:127.0.0.1:57099_solr) [n:127.0.0.1:57099_solr    ] o.a.s.c.c.ZkStateReader Updated live nodes from ZooKeeper... (6) -> (8)
   [junit4]   2> 56705 INFO  (jetty-launcher-26-thread-4) [n:127.0.0.1:60879_solr    ] o.a.s.c.c.ZkStateReader Updated live nodes from ZooKeeper... (0) -> (8)
   [junit4]   2> 56713 INFO  (jetty-launcher-26-thread-4) [n:127.0.0.1:60879_solr    ] o.a.s.c.Overseer Overseer (id=null) closing
   [junit4]   2> 56716 INFO  (jetty-launcher-26-thread-4) [n:127.0.0.1:60879_solr    ] o.a.s.c.ZkController Register node as live in ZooKeeper:/live_nodes/127.0.0.1:60879_solr
   [junit4]   2> 56720 INFO  (zkCallback-67-thread-2-processing-n:127.0.0.1:55631_solr) [n:127.0.0.1:55631_solr    ] o.a.s.c.c.ZkStateReader Updated live nodes from ZooKeeper... (8) -> (9)
   [junit4]   2> 56720 INFO  (zkCallback-81-thread-1-processing-n:127.0.0.1:57099_solr) [n:127.0.0.1:57099_solr    ] o.a.s.c.c.ZkStateReader Updated live nodes from ZooKeeper... (8) -> (9)
   [junit4]   2> 56721 INFO  (zkCallback-65-thread-1-processing-n:127.0.0.1:33891_solr) [n:127.0.0.1:33891_solr    ] o.a.s.c.c.ZkStateReader Updated live nodes from ZooKeeper... (8) -> (9)
   [junit4]   2> 56728 INFO  (zkCallback-72-thread-2-processing-n:127.0.0.1:42348_solr) [n:127.0.0.1:42348_solr    ] o.a.s.c.c.ZkStateReader Updated live nodes from ZooKeeper... (8) -> (9)
   [junit4]   2> 56729 INFO  (zkCallback-73-thread-1-processing-n:127.0.0.1:32886_solr) [n:127.0.0.1:32886_solr    ] o.a.s.c.c.ZkStateReader Updated live nodes from ZooKeeper... (8) -> (9)
   [junit4]   2> 56729 INFO  (zkCallback-75-thread-2-processing-n:127.0.0.1:58070_solr) [n:127.0.0.1:58070_solr    ] o.a.s.c.c.ZkStateReader Updated live nodes from ZooKeeper... (8) -> (9)
   [junit4]   2> 56729 INFO  (zkCallback-68-thread-1-processing-n:127.0.0.1:59189_solr) [n:127.0.0.1:59189_solr    ] o.a.s.c.c.ZkStateReader Updated live nodes from ZooKeeper... (8) -> (9)
   [junit4]   2> 56730 INFO  (zkCallback-80-thread-1-processing-n:127.0.0.1:59203_solr) [n:127.0.0.1:59203_solr    ] o.a.s.c.c.ZkStateReader Updated live nodes from ZooKeeper... (8) -> (9)
   [junit4]   2> 56730 INFO  (zkCallback-76-thread-1-processing-n:127.0.0.1:56645_solr) [n:127.0.0.1:56645_solr    ] o.a.s.c.c.ZkStateReader Updated live nodes from ZooKeeper... (8) -> (9)
   [junit4]   2> 56770 INFO  (zkCallback-86-thread-1-processing-n:127.0.0.1:60879_solr) [n:127.0.0.1:60879_solr    ] o.a.s.c.c.ZkStateReader Updated live nodes from ZooKeeper... (8) -> (9)
   [junit4]   2> 57514 INFO  (jetty-launcher-26-thread-8) [n:127.0.0.1:55631_solr    ] o.a.s.c.ZkController Register node as live in ZooKeeper:/live_nodes/127.0.0.1:55631_solr
   [junit4]   2> 57518 INFO  (zkCallback-65-thread-1-processing-n:127.0.0.1:33891_solr) [n:127.0.0.1:33891_solr    ] o.a.s.c.c.ZkStateReader Updated live nodes from ZooKeeper... (9) -> (10)
   [junit4]   2> 57518 INFO  (zkCallback-73-thread-1-processing-n:127.0.0.1:32886_solr) [n:127.0.0.1:32886_solr    ] o.a.s.c.c.ZkStateReader Updated live nodes from ZooKeeper... (9) -> (10)
   [junit4]   2> 57518 INFO  (zkCallback-81-thread-1-processing-n:127.0.0.1:57099_solr) [n:127.0.0.1:57099_solr    ] o.a.s.c.c.ZkStateReader Updated live nodes from ZooKeeper... (9) -> (10)
   [junit4]   2> 57519 INFO  (zkCallback-80-thread-1-processing-n:127.0.0.1:59203_solr) [n:127.0.0.1:59203_solr    ] o.a.s.c.c.ZkStateReader Updated live nodes from ZooKeeper... (9) -> (10)
   [junit4]   2> 57519 INFO  (zkCallback-75-thread-2-processing-n:127.0.0.1:58070_solr) [n:127.0.0.1:58070_solr    ] o.a.s.c.c.ZkStateReader Updated live nodes from ZooKeeper... (9) -> (10)
   [junit4]   2> 57520 INFO  (zkCallback-68-thread-1-processing-n:127.0.0.1:59189_solr) [n:127.0.0.1:59189_solr    ] o.a.s.c.c.ZkStateReader Updated live nodes from ZooKeeper... (9) -> (10)
   [junit4]   2> 57520 INFO  (zkCallback-67-thread-2-processing-n:127.0.0.1:55631_solr) [n:127.0.0.1:55631_solr    ] o.a.s.c.c.ZkStateReader Updated live nodes from ZooKeeper... (9) -> (10)
   [junit4]   2> 57520 INFO  (zkCallback-72-thread-2-processing-n:127.0.0.1:42348_solr) [n:127.0.0.1:42348_solr    ] o.a.s.c.c.ZkStateReader Updated live nodes from ZooKeeper... (9) -> (10)
   [junit4]   2> 57528 INFO  (zkCallback-76-thread-1-processing-n:127.0.0.1:56645_solr) [n:127.0.0.1:56645_solr    ] o.a.s.c.c.ZkStateReader Updated live nodes from ZooKeeper... (9) -> (10)
   [junit4]   2> 57528 INFO  (zkCallback-86-thread-1-processing-n:127.0.0.1:60879_solr) [n:127.0.0.1:60879_solr    ] o.a.s.c.c.ZkStateReader Updated live nodes from ZooKeeper... (9) -> (10)
   [junit4]   2> 60415 INFO  (jetty-launcher-26-thread-4) [n:127.0.0.1:60879_solr    ] o.a.s.m.r.SolrJmxReporter JMX monitoring for 'solr_60879.solr.node' (registry 'solr.node') enabled at server: com.sun.jmx.mbeanserver.JmxMBeanServer@1a33166
   [junit4]   2> 60417 INFO  (jetty-launcher-26-thread-4) [n:127.0.0.1:60879_solr    ] o.a.s.m.r.SolrJmxReporter JMX monitoring for 'solr_60879.solr.jvm' (registry 'solr.jvm') enabled at server: com.sun.jmx.mbeanserver.JmxMBeanServer@1a33166
   [junit4]   2> 60417 INFO  (jetty-launcher-26-thread-4) [n:127.0.0.1:60879_solr    ] o.a.s.m.r.SolrJmxReporter JMX monitoring for 'solr_60879.solr.jetty' (registry 'solr.jetty') enabled at server: com.sun.jmx.mbeanserver.JmxMBeanServer@1a33166
   [junit4]   2> 60457 INFO  (jetty-launcher-26-thread-10) [n:127.0.0.1:33891_solr    ] o.a.s.m.r.SolrJmxReporter JMX monitoring for 'solr_33891.solr.node' (registry 'solr.node') enabled at server: com.sun.jmx.mbeanserver.JmxMBeanServer@1a33166
   [junit4]   2> 60457 INFO  (jetty-launcher-26-thread-10) [n:127.0.0.1:33891_solr    ] o.a.s.m.r.SolrJmxReporter JMX monitoring for 'solr_33891.solr.jvm' (registry 'solr.jvm') enabled at server: com.sun.jmx.mbeanserver.JmxMBeanServer@1a33166
   [junit4]   2> 60457 INFO  (jetty-launcher-26-thread-10) [n:127.0.0.1:33891_solr    ] o.a.s.m.r.SolrJmxReporter JMX monitoring for 'solr_33891.solr.jetty' (registry 'solr.jetty') enabled at server: com.sun.jmx.mbeanserver.JmxMBeanServer@1a33166
   [junit4]   2> 60467 INFO  (jetty-launcher-26-thread-8) [n:127.0.0.1:55631_solr    ] o.a.s.m.r.SolrJmxReporter JMX monitoring for 'solr_55631.solr.node' (registry 'solr.node') enabled at server: com.sun.jmx.mbeanserver.JmxMBeanServer@1a33166
   [junit4]   2> 60468 INFO  (jetty-launcher-26-thread-8) [n:127.0.0.1:55631_solr    ] o.a.s.m.r.SolrJmxReporter JMX monitoring for 'solr_55631.solr.jvm' (registry 'solr.jvm') enabled at server: com.sun.jmx.mbeanserver.JmxMBeanServer@1a33166
   [junit4]   2> 60468 INFO  (jetty-launcher-26-thread-8) [n:127.0.0.1:55631_solr    ] o.a.s.m.r.SolrJmxReporter JMX monitoring for 'solr_55631.solr.jetty' (registry 'solr.jetty') enabled at server: com.sun.jmx.mbeanserver.JmxMBeanServer@1a33166
   [junit4]   2> 60470 INFO  (jetty-launcher-26-thread-5) [n:127.0.0.1:32886_solr    ] o.a.s.m.r.SolrJmxReporter JMX monitoring for 'solr_32886.solr.node' (registry 'solr.node') enabled at server: com.sun.jmx.mbeanserver.JmxMBeanServer@1a33166
   [junit4]   2> 60470 INFO  (jetty-launcher-26-thread-5) [n:127.0.0.1:32886_solr    ] o.a.s.m.r.SolrJmxReporter JMX monitoring for 'solr_32886.solr.jvm' (registry 'solr.jvm') enabled at server: com.sun.jmx.mbeanserver.JmxMBeanServer@1a33166
   [junit4]   2> 60471 INFO  (jetty-launcher-26-thread-5) [n:127.0.0.1:32886_solr    ] o.a.s.m.r.SolrJmxReporter JMX monitoring for 'solr_32886.solr.jetty' (registry 'solr.jetty') enabled at server: com.sun.jmx.mbeanserver.JmxMBeanServer@1a33166
   [junit4]   2> 60474 INFO  (jetty-launcher-26-thread-9) [n:127.0.0.1:56645_solr    ] o.a.s.m.r.SolrJmxReporter JMX monitoring for 'solr_56645.solr.node' (registry 'solr.node') enabled at server: com.sun.jmx.mbeanserver.JmxMBeanServer@1a33166
   [junit4]   2> 60474 INFO  (jetty-launcher-26-thread-9) [n:127.0.0.1:56645_solr    ] o.a.s.m.r.SolrJmxReporter JMX monitoring for 'solr_56645.solr.jvm' (registry 'solr.jvm') enabled at server: com.sun.jmx.mbeanserver.JmxMBeanServer@1a33166
   [junit4]   2> 60474 INFO  (jetty-launcher-26-thread-9) [n:127.0.0.1:56645_solr    ] o.a.s.m.r.SolrJmxReporter JMX monitoring for 'solr_56645.solr.jetty' (registry 'solr.jetty') enabled at server: com.sun.jmx.mbeanserver.JmxMBeanServer@1a33166
   [junit4]   2> 60481 INFO  (jetty-launcher-26-thread-6) [n:127.0.0.1:42348_solr    ] o.a.s.m.r.SolrJmxReporter JMX monitoring for 'solr_42348.solr.node' (registry 'solr.node') enabled at server: com.sun.jmx.mbeanserver.JmxMBeanServer@1a33166
   [junit4]   2> 60481 INFO  (jetty-launcher-26-thread-6) [n:127.0.0.1:42348_solr    ] o.a.s.m.r.SolrJmxReporter JMX monitoring for 'solr_42348.solr.jvm' (registry 'solr.jvm') enabled at server: com.sun.jmx.mbeanserver.JmxMBeanServer@1a33166
   [junit4]   2> 60481 INFO  (jetty-launcher-26-thread-6) [n:127.0.0.1:42348_solr    ] o.a.s.m.r.SolrJmxReporter JMX monitoring for 'solr_42348.solr.jetty' (registry 'solr.jetty') enabled at server: com.sun.jmx.mbeanserver.JmxMBeanServer@1a33166
   [junit4]   2> 60502 INFO  (jetty-launcher-26-thread-3) [n:127.0.0.1:59203_solr    ] o.a.s.m.r.SolrJmxReporter JMX monitoring for 'solr_59203.solr.node' (registry 'solr.node') enabled at server: com.sun.jmx.mbeanserver.JmxMBeanServer@1a33166
   [junit4]   2> 60502 INFO  (jetty-launcher-26-thread-3) [n:127.0.0.1:59203_solr    ] o.a.s.m.r.SolrJmxReporter JMX monitoring for 'solr_59203.solr.jvm' (registry 'solr.jvm') enabled at server: com.sun.jmx.mbeanserver.JmxMBeanServer@1a33166
   [junit4]   2> 60502 INFO  (jetty-launcher-26-thread-3) [n:127.0.0.1:59203_solr    ] o.a.s.m.r.SolrJmxReporter JMX monitoring for 'solr_59203.solr.jetty' (registry 'solr.jetty') enabled at server: com.sun.jmx.mbeanserver.JmxMBeanServer@1a33166
   [junit4]   2> 60729 INFO  (jetty-launcher-26-thread-7) [n:127.0.0.1:57099_solr    ] o.a.s.m.r.SolrJmxReporter JMX monitoring for 'solr_57099.solr.node' (registry 'solr.node') enabled at server: com.sun.jmx.mbeanserver.JmxMBeanServer@1a33166
   [junit4]   2> 60730 INFO  (jetty-launcher-26-thread-7) [n:127.0.0.1:57099_solr    ] o.a.s.m.r.SolrJmxReporter JMX monitoring for 'solr_57099.solr.jvm' (registry 'solr.jvm') enabled at server: com.sun.jmx.mbeanserver.JmxMBeanServer@1a33166
   [junit4]   2> 60730 INFO  (jetty-launcher-26-thread-7) [n:127.0.0.1:57099_solr    ] o.a.s.m.r.SolrJmxReporter JMX monitoring for 'solr_57099.solr.jetty' (registry 'solr.jetty') enabled at server: com.sun.jmx.mbeanserver.JmxMBeanServer@1a33166
   [junit4]   2> 60735 INFO  (jetty-launcher-26-thread-2) [n:127.0.0.1:59189_solr    ] o.a.s.m.r.SolrJmxReporter JMX monitoring for 'solr_59189.solr.node' (registry 'solr.node') enabled at server: com.sun.jmx.mbeanserver.JmxMBeanServer@1a33166
   [junit4]   2> 60735 INFO  (jetty-launcher-26-thread-2) [n:127.0.0.1:59189_solr    ] o.a.s.m.r.SolrJmxReporter JMX monitoring for 'solr_59189.solr.jvm' (registry 'solr.jvm') enabled at server: com.sun.jmx.mbeanserver.JmxMBeanServer@1a33166
   [junit4]   2> 60735 INFO  (jetty-launcher-26-thread-2) [n:127.0.0.1:59189_solr    ] o.a.s.m.r.SolrJmxReporter JMX monitoring for 'solr_59189.solr.jetty' (registry 'solr.jetty') enabled at server: com.sun.jmx.mbeanserver.JmxMBeanServer@1a33166
   [junit4]   2> 60785 INFO  (jetty-launcher-26-thread-4) [n:127.0.0.1:60879_solr    ] o.a.s.c.CorePropertiesLocator Found 0 core definitions underneath /x1/jenkins/jenkins-slave/workspace/Lucene-Solr-NightlyTests-master/checkout/solr/build/solr-core/test/J1/temp/solr.cloud.TestStressCloudBlindAtomicUpdates_42E99CA6451700F9-001/tempDir-001/node4/.
   [junit4]   2> 60786 INFO  (jetty-launcher-26-thread-2) [n:127.0.0.1:59189_solr    ] o.a.s.c.CorePropertiesLocator Found 0 core definitions underneath /x1/jenkins/jenkins-slave/workspace/Lucene-Solr-NightlyTests-master/checkout/solr/build/solr-core/test/J1/temp/solr.cloud.TestStressCloudBlindAtomicUpdates_42E99CA6451700F9-001/tempDir-001/node2/.
   [junit4]   2> 60788 INFO  (jetty-launcher-26-thread-10) [n:127.0.0.1:33891_solr    ] o.a.s.c.CorePropertiesLocator Found 0 core definitions underneath /x1/jenkins/jenkins-slave/workspace/Lucene-Solr-NightlyTests-master/checkout/solr/build/solr-core/test/J1/temp/solr.cloud.TestStressCloudBlindAtomicUpdates_42E99CA6451700F9-001/tempDir-001/node10/.
   [junit4]   2> 60789 INFO  (jetty-launcher-26-thread-8) [n:127.0.0.1:55631_solr    ] o.a.s.c.CorePropertiesLocator Found 0 core definitions underneath /x1/jenkins/jenkins-slave/workspace/Lucene-Solr-NightlyTests-master/checkout/solr/build/solr-core/test/J1/temp/solr.cloud.TestStressCloudBlindAtomicUpdates_42E99CA6451700F9-001/tempDir-001/node8/.
   [junit4]   2> 60790 INFO  (jetty-launcher-26-thread-5) [n:127.0.0.1:32886_solr    ] o.a.s.c.CorePropertiesLocator Found 0 core definitions underneath /x1/jenkins/jenkins-slave/workspace/Lucene-Solr-NightlyTests-master/checkout/solr/build/solr-core/test/J1/temp/solr.cloud.TestStressCloudBlindAtomicUpdates_42E99CA6451700F9-001/tempDir-001/node5/.
   [junit4]   2> 60792 INFO  (jetty-launcher-26-thread-6) [n:127.0.0.1:42348_solr    ] o.a.s.c.CorePropertiesLocator Found 0 core definitions underneath /x1/jenkins/jenkins-slave/workspace/Lucene-Solr-NightlyTests-master/checkout/solr/build/solr-core/test/J1/temp/solr.cloud.TestStressCloudBlindAtomicUpdates_42E99CA6451700F9-001/tempDir-001/node6/.
   [junit4]   2> 60792 INFO  (jetty-launcher-26-thread-3) [n:127.0.0.1:59203_solr    ] o.a.s.c.CorePropertiesLocator Found 0 core definitions underneath /x1/jenkins/jenkins-slave/workspace/Lucene-Solr-NightlyTests-master/checkout/solr/build/solr-core/test/J1/temp/solr.cloud.TestStressCloudBlindAtomicUpdates_42E99CA6451700F9-001/tempDir-001/node3/.
   [junit4]   2> 60792 INFO  (jetty-launcher-26-thread-7) [n:127.0.0.1:57099_solr    ] o.a.s.c.CorePropertiesLocator Found 0 core definitions underneath /x1/jenkins/jenkins-slave/workspace/Lucene-Solr-NightlyTests-master/checkout/solr/build/solr-core/test/J1/temp/solr.cloud.TestStressCloudBlindAtomicUpdates_42E99CA6451700F9-001/tempDir-001/node7/.
   [junit4]   2> 60793 INFO  (jetty-launcher-26-thread-9) [n:127.0.0.1:56645_solr    ] o.a.s.c.CorePropertiesLocator Found 0 core definitions underneath /x1/jenkins/jenkins-slave/workspace/Lucene-Solr-NightlyTests-master/checkout/solr/build/solr-core/test/J1/temp/solr.cloud.TestStressCloudBlindAtomicUpdates_42E99CA6451700F9-001/tempDir-001/node9/.
   [junit4]   2> 60881 INFO  (jetty-launcher-26-thread-1) [n:127.0.0.1:58070_solr    ] o.a.s.m.r.SolrJmxReporter JMX monitoring for 'solr_58070.solr.node' (registry 'solr.node') enabled at server: com.sun.jmx.mbeanserver.JmxMBeanServer@1a33166
   [junit4]   2> 60882 INFO  (jetty-launcher-26-thread-1) [n:127.0.0.1:58070_solr    ] o.a.s.m.r.SolrJmxReporter JMX monitoring for 'solr_58070.solr.jvm' (registry 'solr.jvm') enabled at server: com.sun.jmx.mbeanserver.JmxMBeanServer@1a33166
   [junit4]   2> 60882 INFO  (jetty-launcher-26-thread-1) [n:127.0.0.1:58070_solr    ] o.a.s.m.r.SolrJmxReporter JMX monitoring for 'solr_58070.solr.jetty' (registry 'solr.jetty') enabled at server: com.sun.jmx.mbeanserver.JmxMBeanServer@1a33166
   [junit4]   2> 60905 INFO  (jetty-launcher-26-thread-1) [n:127.0.0.1:58070_solr    ] o.a.s.c.CorePropertiesLocator Found 0 core definitions underneath /x1/jenkins/jenkins-slave/workspace/Lucene-Solr-NightlyTests-master/checkout/solr/build/solr-core/test/J1/temp/solr.cloud.TestStressCloudBlindAtomicUpdates_42E99CA6451700F9-001/tempDir-001/node1/.
   [junit4]   2> 65230 INFO  (SUITE-TestStressCloudBlindAtomicUpdates-seed#[42E99CA6451700F9]-worker) [    ] o.a.s.c.c.ZkStateReader Updated live nodes from ZooKeeper... (0) -> (10)
   [junit4]   2> 65232 INFO  (SUITE-TestStressCloudBlindAtomicUpdates-seed#[42E99CA6451700F9]-worker) [    ] o.a.s.c.s.i.ZkClientClusterStateProvider Cluster at 127.0.0.1:46794/solr ready
   [junit4]   2> 68420 INFO  (qtp284053687-216) [n:127.0.0.1:33891_solr    ] o.a.s.h.a.CollectionsHandler Invoked Collection Action :create with params replicationFactor=2&property.config=solrconfig-tlog.xml&property.schema=schema-minimal-atomic-stress.xml&collection.configName=org.apache.solr.cloud.TestStressCloudBlindAtomicUpdates_config-set&name=test_col&action=CREATE&numShards=5&wt=javabin&version=2 and sendToOCPQueue=true
   [junit4]   2> 68508 INFO  (OverseerThreadFactory-56-thread-1-processing-n:127.0.0.1:55631_solr) [n:127.0.0.1:55631_solr    ] o.a.s.c.CreateCollectionCmd Create collection test_col
   [junit4]   2> 69213 INFO  (qtp1252028365-208) [n:127.0.0.1:58070_solr    ] o.a.s.h.a.CoreAdminOperation core create command property.config=solrconfig-tlog.xml&property.schema=schema-minimal-atomic-stress.xml&qt=/admin/cores&collection.configName=org.apache.solr.cloud.TestStressCloudBlindAtomicUpdates_config-set&newCollection=true&name=test_col_shard5_replica1&action=CREATE&numShards=5&collection=test_col&shard=shard5&wt=javabin&version=2
   [junit4]   2> 69226 INFO  (qtp1252028365-208) [n:127.0.0.1:58070_solr    ] o.a.s.c.TransientSolrCoreCacheDefault Allocating transient cache for 2147483647 transient cores
   [junit4]   2> 69293 INFO  (qtp546945173-236) [n:127.0.0.1:59189_solr    ] o.a.s.h.a.CoreAdminOperation core create command property.config=solrconfig-tlog.xml&property.schema=schema-minimal-atomic-stress.xml&qt=/admin/cores&collection.configName=org.apache.solr.cloud.TestStressCloudBlindAtomicUpdates_config-set&newCollection=true&name=test_col_shard3_replica1&action=CREATE&numShards=5&collection=test_col&shard=shard3&wt=javabin&version=2
   [junit4]   2> 69294 INFO  (qtp463231341-266) [n:127.0.0.1:32886_solr    ] o.a.s.h.a.CoreAdminOperation core create command property.config=solrconfig-tlog.xml&property.schema=schema-minimal-atomic-stress.xml&qt=/admin/cores&collection.configName=org.apache.solr.cloud.TestStressCloudBlindAtomicUpdates_config-set&newCollection=true&name=test_col_shard5_replica2&action=CREATE&numShards=5&collection=test_col&shard=shard5&wt=javabin&version=2
   [junit4]   2> 69297 INFO  (qtp546945173-236) [n:127.0.0.1:59189_solr    ] o.a.s.c.TransientSolrCoreCacheDefault Allocating transient cache for 2147483647 transient cores
   [junit4]   2> 69300 INFO  (qtp566277818-285) [n:127.0.0.1:59203_solr    ] o.a.s.h.a.CoreAdminOperation core create command property.config=solrconfig-tlog.xml&property.schema=schema-minimal-atomic-stress.xml&qt=/admin/cores&collection.configName=org.apache.solr.cloud.TestStressCloudBlindAtomicUpdates_config-set&newCollection=true&name=test_col_shard1_replica1&action=CREATE&numShards=5&collection=test_col&shard=shard1&wt=javabin&version=2
   [junit4]   2> 69301 INFO  (qtp566277818-285) [n:127.0.0.1:59203_solr    ] o.a.s.c.TransientSolrCoreCacheDefault Allocating transient cache for 2147483647 transient cores
   [junit4]   2> 69302 INFO  (qtp284053687-218) [n:127.0.0.1:33891_solr    ] o.a.s.h.a.CoreAdminOperation core create command property.config=solrconfig-tlog.xml&property.schema=schema-minimal-atomic-stress.xml&qt=/admin/cores&collection.configName=org.apache.solr.cloud.TestStressCloudBlindAtomicUpdates_config-set&newCollection=true&name=test_col_shard3_replica2&action=CREATE&numShards=5&collection=test_col&shard=shard3&wt=javabin&version=2
   [junit4]   2> 69303 INFO  (qtp1934085772-224) [n:127.0.0.1:56645_solr    ] o.a.s.h.a.CoreAdminOperation core create command property.config=solrconfig-tlog.xml&property.schema=schema-minimal-atomic-stress.xml&qt=/admin/cores&collection.configName=org.apache.solr.cloud.TestStressCloudBlindAtomicUpdates_config-set&newCollection=true&name=test_col_shard2_replica2&action=CREATE&numShards=5&collection=test_col&shard=shard2&wt=javabin&version=2
   [junit4]   2> 69304 INFO  (qtp1934085772-224) [n:127.0.0.1:56645_solr    ] o.a.s.c.TransientSolrCoreCacheDefault Allocating transient cache for 2147483647 transient cores
   [junit4]   2> 69305 INFO  (qtp284053687-218) [n:127.0.0.1:33891_solr    ] o.a.s.c.TransientSolrCoreCacheDefault Allocating transient cache for 2147483647 transient cores
   [junit4]   2> 69315 INFO  (qtp2021064511-258) [n:127.0.0.1:60879_solr    ] o.a.s.h.a.CoreAdminOperation core create command property.config=solrconfig-tlog.xml&property.schema=schema-minimal-atomic-stress.xml&qt=/admin/cores&collection.configName=org.apache.solr.cloud.TestStressCloudBlindAtomicUpdates_config-set&newCollection=true&name=test_col_shard1_replica2&action=CREATE&numShards=5&collection=test_col&shard=shard1&wt=javabin&version=2
   [junit4]   2> 69315 INFO  (qtp2021064511-258) [n:127.0.0.1:60879_solr    ] o.a.s.c.TransientSolrCoreCacheDefault Allocating transient cache for 2147483647 transient cores
   [junit4]   2> 69317 INFO  (qtp1870420989-279) [n:127.0.0.1:55631_solr    ] o.a.s.h.a.CoreAdminOperation core create command property.config=solrconfig-tlog.xml&property.schema=schema-minimal-atomic-stress.xml&qt=/admin/cores&collection.configName=org.apache.solr.cloud.TestStressCloudBlindAtomicUpdates_config-set&newCollection=true&name=test_col_shard2_replica1&action=CREATE&numShards=5&collection=test_col&shard=shard2&wt=javabin&version=2
   [junit4]   2> 69317 INFO  (qtp1870420989-279) [n:127.0.0.1:55631_solr    ] o.a.s.c.TransientSolrCoreCacheDefault Allocating transient cache for 2147483647 transient cores
   [junit4]   2> 69318 INFO  (qtp1896682496-242) [n:127.0.0.1:57099_solr    ] o.a.s.h.a.CoreAdminOperation core create command property.config=solrconfig-tlog.xml&property.schema=schema-minimal-atomic-stress.xml&qt=/admin/cores&collection.configName=org.apache.solr.cloud.TestStressCloudBlindAtomicUpdates_config-set&newCollection=true&name=test_col_shard4_replica2&action=CREATE&numShards=5&collection=test_col&shard=shard4&wt=javabin&version=2
   [junit4]   2> 69318 INFO  (qtp1896682496-242) [n:127.0.0.1:57099_solr    ] o.a.s.c.TransientSolrCoreCacheDefault Allocating transient cache for 2147483647 transient cores
   [junit4]   2> 69319 INFO  (qtp463231341-266) [n:127.0.0.1:32886_solr    ] o.a.s.c.TransientSolrCoreCacheDefault Allocating transient cache for 2147483647 transient cores
   [junit4]   2> 69389 INFO  (qtp556071190-274) [n:127.0.0.1:42348_solr    ] o.a.s.h.a.CoreAdminOperation core create command property.config=solrconfig-tlog.xml&property.schema=schema-minimal-atomic-stress.xml&qt=/admin/cores&collection.configName=org.apache.solr.cloud.TestStressCloudBlindAtomicUpdates_config-set&newCollection=true&name=test_col_shard4_replica1&action=CREATE&numShards=5&collection=test_col&shard=shard4&wt=javabin&version=2
   [junit4]   2> 69390 INFO  (qtp556071190-274) [n:127.0.0.1:42348_solr    ] o.a.s.c.TransientSolrCoreCacheDefault Allocating transient cache for 2147483647 transient cores
   [junit4]   2> 69497 INFO  (zkCallback-68-thread-1-processing-n:127.0.0.1:59189_solr) [n:127.0.0.1:59189_solr    ] o.a.s.c.c.ZkStateReader A cluster state change: [WatchedEvent state:SyncConnected type:NodeDataChanged path:/collections/test_col/state.json] for collection [test_col] has occurred - updating... (live nodes size: [10])
   [junit4]   2> 69498 INFO  (zkCallback-80-thread-1-processing-n:127.0.0.1:59203_solr) [n:127.0.0.1:59203_solr    ] o.a.s.c.c.ZkStateReader A cluster state change: [WatchedEvent state:SyncConnected type:NodeDataChanged path:/collections/test_col/state.json] for collection [test_col] has occurred - updating... (live nodes size: [10])
   [junit4]   2> 69498 INFO  (zkCallback-72-thread-2-processing-n:127.0.0.1:42348_solr) [n:127.0.0.1:42348_solr    ] o.a.s.c.c.ZkStateReader A cluster state change: [WatchedEvent state:SyncConnected type:NodeDataChanged path:/collections/test_col/state.json] for collection [test_col] has occurred - updating... (live nodes size: [10])
   [junit4]   2> 69498 INFO  (zkCallback-81-thread-1-processing-n:127.0.0.1:57099_solr) [n:127.0.0.1:57099_solr    ] o.a.s.c.c.ZkStateReader A cluster state change: [WatchedEvent state:SyncConnected type:NodeDataChanged path:/collections/test_col/state.json] for collection [test_col] has occurred - updating... (live nodes size: [10])
   [junit4]   2> 69498 INFO  (zkCallback-75-thread-2-processing-n:127.0.0.1:58070_solr) [n:127.0.0.1:58070_solr    ] o.a.s.c.c.ZkStateReader A cluster state change: [WatchedEvent state:SyncConnected type:NodeDataChanged path:/collections/test_col/state.json] for collection [test_col] has occurred - updating... (live nodes size: [10])
   [junit4]   2> 69498 INFO  (zkCallback-73-thread-1-processing-n:127.0.0.1:32886_solr) [n:127.0.0.1:32886_solr    ] o.a.s.c.c.ZkStateReader A cluster state change: [WatchedEvent state:SyncConnected type:NodeDataChanged path:/collections/test_col/state.json] for collection [test_col] has occurred - updating... (live nodes size: [10])
   [junit4]   2> 69499 INFO  (zkCallback-65-thread-1-processing-n:127.0.0.1:33891_solr) [n:127.0.0.1:33891_solr    ] o.a.s.c.c.ZkStateReader A cluster state change: [WatchedEvent state:SyncConnected type:NodeDataChanged path:/collections/test_col/state.json] for collection [test_col] has occurred - updating... (live nodes size: [10])
   [junit4]   2> 69499 INFO  (zkCallback-86-thread-1-processing-n:127.0.0.1:60879_solr) [n:127.0.0.1:60879_solr    ] o.a.s.c.c.ZkStateReader A cluster state change: [WatchedEvent state:SyncConnected type:NodeDataChanged path:/collections/test_col/state.json] for collection [test_col] has occurred - updating... (live nodes size: [10])
   [junit4]   2> 69499 INFO  (zkCallback-76-thread-1-processing-n:127.0.0.1:56645_solr) [n:127.0.0.1:56645_solr    ] o.a.s.c.c.ZkStateReader A cluster state change: [WatchedEvent state:SyncConnected type:NodeDataChanged path:/collections/test_col/state.json] for collection [test_col] has occurred - updating... (live nodes size: [10])
   [junit4]   2> 69500 INFO  (zkCallback-67-thread-3-processing-n:127.0.0.1:55631_solr) [n:127.0.0.1:55631_solr    ] o.a.s.c.c.ZkStateReader A cluster state change: [WatchedEvent state:SyncConnected type:NodeDataChanged path:/collections/test_col/state.json] for collection [test_col] has occurred - updating... (live nodes size: [10])
   [junit4]   2> 70461 WARN  (qtp284053687-218) [n:127.0.0.1:33891_solr c:test_col s:shard3  x:test_col_shard3_replica2] o.a.s.c.Config Beginning with Solr 5.5, <mergePolicy> is deprecated, use <mergePolicyFactory> instead.
   [junit4]   2> 70604 INFO  (qtp284053687-218) [n:127.0.0.1:33891_solr c:test_col s:shard3  x:test_col_shard3_replica2] o.a.s.c.SolrConfig Using Lucene MatchVersion: 7.0.0
   [junit4]   2> 70476 WARN  (qtp1252028365-208) [n:127.0.0.1:58070_solr c:test_col s:shard5  x:test_col_shard5_replica1] o.a.s.c.Config Beginning with Solr 5.5, <mergePolicy> is deprecated, use <mergePolicyFactory> instead.
   [junit4]   2> 70625 INFO  (qtp1252028365-208) [n:127.0.0.1:58070_solr c:test_col s:shard5  x:test_col_shard5_replica1] o.a.s.c.SolrConfig Using Lucene MatchVersion: 7.0.0
   [junit4]   2> 70636 WARN  (qtp546945173-236) [n:127.0.0.1:59189_solr c:test_col s:shard3  x:test_col_shard3_replica1] o.a.s.c.Config Beginning with Solr 5.5, <mergePolicy> is deprecated, use <mergePolicyFactory> instead.
   [junit4]   2> 70701 INFO  (qtp546945173-236) [n:127.0.0.1:59189_solr c:test_col s:shard3  x:test_col_shard3_replica1] o.a.s.c.SolrConfig Using Lucene MatchVersion: 7.0.0
   [junit4]   2> 70715 WARN  (qtp1870420989-279) [n:127.0.0.1:55631_solr c:test_col s:shard2  x:test_col_shard2_replica1] o.a.s.c.Config Beginning with Solr 5.5, <mergePolicy> is deprecated, use <mergePolicyFactory> instead.
   [junit4]   2> 70718 WARN  (qtp1896682496-242) [n:127.0.0.1:57099_solr c:test_col s:shard4  x:test_col_shard4_replica2] o.a.s.c.Config Beginning with Solr 5.5, <mergePolicy> is deprecated, use <mergePolicyFactory> instead.
   [junit4]   2> 70719 INFO  (qtp1896682496-242) [n:127.0.0.1:57099_solr c:test_col s:shard4  x:test_col_shard4_replica2] o.a.s.c.SolrConfig Using Lucene MatchVersion: 7.0.0
   [junit4]   2> 70720 WARN  (qtp463231341-266) [n:127.0.0.1:32886_solr c:test_col s:shard5  x:test_col_shard5_replica2] o.a.s.c.Config Beginning with Solr 5.5, <mergePolicy> is deprecated, use <mergePolicyFactory> instead.
   [junit4]   2> 70721 INFO  (qtp463231341-266) [n:127.0.0.1:32886_solr c:test_col s:shard5  x:test_col_shard5_replica2] o.a.s.c.SolrConfig Using Lucene MatchVersion: 7.0.0
   [junit4]   2> 70726 WARN  (qtp566277818-285) [n:127.0.0.1:59203_solr c:test_col s:shard1  x:test_col_shard1_replica1] o.a.s.c.Config Beginning with Solr 5.5, <mergePolicy> is deprecated, use <mergePolicyFactory> instead.
   [junit4]   2> 70727 INFO  (qtp566277818-285) [n:127.0.0.1:59203_solr c:test_col s:shard1  x:test_col_shard1_replica1] o.a.s.c.SolrConfig Using Lucene MatchVersion: 7.0.0
   [junit4]   2> 70729 WARN  (qtp1934085772-224) [n:127.0.0.1:56645_solr c:test_col s:shard2  x:test_col_shard2_replica2] o.a.s.c.Config Beginning with Solr 5.5, <mergePolicy> is deprecated, use <mergePolicyFactory> instead.
   [junit4]   2> 70730 WARN  (qtp556071190-274) [n:127.0.0.1:42348_solr c:test_col s:shard4  x:test_col_shard4_replica1] o.a.s.c.Config Beginning with Solr 5.5, <mergePolicy> is deprecated, use <mergePolicyFactory> instead.
   [junit4]   2> 70730 INFO  (qtp1934085772-224) [n:127.0.0.1:56645_solr c:test_col s:shard2  x:test_col_shard2_replica2] o.a.s.c.SolrConfig Using Lucene MatchVersion: 7.0.0
   [junit4]   2> 70731 INFO  (qtp556071190-274) [n:127.0.0.1:42348_solr c:test_col s:shard4  x:test_col_shard4_replica1] o.a.s.c.SolrConfig Using Lucene MatchVersion: 7.0.0
   [junit4]   2> 70804 INFO  (qtp1870420989-279) [n:127.0.0.1:55631_solr c:test_col s:shard2  x:test_col_shard2_replica1] o.a.s.c.SolrConfig Using Lucene MatchVersion: 7.0.0
   [junit4]   2> 70818 WARN  (qtp2021064511-258) [n:127.0.0.1:60879_solr c:test_col s:shard1  x:test_col_shard1_replica2] o.a.s.c.Config Beginning with Solr 5.5, <mergePolicy> is deprecated, use <mergePolicyFactory> instead.
   [junit4]   2> 70819 INFO  (qtp2021064511-258) [n:127.0.0.1:60879_solr c:test_col s:shard1  x:test_col_shard1_replica2] o.a.s.c.SolrConfig Using Lucene MatchVersion: 7.0.0
   [junit4]   2> 70856 INFO  (qtp546945173-236) [n:127.0.0.1:59189_solr c:test_col s:shard3  x:test_col_shard3_replica1] o.a.s.s.IndexSchema [test_col_shard3_replica1] Schema name=minimal-atomic-stress
   [junit4]   2> 70885 INFO  (qtp284053687-218) [n:127.0.0.1:33891_solr c:test_col s:shard3  x:test_col_shard3_replica2] o.a.s.s.IndexSchema [test_col_shard3_replica2] Schema name=minimal-atomic-stress
   [junit4]   2> 70939 INFO  (qtp1252028365-208) [n:127.0.0.1:58070_solr c:test_col s:shard5  x:test_col_shard5_replica1] o.a.s.s.IndexSchema [test_col_shard5_replica1] Schema name=minimal-atomic-stress
   [junit4]   2> 70958 INFO  (qtp463231341-266) [n:127.0.0.1:32886_solr c:test_col s:shard5  x:test_col_shard5_replica2] o.a.s.s.IndexSchema [test_col_shard5_replica2] Schema name=minimal-atomic-stress
   [junit4]   2> 70959 INFO  (qtp1934085772-224) [n:127.0.0.1:56645_solr c:test_col s:shard2  x:test_col_shard2_replica2] o.a.s.s.IndexSchema [test_col_shard2_replica2] Schema name=minimal-atomic-stress
   [junit4]   2> 70962 INFO  (qtp556071190-274) [n:127.0.0.1:42348_solr c:test_col s:shard4  x:test_col_shard4_replica1] o.a.s.s.IndexSchema [test_col_shard4_replica1] Schema name=minimal-atomic-stress
   [junit4]   2> 70966 INFO  (qtp1896682496-242) [n:127.0.0.1:57099_solr c:test_col s:shard4  x:test_col_shard4_replica2] o.a.s.s.IndexSchema [test_col_shard4_replica2] Schema name=minimal-atomic-stress
   [junit4]   2> 70970 INFO  (qtp2021064511-258) [n:127.0.0.1:60879_solr c:test_col s:shard1  x:test_col_shard1_replica2] o.a.s.s.IndexSchema [test_col_shard1_replica2] Schema name=minimal-atomic-stress
   [junit4]   2> 70978 INFO  (qtp2021064511-258) [n:127.0.0.1:60879_solr c:test_col s:shard1  x:test_col_shard1_replica2] o.a.s.s.IndexSchema Loaded schema minimal-atomic-stress/1.6 with uniqueid field id
   [junit4]   2> 70978 INFO  (qtp2021064511-258) [n:127.0.0.1:60879_solr c:test_col s:shard1  x:test_col_shard1_replica2] o.a.s.c.CoreContainer Creating SolrCore 'test_col_shard1_replica2' using configuration from collection test_col, trusted=true
   [junit4]   2> 71016 INFO  (qtp546945173-236) [n:127.0.0.1:59189_solr c:test_col s:shard3  x:test_col_shard3_replica1] o.a.s.s.IndexSchema Loaded schema minimal-atomic-stress/1.6 with uniqueid field id
   [junit4]   2> 71017 INFO  (qtp546945173-236) [n:127.0.0.1:59189_solr c:test_col s:shard3  x:test_col_shard3_replica1] o.a.s.c.CoreContainer Creating SolrCore 'test_col_shard3_replica1' using configuration from collection test_col, trusted=true
   [junit4]   2> 71019 INFO  (qtp556071190-274) [n:127.0.0.1:42348_solr c:test_col s:shard4  x:test_col_shard4_replica1] o.a.s.s.IndexSchema Loaded schema minimal-atomic-stress/1.6 with uniqueid field id
   [junit4]   2> 71019 INFO  (qtp556071190-274) [n:127.0.0.1:42348_solr c:test_col s:shard4  x:test_col_shard4_replica1] o.a.s.c.CoreContainer Creating SolrCore 'test_col_shard4_replica1' using configuration from collection test_col, trusted=true
   [junit4]   2> 71021 INFO  (qtp463231341-266) [n:127.0.0.1:32886_solr c:test_col s:shard5  x:test_col_shard5_replica2] o.a.s.s.IndexSchema Loaded schema minimal-atomic-stress/1.6 with uniqueid field id
   [junit4]   2> 71021 INFO  (qtp463231341-266) [n:127.0.0.1:32886_solr c:test_col s:shard5  x:test_col_shard5_replica2] o.a.s.c.CoreContainer Creating SolrCore 'test_col_shard5_replica2' using configuration from collection test_col, trusted=true
   [junit4]   2> 71025 INFO  (qtp284053687-218) [n:127.0.0.1:33891_solr c:t

[...truncated too long message...]

.solr.cloud.hdfs.HdfsRecoveryZkTest.teardownClass(HdfsRecoveryZkTest.java:53)
   [junit4]   2> 	at sun.reflect.NativeMethodAccessorImpl.invoke0(Native Method)
   [junit4]   2> 	at sun.reflect.NativeMethodAccessorImpl.invoke(NativeMethodAccessorImpl.java:62)
   [junit4]   2> 	at sun.reflect.DelegatingMethodAccessorImpl.invoke(DelegatingMethodAccessorImpl.java:43)
   [junit4]   2> 	at java.lang.reflect.Method.invoke(Method.java:498)
   [junit4]   2> 	at com.carrotsearch.randomizedtesting.RandomizedRunner.invoke(RandomizedRunner.java:1713)
   [junit4]   2> 	at com.carrotsearch.randomizedtesting.RandomizedRunner$7.evaluate(RandomizedRunner.java:870)
   [junit4]   2> 	at com.carrotsearch.randomizedtesting.rules.StatementAdapter.evaluate(StatementAdapter.java:36)
   [junit4]   2> 	at com.carrotsearch.randomizedtesting.rules.SystemPropertiesRestoreRule$1.evaluate(SystemPropertiesRestoreRule.java:57)
   [junit4]   2> 	at org.apache.lucene.util.AbstractBeforeAfterRule$1.evaluate(AbstractBeforeAfterRule.java:45)
   [junit4]   2> 	at com.carrotsearch.randomizedtesting.rules.StatementAdapter.evaluate(StatementAdapter.java:36)
   [junit4]   2> 	at org.apache.lucene.util.TestRuleStoreClassName$1.evaluate(TestRuleStoreClassName.java:41)
   [junit4]   2> 	at com.carrotsearch.randomizedtesting.rules.NoShadowingOrOverridesOnMethodsRule$1.evaluate(NoShadowingOrOverridesOnMethodsRule.java:40)
   [junit4]   2> 	at com.carrotsearch.randomizedtesting.rules.NoShadowingOrOverridesOnMethodsRule$1.evaluate(NoShadowingOrOverridesOnMethodsRule.java:40)
   [junit4]   2> 	at com.carrotsearch.randomizedtesting.rules.StatementAdapter.evaluate(StatementAdapter.java:36)
   [junit4]   2> 	at com.carrotsearch.randomizedtesting.rules.StatementAdapter.evaluate(StatementAdapter.java:36)
   [junit4]   2> 	at com.carrotsearch.randomizedtesting.rules.StatementAdapter.evaluate(StatementAdapter.java:36)
   [junit4]   2> 	at org.apache.lucene.util.TestRuleAssertionsRequired$1.evaluate(TestRuleAssertionsRequired.java:53)
   [junit4]   2> 	at org.apache.lucene.util.TestRuleMarkFailure$1.evaluate(TestRuleMarkFailure.java:47)
   [junit4]   2> 	at org.apache.lucene.util.TestRuleIgnoreAfterMaxFailures$1.evaluate(TestRuleIgnoreAfterMaxFailures.java:64)
   [junit4]   2> 	at org.apache.lucene.util.TestRuleIgnoreTestSuites$1.evaluate(TestRuleIgnoreTestSuites.java:54)
   [junit4]   2> 	at com.carrotsearch.randomizedtesting.rules.StatementAdapter.evaluate(StatementAdapter.java:36)
   [junit4]   2> 	at com.carrotsearch.randomizedtesting.ThreadLeakControl$StatementRunner.run(ThreadLeakControl.java:368)
   [junit4]   2> 	at java.lang.Thread.run(Thread.java:745)
   [junit4]   2> Caused by: java.lang.NullPointerException
   [junit4]   2> 	at org.apache.hadoop.hdfs.server.blockmanagement.BlocksMap.size(BlocksMap.java:203)
   [junit4]   2> 	at org.apache.hadoop.hdfs.server.blockmanagement.BlockManager.getTotalBlocks(BlockManager.java:3370)
   [junit4]   2> 	at org.apache.hadoop.hdfs.server.namenode.FSNamesystem.getBlocksTotal(FSNamesystem.java:5729)
   [junit4]   2> 	... 54 more
   [junit4]   2> 4996207 INFO  (SUITE-HdfsRecoveryZkTest-seed#[42E99CA6451700F9]-worker) [    ] o.a.s.c.ZkTestServer connecting to 127.0.0.1:40397 40397
   [junit4]   2> 4996207 INFO  (SUITE-HdfsRecoveryZkTest-seed#[42E99CA6451700F9]-worker) [    ] o.a.s.SolrTestCaseJ4 ###deleteCore
   [junit4]   2> NOTE: leaving temporary files on disk at: /x1/jenkins/jenkins-slave/workspace/Lucene-Solr-NightlyTests-master/checkout/solr/build/solr-core/test/J1/temp/solr.cloud.hdfs.HdfsRecoveryZkTest_42E99CA6451700F9-001
   [junit4]   2> Apr 18, 2017 3:12:26 AM com.carrotsearch.randomizedtesting.ThreadLeakControl checkThreadLeaks
   [junit4]   2> WARNING: Will linger awaiting termination of 34 leaked thread(s).
   [junit4]   2> NOTE: test params are: codec=Asserting(Lucene70): {rnd_b=PostingsFormat(name=Asserting), _version_=PostingsFormat(name=MockRandom), a_t=PostingsFormat(name=MockRandom), a_i=PostingsFormat(name=Asserting), id=PostingsFormat(name=Asserting)}, docValues:{}, maxPointsInLeafNode=31, maxMBSortInHeap=6.067262612576821, sim=RandomSimilarity(queryNorm=false): {}, locale=es-PY, timezone=America/Santa_Isabel
   [junit4]   2> NOTE: Linux 3.13.0-85-generic amd64/Oracle Corporation 1.8.0_121 (64-bit)/cpus=4,threads=2,free=151470848,total=524288000
   [junit4]   2> NOTE: All tests run in this JVM: [ZkSolrClientTest, TestStressCloudBlindAtomicUpdates, TestCursorMarkWithoutUniqueKey, CSVRequestHandlerTest, TestDefaultStatsCache, PreAnalyzedFieldManagedSchemaCloudTest, TestCoreContainer, TestSolrCloudSnapshots, TestManagedSchemaThreadSafety, SpatialFilterTest, DistributedFacetPivotSmallAdvancedTest, TestDelegationWithHadoopAuth, DocValuesTest, TestCloudManagedSchema, HdfsThreadLeakTest, ShardRoutingTest, TestTrie, TestPerFieldSimilarity, TestRandomRequestDistribution, BasicAuthStandaloneTest, DistributedFacetExistsSmallTest, DocValuesMissingTest, AnalyticsMergeStrategyTest, SolrIndexSplitterTest, HLLUtilTest, TestAuthenticationFramework, LargeFieldTest, TestConfigSets, TestFieldSortValues, HttpSolrCallGetCoreTest, TestRandomCollapseQParserPlugin, ConnectionManagerTest, TestManagedStopFilterFactory, BJQParserTest, CoreSorterTest, SpellCheckComponentTest, SoftAutoCommitTest, TestSegmentSorting, CdcrUpdateLogTest, TestShardHandlerFactory, JsonValidatorTest, DOMUtilTest, LeaderFailoverAfterPartitionTest, TestClusterProperties, TestExportWriter, TestComplexPhraseLeadingWildcard, TestHashQParserPlugin, TestExclusionRuleCollectionAccess, OnlyLeaderIndexesTest, OpenCloseCoreStressTest, TestBM25SimilarityFactory, TestSurroundQueryParser, IndexSchemaTest, HdfsWriteToMultipleCollectionsTest, DistribCursorPagingTest, TestDistributedGrouping, CdcrRequestHandlerTest, HighlighterMaxOffsetTest, DeleteReplicaTest, TestDefaultSearchFieldResource, SimpleMLTQParserTest, TestFastLRUCache, TestNoOpRegenerator, ConnectionReuseTest, DirectSolrSpellCheckerTest, TestFieldCollectionResource, TestBulkSchemaAPI, RuleEngineTest, MoveReplicaTest, SliceStateTest, BasicFunctionalityTest, OverseerStatusTest, TestHdfsUpdateLog, ForceLeaderTest, TestDeleteCollectionOnDownNodes, TestSchemalessBufferedUpdates, PrimUtilsTest, TestStressUserVersions, TestSolrConfigHandlerConcurrent, TestWordDelimiterFilterFactory, IgnoreCommitOptimizeUpdateProcessorFactoryTest, TestInitParams, TermsComponentTest, TestReplicationHandlerBackup, TermVectorComponentTest, TestSchemaSimilarityResource, TestMaxScoreQueryParser, ZkControllerTest, TestFileDictionaryLookup, TestPostingsSolrHighlighter, TestMinMaxOnMultiValuedField, SchemaVersionSpecificBehaviorTest, CollectionsAPIDistributedZkTest, TestConfigSetsAPIExclusivity, ShardRoutingCustomTest, TestExactStatsCache, TestQueryTypes, SOLR749Test, ZkStateReaderTest, AssignTest, TestCharFilters, TestRequestForwarding, IndexBasedSpellCheckerTest, QueryParsingTest, TestEmbeddedSolrServerConstructors, LoggingHandlerTest, TestSystemIdResolver, TestFuzzyAnalyzedSuggestions, TestRTGBase, TestDynamicLoading, SSLMigrationTest, TestFieldCacheSortRandom, TestFieldCache, DeleteInactiveReplicaTest, TestSimpleTrackingShardHandler, OverseerTest, ClusterStateUpdateTest, TestRandomFaceting, TestStressVersions, DistributedTermsComponentTest, SolrCmdDistributorTest, TestSort, TestLazyCores, HighlighterTest, CurrencyFieldOpenExchangeTest, DistributedQueryElevationComponentTest, AnalysisAfterCoreReloadTest, SignatureUpdateProcessorFactoryTest, SpellCheckCollatorTest, TestFoldingMultitermQuery, TestStressLucene, SuggesterWFSTTest, TestPseudoReturnFields, DirectUpdateHandlerOptimizeTest, DefaultValueUpdateProcessorTest, SortByFunctionTest, DistanceFunctionTest, SolrInfoBeanTest, DisMaxRequestHandlerTest, TestQueryUtils, TestReversedWildcardFilterFactory, DocumentBuilderTest, MoreLikeThisHandlerTest, TestSolrQueryParser, TestCSVResponseWriter, UniqFieldsUpdateProcessorFactoryTest, BinaryUpdateRequestHandlerTest, TestPartialUpdateDeduplication, HighlighterConfigTest, AlternateDirectoryTest, BadComponentTest, TestMergePolicyConfig, MultiTermTest, SampleTest, TestDocSet, TestBinaryField, TestSearchPerf, NumericFieldsTest, TestElisionMultitermQuery, OutputWriterTest, DirectSolrConnectionTest, NotRequiredUniqueKeyTest, TestLuceneMatchVersion, TestPhraseSuggestions, TestXIncludeConfig, TestSweetSpotSimilarityFactory, TestDFRSimilarityFactory, TestLMDirichletSimilarityFactory, TestLMJelinekMercerSimilarityFactory, TestIBSimilarityFactory, TestFastWriter, ResourceLoaderTest, ScriptEngineTest, URLClassifyProcessorTest, PluginInfoTest, TestSuggestSpellingConverter, DateFieldTest, TestSolrJ, TestLRUCache, SystemInfoHandlerTest, UUIDFieldTest, FileUtilsTest, CircularListTest, DistributedMLTComponentTest, CursorPagingTest, TestHighlightDedupGrouping, TestTolerantSearch, TestPathTrie, TestEmbeddedSolrServerSchemaAPI, TestJettySolrRunner, ActionThrottleTest, AliasIntegrationTest, AsyncCallRequestStatusResponseTest, BaseCdcrDistributedZkTest, CdcrBootstrapTest, CollectionsAPISolrJTest, DeleteNodeTest, DeleteStatusTest, DistribDocExpirationUpdateProcessorTest, LeaderInitiatedRecoveryOnCommitTest, LeaderInitiatedRecoveryOnShardRestartTest, MigrateRouteKeyTest, MultiThreadedOCPTest, RemoteQueryErrorTest, ReplicationFactorTest, RestartWhileUpdatingTest, SharedFSAutoReplicaFailoverTest, SharedFSAutoReplicaFailoverUtilsTest, SolrCLIZkUtilsTest, SolrCloudExampleTest, SolrXmlInZkTest, TestCloudInspectUtil, TestCloudPivotFacet, TestCloudPseudoReturnFields, TestCloudRecovery, TestDistribDocBasedVersion, TestLeaderElectionZkExpiry, TestLockTree, TestMiniSolrCloudCluster, TestOnReconnectListenerSupport, TestRequestStatusCollectionAPI, TestSSLRandomization, TestTolerantUpdateProcessorCloud, TriLevelCompositeIdRoutingTest, HdfsBasicDistributedZk2Test, HdfsChaosMonkeyNothingIsSafeTest, HdfsCollectionsAPIDistributedZkTest, HdfsNNFailoverTest, HdfsRecoveryZkTest]
   [junit4] Completed [548/702 (4!)] on J1 in 33.54s, 1 test, 1 failure <<< FAILURES!

[...truncated 43817 lines...]

Mime
View raw message