lucene-dev mailing list archives

Site index · List index
Message view « Date » · « Thread »
Top « Date » · « Thread »
From Policeman Jenkins Server <jenk...@thetaphi.de>
Subject [JENKINS-EA] Lucene-Solr-master-Linux (32bit/jdk-9-ea+164) - Build # 19435 - Still Unstable!
Date Thu, 20 Apr 2017 01:44:37 GMT
Build: https://jenkins.thetaphi.de/job/Lucene-Solr-master-Linux/19435/
Java: 32bit/jdk-9-ea+164 -client -XX:+UseParallelGC

1 tests failed.
FAILED:  org.apache.solr.handler.admin.MetricsHandlerTest.testPropertyFilter

Error Message:


Stack Trace:
java.lang.AssertionError
	at __randomizedtesting.SeedInfo.seed([94D22ADBC8E927F9:F6BFD49A076747C7]:0)
	at org.junit.Assert.fail(Assert.java:92)
	at org.junit.Assert.assertTrue(Assert.java:43)
	at org.junit.Assert.assertNotNull(Assert.java:526)
	at org.junit.Assert.assertNotNull(Assert.java:537)
	at org.apache.solr.handler.admin.MetricsHandlerTest.testPropertyFilter(MetricsHandlerTest.java:201)
	at java.base/jdk.internal.reflect.NativeMethodAccessorImpl.invoke0(Native Method)
	at java.base/jdk.internal.reflect.NativeMethodAccessorImpl.invoke(NativeMethodAccessorImpl.java:62)
	at java.base/jdk.internal.reflect.DelegatingMethodAccessorImpl.invoke(DelegatingMethodAccessorImpl.java:43)
	at java.base/java.lang.reflect.Method.invoke(Method.java:563)
	at com.carrotsearch.randomizedtesting.RandomizedRunner.invoke(RandomizedRunner.java:1713)
	at com.carrotsearch.randomizedtesting.RandomizedRunner$8.evaluate(RandomizedRunner.java:907)
	at com.carrotsearch.randomizedtesting.RandomizedRunner$9.evaluate(RandomizedRunner.java:943)
	at com.carrotsearch.randomizedtesting.RandomizedRunner$10.evaluate(RandomizedRunner.java:957)
	at com.carrotsearch.randomizedtesting.rules.SystemPropertiesRestoreRule$1.evaluate(SystemPropertiesRestoreRule.java:57)
	at org.apache.lucene.util.TestRuleSetupTeardownChained$1.evaluate(TestRuleSetupTeardownChained.java:49)
	at org.apache.lucene.util.AbstractBeforeAfterRule$1.evaluate(AbstractBeforeAfterRule.java:45)
	at org.apache.lucene.util.TestRuleThreadAndTestName$1.evaluate(TestRuleThreadAndTestName.java:48)
	at org.apache.lucene.util.TestRuleIgnoreAfterMaxFailures$1.evaluate(TestRuleIgnoreAfterMaxFailures.java:64)
	at org.apache.lucene.util.TestRuleMarkFailure$1.evaluate(TestRuleMarkFailure.java:47)
	at com.carrotsearch.randomizedtesting.rules.StatementAdapter.evaluate(StatementAdapter.java:36)
	at com.carrotsearch.randomizedtesting.ThreadLeakControl$StatementRunner.run(ThreadLeakControl.java:368)
	at com.carrotsearch.randomizedtesting.ThreadLeakControl.forkTimeoutingTask(ThreadLeakControl.java:817)
	at com.carrotsearch.randomizedtesting.ThreadLeakControl$3.evaluate(ThreadLeakControl.java:468)
	at com.carrotsearch.randomizedtesting.RandomizedRunner.runSingleTest(RandomizedRunner.java:916)
	at com.carrotsearch.randomizedtesting.RandomizedRunner$5.evaluate(RandomizedRunner.java:802)
	at com.carrotsearch.randomizedtesting.RandomizedRunner$6.evaluate(RandomizedRunner.java:852)
	at com.carrotsearch.randomizedtesting.RandomizedRunner$7.evaluate(RandomizedRunner.java:863)
	at com.carrotsearch.randomizedtesting.rules.StatementAdapter.evaluate(StatementAdapter.java:36)
	at com.carrotsearch.randomizedtesting.rules.SystemPropertiesRestoreRule$1.evaluate(SystemPropertiesRestoreRule.java:57)
	at org.apache.lucene.util.AbstractBeforeAfterRule$1.evaluate(AbstractBeforeAfterRule.java:45)
	at com.carrotsearch.randomizedtesting.rules.StatementAdapter.evaluate(StatementAdapter.java:36)
	at org.apache.lucene.util.TestRuleStoreClassName$1.evaluate(TestRuleStoreClassName.java:41)
	at com.carrotsearch.randomizedtesting.rules.NoShadowingOrOverridesOnMethodsRule$1.evaluate(NoShadowingOrOverridesOnMethodsRule.java:40)
	at com.carrotsearch.randomizedtesting.rules.NoShadowingOrOverridesOnMethodsRule$1.evaluate(NoShadowingOrOverridesOnMethodsRule.java:40)
	at com.carrotsearch.randomizedtesting.rules.StatementAdapter.evaluate(StatementAdapter.java:36)
	at com.carrotsearch.randomizedtesting.rules.StatementAdapter.evaluate(StatementAdapter.java:36)
	at org.apache.lucene.util.TestRuleAssertionsRequired$1.evaluate(TestRuleAssertionsRequired.java:53)
	at org.apache.lucene.util.TestRuleMarkFailure$1.evaluate(TestRuleMarkFailure.java:47)
	at org.apache.lucene.util.TestRuleIgnoreAfterMaxFailures$1.evaluate(TestRuleIgnoreAfterMaxFailures.java:64)
	at org.apache.lucene.util.TestRuleIgnoreTestSuites$1.evaluate(TestRuleIgnoreTestSuites.java:54)
	at com.carrotsearch.randomizedtesting.rules.StatementAdapter.evaluate(StatementAdapter.java:36)
	at com.carrotsearch.randomizedtesting.ThreadLeakControl$StatementRunner.run(ThreadLeakControl.java:368)
	at java.base/java.lang.Thread.run(Thread.java:844)




Build Log:
[...truncated 12681 lines...]
   [junit4] Suite: org.apache.solr.handler.admin.MetricsHandlerTest
   [junit4]   2> Creating dataDir: /home/jenkins/workspace/Lucene-Solr-master-Linux/solr/build/solr-core/test/J1/temp/solr.handler.admin.MetricsHandlerTest_94D22ADBC8E927F9-001/init-core-data-001
   [junit4]   2> 1905221 WARN  (SUITE-MetricsHandlerTest-seed#[94D22ADBC8E927F9]-worker)
[    ] o.a.s.SolrTestCaseJ4 startTrackingSearchers: numOpens=1 numCloses=1
   [junit4]   2> 1905222 INFO  (SUITE-MetricsHandlerTest-seed#[94D22ADBC8E927F9]-worker)
[    ] o.a.s.SolrTestCaseJ4 Using TrieFields
   [junit4]   2> 1905223 INFO  (SUITE-MetricsHandlerTest-seed#[94D22ADBC8E927F9]-worker)
[    ] o.a.s.SolrTestCaseJ4 Randomized ssl (true) and clientAuth (false) via: @org.apache.solr.util.RandomizeSSL(reason="",
ssl=0.0/0.0, value=0.0/0.0, clientAuth=0.0/0.0)
   [junit4]   2> 1905224 INFO  (SUITE-MetricsHandlerTest-seed#[94D22ADBC8E927F9]-worker)
[    ] o.a.s.SolrTestCaseJ4 ####initCore
   [junit4]   2> 1905224 INFO  (SUITE-MetricsHandlerTest-seed#[94D22ADBC8E927F9]-worker)
[    ] o.a.s.c.SolrResourceLoader [null] Added 2 libs to classloader, from paths: [/home/jenkins/workspace/Lucene-Solr-master-Linux/solr/core/src/test-files/solr/collection1/lib,
/home/jenkins/workspace/Lucene-Solr-master-Linux/solr/core/src/test-files/solr/collection1/lib/classes]
   [junit4]   2> 1905302 INFO  (SUITE-MetricsHandlerTest-seed#[94D22ADBC8E927F9]-worker)
[    ] o.a.s.c.SolrConfig Using Lucene MatchVersion: 7.0.0
   [junit4]   2> 1905319 INFO  (SUITE-MetricsHandlerTest-seed#[94D22ADBC8E927F9]-worker)
[    ] o.a.s.s.IndexSchema [null] Schema name=test
   [junit4]   2> 1905393 WARN  (SUITE-MetricsHandlerTest-seed#[94D22ADBC8E927F9]-worker)
[    ] o.a.s.s.IndexSchema [null] default search field in schema is text. WARNING: Deprecated,
please use 'df' on request instead.
   [junit4]   2> 1905395 INFO  (SUITE-MetricsHandlerTest-seed#[94D22ADBC8E927F9]-worker)
[    ] o.a.s.s.IndexSchema Loaded schema test/1.0 with uniqueid field id
   [junit4]   2> 1905491 INFO  (SUITE-MetricsHandlerTest-seed#[94D22ADBC8E927F9]-worker)
[    ] o.a.s.m.r.SolrJmxReporter JMX monitoring for 'solr.node' (registry 'solr.node') enabled
at server: com.sun.jmx.mbeanserver.JmxMBeanServer@1e51075
   [junit4]   2> 1905494 INFO  (SUITE-MetricsHandlerTest-seed#[94D22ADBC8E927F9]-worker)
[    ] o.a.s.m.r.SolrJmxReporter JMX monitoring for 'solr.jvm' (registry 'solr.jvm') enabled
at server: com.sun.jmx.mbeanserver.JmxMBeanServer@1e51075
   [junit4]   2> 1905495 INFO  (SUITE-MetricsHandlerTest-seed#[94D22ADBC8E927F9]-worker)
[    ] o.a.s.m.r.SolrJmxReporter JMX monitoring for 'solr.jetty' (registry 'solr.jetty') enabled
at server: com.sun.jmx.mbeanserver.JmxMBeanServer@1e51075
   [junit4]   2> 1905496 INFO  (coreLoadExecutor-6581-thread-1) [    ] o.a.s.c.SolrResourceLoader
[null] Added 2 libs to classloader, from paths: [/home/jenkins/workspace/Lucene-Solr-master-Linux/solr/core/src/test-files/solr/collection1/lib,
/home/jenkins/workspace/Lucene-Solr-master-Linux/solr/core/src/test-files/solr/collection1/lib/classes]
   [junit4]   2> 1905564 INFO  (coreLoadExecutor-6581-thread-1) [    ] o.a.s.c.SolrConfig
Using Lucene MatchVersion: 7.0.0
   [junit4]   2> 1905581 INFO  (coreLoadExecutor-6581-thread-1) [    ] o.a.s.s.IndexSchema
[collection1] Schema name=test
   [junit4]   2> 1905660 WARN  (coreLoadExecutor-6581-thread-1) [    ] o.a.s.s.IndexSchema
[collection1] default search field in schema is text. WARNING: Deprecated, please use 'df'
on request instead.
   [junit4]   2> 1905664 INFO  (coreLoadExecutor-6581-thread-1) [    ] o.a.s.s.IndexSchema
Loaded schema test/1.0 with uniqueid field id
   [junit4]   2> 1905686 INFO  (coreLoadExecutor-6581-thread-1) [    ] o.a.s.c.CoreContainer
Creating SolrCore 'collection1' using configuration from instancedir /home/jenkins/workspace/Lucene-Solr-master-Linux/solr/core/src/test-files/solr/collection1,
trusted=true
   [junit4]   2> 1905686 INFO  (coreLoadExecutor-6581-thread-1) [    ] o.a.s.m.r.SolrJmxReporter
JMX monitoring for 'solr.core.collection1' (registry 'solr.core.collection1') enabled at server:
com.sun.jmx.mbeanserver.JmxMBeanServer@1e51075
   [junit4]   2> 1905687 INFO  (coreLoadExecutor-6581-thread-1) [    ] o.a.s.c.SolrCore
solr.RecoveryStrategy.Builder
   [junit4]   2> 1905687 INFO  (coreLoadExecutor-6581-thread-1) [    ] o.a.s.c.SolrCore
[[collection1] ] Opening new SolrCore at [/home/jenkins/workspace/Lucene-Solr-master-Linux/solr/core/src/test-files/solr/collection1],
dataDir=[/home/jenkins/workspace/Lucene-Solr-master-Linux/solr/build/solr-core/test/J1/temp/solr.handler.admin.MetricsHandlerTest_94D22ADBC8E927F9-001/init-core-data-001/]
   [junit4]   2> 1905688 INFO  (coreLoadExecutor-6581-thread-1) [    ] o.a.s.u.RandomMergePolicy
RandomMergePolicy wrapping class org.apache.lucene.index.TieredMergePolicy: [TieredMergePolicy:
maxMergeAtOnce=34, maxMergeAtOnceExplicit=49, maxMergedSegmentMB=48.9248046875, floorSegmentMB=0.330078125,
forceMergeDeletesPctAllowed=0.7808419282448587, segmentsPerTier=37.0, maxCFSSegmentSizeMB=8.796093022207999E12,
noCFSRatio=1.0
   [junit4]   2> 1905890 INFO  (coreLoadExecutor-6581-thread-1) [    ] o.a.s.u.UpdateHandler
Using UpdateLog implementation: org.apache.solr.update.UpdateLog
   [junit4]   2> 1905890 INFO  (coreLoadExecutor-6581-thread-1) [    ] o.a.s.u.UpdateLog
Initializing UpdateLog: dataDir= defaultSyncLevel=FLUSH numRecordsToKeep=100 maxNumLogsToKeep=10
numVersionBuckets=65536
   [junit4]   2> 1905891 INFO  (coreLoadExecutor-6581-thread-1) [    ] o.a.s.u.CommitTracker
Hard AutoCommit: disabled
   [junit4]   2> 1905891 INFO  (coreLoadExecutor-6581-thread-1) [    ] o.a.s.u.CommitTracker
Soft AutoCommit: disabled
   [junit4]   2> 1905892 INFO  (coreLoadExecutor-6581-thread-1) [    ] o.a.s.u.RandomMergePolicy
RandomMergePolicy wrapping class org.apache.lucene.index.MockRandomMergePolicy: org.apache.lucene.index.MockRandomMergePolicy@28911a
   [junit4]   2> 1905892 INFO  (coreLoadExecutor-6581-thread-1) [    ] o.a.s.s.SolrIndexSearcher
Opening [Searcher@16f2611[collection1] main]
   [junit4]   2> 1905893 INFO  (coreLoadExecutor-6581-thread-1) [    ] o.a.s.h.c.SpellCheckComponent
Initializing spell checkers
   [junit4]   2> 1905936 INFO  (coreLoadExecutor-6581-thread-1) [    ] o.a.s.s.DirectSolrSpellChecker
init: {name=direct,classname=DirectSolrSpellChecker,field=lowerfilt,minQueryLength=3}
   [junit4]   2> 1906155 INFO  (coreLoadExecutor-6581-thread-1) [    ] o.a.s.h.ReplicationHandler
Commits will be reserved for  10000
   [junit4]   2> 1906155 INFO  (searcherExecutor-6582-thread-1) [    ] o.a.s.h.c.SpellCheckComponent
Loading spell index for spellchecker: default
   [junit4]   2> 1906155 INFO  (coreLoadExecutor-6581-thread-1) [    ] o.a.s.u.UpdateLog
Could not find max version in index or recent updates, using new clock 1565159047864254464
   [junit4]   2> 1906157 INFO  (searcherExecutor-6582-thread-1) [    ] o.a.s.h.c.SpellCheckComponent
Loading spell index for spellchecker: direct
   [junit4]   2> 1906157 INFO  (searcherExecutor-6582-thread-1) [    ] o.a.s.h.c.SpellCheckComponent
Loading spell index for spellchecker: wordbreak
   [junit4]   2> 1906157 INFO  (searcherExecutor-6582-thread-1) [    ] o.a.s.h.c.SpellCheckComponent
Loading spell index for spellchecker: multipleFields
   [junit4]   2> 1906158 INFO  (SUITE-MetricsHandlerTest-seed#[94D22ADBC8E927F9]-worker)
[    ] o.a.s.SolrTestCaseJ4 ####initCore end
   [junit4]   2> 1906160 INFO  (searcherExecutor-6582-thread-1) [    ] o.a.s.h.c.SpellCheckComponent
Loading spell index for spellchecker: jarowinkler
   [junit4]   2> 1906161 INFO  (TEST-MetricsHandlerTest.testPropertyFilter-seed#[94D22ADBC8E927F9])
[    ] o.a.s.SolrTestCaseJ4 ###Starting testPropertyFilter
   [junit4]   2> 1906162 INFO  (TEST-MetricsHandlerTest.testPropertyFilter-seed#[94D22ADBC8E927F9])
[    ] o.a.s.SolrTestCaseJ4 ###Ending testPropertyFilter
   [junit4]   2> 1906163 INFO  (searcherExecutor-6582-thread-1) [    ] o.a.s.h.c.SpellCheckComponent
Loading spell index for spellchecker: external
   [junit4]   2> NOTE: reproduce with: ant test  -Dtestcase=MetricsHandlerTest -Dtests.method=testPropertyFilter
-Dtests.seed=94D22ADBC8E927F9 -Dtests.multiplier=3 -Dtests.slow=true -Dtests.locale=bm-ML
-Dtests.timezone=America/Maceio -Dtests.asserts=true -Dtests.file.encoding=UTF-8
   [junit4] FAILURE 0.01s J1 | MetricsHandlerTest.testPropertyFilter <<<
   [junit4]    > Throwable #1: java.lang.AssertionError
   [junit4]    > 	at __randomizedtesting.SeedInfo.seed([94D22ADBC8E927F9:F6BFD49A076747C7]:0)
   [junit4]    > 	at org.apache.solr.handler.admin.MetricsHandlerTest.testPropertyFilter(MetricsHandlerTest.java:201)
   [junit4]    > 	at java.base/jdk.internal.reflect.NativeMethodAccessorImpl.invoke0(Native
Method)
   [junit4]    > 	at java.base/jdk.internal.reflect.NativeMethodAccessorImpl.invoke(NativeMethodAccessorImpl.java:62)
   [junit4]    > 	at java.base/jdk.internal.reflect.DelegatingMethodAccessorImpl.invoke(DelegatingMethodAccessorImpl.java:43)
   [junit4]    > 	at java.base/java.lang.reflect.Method.invoke(Method.java:563)
   [junit4]    > 	at java.base/java.lang.Thread.run(Thread.java:844)
   [junit4]   2> 1906165 INFO  (searcherExecutor-6582-thread-1) [    ] o.a.s.h.c.SpellCheckComponent
Loading spell index for spellchecker: freq
   [junit4]   2> 1906166 INFO  (TEST-MetricsHandlerTest.testCompact-seed#[94D22ADBC8E927F9])
[    ] o.a.s.SolrTestCaseJ4 ###Starting testCompact
   [junit4]   2> 1906168 INFO  (searcherExecutor-6582-thread-1) [    ] o.a.s.h.c.SpellCheckComponent
Loading spell index for spellchecker: fqcn
   [junit4]   2> 1906171 INFO  (searcherExecutor-6582-thread-1) [    ] o.a.s.h.c.SpellCheckComponent
Loading spell index for spellchecker: perDict
   [junit4]   2> 1906174 INFO  (searcherExecutor-6582-thread-1) [    ] o.a.s.c.SolrCore
[collection1] Registered new searcher Searcher@16f2611[collection1] main{ExitableDirectoryReader(UninvertingDirectoryReader())}
   [junit4]   2> 1906175 INFO  (TEST-MetricsHandlerTest.testCompact-seed#[94D22ADBC8E927F9])
[    ] o.a.s.c.TransientSolrCoreCacheDefault Allocating transient cache for 2147483647 transient
cores
   [junit4]   2> 1906181 INFO  (TEST-MetricsHandlerTest.testCompact-seed#[94D22ADBC8E927F9])
[    ] o.a.s.SolrTestCaseJ4 ###Ending testCompact
   [junit4]   2> 1906186 INFO  (TEST-MetricsHandlerTest.test-seed#[94D22ADBC8E927F9]) [
   ] o.a.s.SolrTestCaseJ4 ###Starting test
   [junit4]   2> 1906219 INFO  (TEST-MetricsHandlerTest.test-seed#[94D22ADBC8E927F9]) [
   ] o.a.s.SolrTestCaseJ4 ###Ending test
   [junit4]   2> 1906219 INFO  (SUITE-MetricsHandlerTest-seed#[94D22ADBC8E927F9]-worker)
[    ] o.a.s.SolrTestCaseJ4 ###deleteCore
   [junit4]   2> 1906219 INFO  (SUITE-MetricsHandlerTest-seed#[94D22ADBC8E927F9]-worker)
[    ] o.a.s.c.CoreContainer Shutting down CoreContainer instance=1818227
   [junit4]   2> 1906219 INFO  (SUITE-MetricsHandlerTest-seed#[94D22ADBC8E927F9]-worker)
[    ] o.a.s.m.SolrMetricManager Closing metric reporters for registry=solr.node, tag=null
   [junit4]   2> 1906222 INFO  (SUITE-MetricsHandlerTest-seed#[94D22ADBC8E927F9]-worker)
[    ] o.a.s.m.SolrMetricManager Closing metric reporters for registry=solr.jvm, tag=null
   [junit4]   2> 1906224 INFO  (SUITE-MetricsHandlerTest-seed#[94D22ADBC8E927F9]-worker)
[    ] o.a.s.m.SolrMetricManager Closing metric reporters for registry=solr.jetty, tag=null
   [junit4]   2> 1906224 INFO  (coreCloseExecutor-6587-thread-1) [    ] o.a.s.c.SolrCore
[collection1]  CLOSING SolrCore org.apache.solr.core.SolrCore@2d9eba
   [junit4]   2> 1906225 INFO  (coreCloseExecutor-6587-thread-1) [    ] o.a.s.m.SolrMetricManager
Closing metric reporters for registry=solr.core.collection1, tag=2989754
   [junit4]   2> NOTE: leaving temporary files on disk at: /home/jenkins/workspace/Lucene-Solr-master-Linux/solr/build/solr-core/test/J1/temp/solr.handler.admin.MetricsHandlerTest_94D22ADBC8E927F9-001
   [junit4]   2> Apr 20, 2017 1:33:05 AM com.carrotsearch.randomizedtesting.ThreadLeakControl
checkThreadLeaks
   [junit4]   2> WARNING: Will linger awaiting termination of 1 leaked thread(s).
   [junit4]   2> NOTE: test params are: codec=Asserting(Lucene70): {}, docValues:{}, maxPointsInLeafNode=191,
maxMBSortInHeap=6.899155067636718, sim=RandomSimilarity(queryNorm=true): {}, locale=bm-ML,
timezone=America/Maceio
   [junit4]   2> NOTE: Linux 4.4.0-72-generic i386/Oracle Corporation 9-ea (32-bit)/cpus=12,threads=1,free=243407704,total=412614656
   [junit4]   2> NOTE: All tests run in this JVM: [TestEmbeddedSolrServerConstructors,
DistribCursorPagingTest, TestComplexPhraseLeadingWildcard, TestSurroundQueryParser, TestRecoveryHdfs,
TestXIncludeConfig, TestDynamicLoading, ZkStateReaderTest, BlockJoinFacetSimpleTest, TestClusterProperties,
ConnectionManagerTest, HLLUtilTest, IndexBasedSpellCheckerTest, DocumentBuilderTest, SolrIndexSplitterTest,
ReplicationFactorTest, UpdateRequestProcessorFactoryTest, TestSearchPerf, TestCloudManagedSchema,
TestSolrCoreParser, TestFieldSortValues, HighlighterTest, TestElisionMultitermQuery, TestFuzzyAnalyzedSuggestions,
TestQueryTypes, TestRequestForwarding, IgnoreCommitOptimizeUpdateProcessorFactoryTest, TestConfigSets,
SolrMetricManagerTest, SpellCheckCollatorTest, TestFiltering, SolrCmdDistributorTest, TestFieldCache,
DistanceFunctionTest, SchemaVersionSpecificBehaviorTest, TestJavabinTupleStreamParser, TestDefaultSearchFieldResource,
TestQueryUtils, ClassificationUpdateProcessorTest, CSVRequestHandlerTest, SolrIndexMetricsTest,
TermsComponentTest, TestHashQParserPlugin, TestMacroExpander, TestCoreAdminApis, TestCloudPivotFacet,
TestSolrCloudSnapshots, BlockCacheTest, TestNoOpRegenerator, TestPerFieldSimilarity, TestSolrCLIRunExample,
DistributedFacetExistsSmallTest, MoreLikeThisHandlerTest, TestLockTree, TestSimpleTrackingShardHandler,
SharedFSAutoReplicaFailoverTest, TestExactStatsCache, TestTrie, OverseerStatusTest, InfoHandlerTest,
TermVectorComponentTest, HdfsDirectoryFactoryTest, TestRandomCollapseQParserPlugin, CdcrRequestHandlerTest,
TestBlobHandler, ConnectionReuseTest, TestCursorMarkWithoutUniqueKey, PreAnalyzedFieldManagedSchemaCloudTest,
BJQParserTest, TestSolrQueryParserDefaultOperatorResource, RuleEngineTest, ResourceLoaderTest,
CdcrUpdateLogTest, TestSweetSpotSimilarityFactory, TriLevelCompositeIdRoutingTest, TestScoreJoinQPScore,
TestPKIAuthenticationPlugin, TolerantUpdateProcessorTest, DOMUtilTest, DistributedIntervalFacetingTest,
DeleteReplicaTest, BooleanFieldTest, ShardRoutingTest, LeaderFailoverAfterPartitionTest, TestFileDictionaryLookup,
SolrInfoBeanTest, TestCharFilters, DeleteInactiveReplicaTest, TestCoreContainer, TestFastLRUCache,
ShufflingReplicaListTransformerTest, TestMaxScoreQueryParser, SliceStateTest, DistributedTermsComponentTest,
TestLRUCache, FacetPivotSmallTest, ZkControllerTest, BasicFunctionalityTest, SuggesterFSTTest,
CdcrBootstrapTest, SimpleMLTQParserTest, SecurityConfHandlerTest, SortByFunctionTest, DirectSolrConnectionTest,
TestSystemIdResolver, AnalyticsMergeStrategyTest, TestLeaderElectionZkExpiry, WordBreakSolrSpellCheckerTest,
TestStressRecovery, IndexSchemaTest, DistributedQueryComponentCustomSortTest, TestExclusionRuleCollectionAccess,
SpellCheckCollatorWithCollapseTest, SortSpecParsingTest, FileUtilsTest, SolrSlf4jReporterTest,
SSLMigrationTest, TestConfigSetsAPIExclusivity, BasicDistributedZkTest, ChaosMonkeySafeLeaderTest,
UnloadDistributedZkTest, OpenCloseCoreStressTest, OverseerTest, BasicZkTest, RecoveryZkTest,
FullSolrCloudDistribCmdsTest, TestZkChroot, ZkCLITest, TestFaceting, TestRecovery, DistributedSpellCheckComponentTest,
TestJoin, SolrCoreTest, TestGroupingSearch, QueryElevationComponentTest, ConvertedLegacyTest,
TestFunctionQuery, TestIndexSearcher, SoftAutoCommitTest, DirectUpdateHandlerOptimizeTest,
TestRemoteStreaming, DocValuesMultiTest, CacheHeaderTest, LukeRequestHandlerTest, TestReversedWildcardFilterFactory,
DocumentAnalysisRequestHandlerTest, TestValueSourceCache, FieldAnalysisRequestHandlerTest,
IndexSchemaRuntimeFieldTest, LoggingHandlerTest, TestCSVResponseWriter, UniqFieldsUpdateProcessorFactoryTest,
BinaryUpdateRequestHandlerTest, PingRequestHandlerTest, TestLFUCache, PreAnalyzedFieldTest,
PrimUtilsTest, TestSuggestSpellingConverter, RAMDirectoryFactoryTest, TestSolrJ, TestDocumentBuilder,
ZkNodePropsTest, SystemInfoHandlerTest, DistributedMLTComponentTest, TestRTGBase, TestTolerantSearch,
TestEmbeddedSolrServerSchemaAPI, AssignTest, BaseCdcrDistributedZkTest, CdcrReplicationDistributedZkTest,
CdcrReplicationHandlerTest, CleanupOldIndexTest, CollectionsAPISolrJTest, DistributedQueueTest,
ForceLeaderTest, SaslZkACLProviderTest, SolrCLIZkUtilsTest, SolrCloudExampleTest, TestAuthenticationFramework,
TestConfigSetsAPI, TestRandomFlRTGCloud, TestRebalanceLeaders, TestShortCircuitedRequests,
TestStressInPlaceUpdates, TestSolrConfigHandlerConcurrent, V2ApiIntegrationTest, CoreAdminCreateDiscoverTest,
CoreMergeIndexesAdminHandlerTest, MetricsHandlerTest]
   [junit4] Completed [566/702 (1!)] on J1 in 1.28s, 3 tests, 1 failure <<< FAILURES!

[...truncated 36679 lines...]


Mime
View raw message