lucene-dev mailing list archives

Site index · List index
Message view « Date » · « Thread »
Top « Date » · « Thread »
From Policeman Jenkins Server <jenk...@thetaphi.de>
Subject [JENKINS] Lucene-Solr-master-Linux (32bit/jdk1.8.0_121) - Build # 19436 - Still Unstable!
Date Thu, 20 Apr 2017 04:38:47 GMT
Build: https://jenkins.thetaphi.de/job/Lucene-Solr-master-Linux/19436/
Java: 32bit/jdk1.8.0_121 -server -XX:+UseParallelGC

2 tests failed.
FAILED:  junit.framework.TestSuite.org.apache.solr.util.TestSolrCLIRunExample

Error Message:
ObjectTracker found 5 object(s) that were not released!!! [MockDirectoryWrapper, TransactionLog, MockDirectoryWrapper, MDCAwareThreadPoolExecutor, MockDirectoryWrapper] org.apache.solr.common.util.ObjectReleaseTracker$ObjectTrackerException: org.apache.lucene.store.MockDirectoryWrapper  at org.apache.solr.common.util.ObjectReleaseTracker.track(ObjectReleaseTracker.java:42)  at org.apache.solr.core.CachingDirectoryFactory.get(CachingDirectoryFactory.java:347)  at org.apache.solr.core.SolrCore.getNewIndexDir(SolrCore.java:360)  at org.apache.solr.core.SolrCore.initIndex(SolrCore.java:720)  at org.apache.solr.core.SolrCore.<init>(SolrCore.java:947)  at org.apache.solr.core.SolrCore.<init>(SolrCore.java:854)  at org.apache.solr.core.CoreContainer.create(CoreContainer.java:958)  at org.apache.solr.core.CoreContainer.create(CoreContainer.java:893)  at org.apache.solr.handler.admin.CoreAdminOperation.lambda$static$0(CoreAdminOperation.java:88)  at org.apache.solr.handler.admin.CoreAdminOperation.execute(CoreAdminOperation.java:370)  at org.apache.solr.handler.admin.CoreAdminHandler$CallInfo.call(CoreAdminHandler.java:388)  at org.apache.solr.handler.admin.CoreAdminHandler.handleRequestBody(CoreAdminHandler.java:174)  at org.apache.solr.handler.RequestHandlerBase.handleRequest(RequestHandlerBase.java:178)  at org.apache.solr.servlet.HttpSolrCall.handleAdmin(HttpSolrCall.java:747)  at org.apache.solr.servlet.HttpSolrCall.handleAdminRequest(HttpSolrCall.java:728)  at org.apache.solr.servlet.HttpSolrCall.call(HttpSolrCall.java:509)  at org.apache.solr.servlet.SolrDispatchFilter.doFilter(SolrDispatchFilter.java:355)  at org.apache.solr.servlet.SolrDispatchFilter.doFilter(SolrDispatchFilter.java:306)  at org.eclipse.jetty.servlet.ServletHandler$CachedChain.doFilter(ServletHandler.java:1699)  at org.apache.solr.client.solrj.embedded.JettySolrRunner$DebugFilter.doFilter(JettySolrRunner.java:139)  at org.eclipse.jetty.servlet.ServletHandler$CachedChain.doFilter(ServletHandler.java:1699)  at org.eclipse.jetty.servlet.ServletHandler.doHandle(ServletHandler.java:582)  at org.eclipse.jetty.server.session.SessionHandler.doHandle(SessionHandler.java:224)  at org.eclipse.jetty.server.handler.ContextHandler.doHandle(ContextHandler.java:1180)  at org.eclipse.jetty.servlet.ServletHandler.doScope(ServletHandler.java:512)  at org.eclipse.jetty.server.session.SessionHandler.doScope(SessionHandler.java:185)  at org.eclipse.jetty.server.handler.ContextHandler.doScope(ContextHandler.java:1112)  at org.eclipse.jetty.server.handler.ScopedHandler.handle(ScopedHandler.java:141)  at org.eclipse.jetty.server.handler.gzip.GzipHandler.handle(GzipHandler.java:395)  at org.eclipse.jetty.server.handler.HandlerWrapper.handle(HandlerWrapper.java:134)  at org.eclipse.jetty.server.Server.handle(Server.java:534)  at org.eclipse.jetty.server.HttpChannel.handle(HttpChannel.java:320)  at org.eclipse.jetty.server.HttpConnection.onFillable(HttpConnection.java:251)  at org.eclipse.jetty.io.AbstractConnection$ReadCallback.succeeded(AbstractConnection.java:273)  at org.eclipse.jetty.io.FillInterest.fillable(FillInterest.java:95)  at org.eclipse.jetty.io.SelectChannelEndPoint$2.run(SelectChannelEndPoint.java:93)  at org.eclipse.jetty.util.thread.strategy.ExecuteProduceConsume.executeProduceConsume(ExecuteProduceConsume.java:303)  at org.eclipse.jetty.util.thread.strategy.ExecuteProduceConsume.produceConsume(ExecuteProduceConsume.java:148)  at org.eclipse.jetty.util.thread.strategy.ExecuteProduceConsume.run(ExecuteProduceConsume.java:136)  at org.eclipse.jetty.util.thread.QueuedThreadPool.runJob(QueuedThreadPool.java:671)  at org.eclipse.jetty.util.thread.QueuedThreadPool$2.run(QueuedThreadPool.java:589)  at java.lang.Thread.run(Thread.java:745)  org.apache.solr.common.util.ObjectReleaseTracker$ObjectTrackerException: org.apache.solr.update.TransactionLog  at org.apache.solr.common.util.ObjectReleaseTracker.track(ObjectReleaseTracker.java:42)  at org.apache.solr.update.TransactionLog.<init>(TransactionLog.java:190)  at org.apache.solr.update.UpdateLog.newTransactionLog(UpdateLog.java:438)  at org.apache.solr.update.UpdateLog.ensureLog(UpdateLog.java:1250)  at org.apache.solr.update.UpdateLog.add(UpdateLog.java:524)  at org.apache.solr.update.UpdateLog.add(UpdateLog.java:509)  at org.apache.solr.update.DirectUpdateHandler2.doNormalUpdate(DirectUpdateHandler2.java:348)  at org.apache.solr.update.DirectUpdateHandler2.addDoc0(DirectUpdateHandler2.java:267)  at org.apache.solr.update.DirectUpdateHandler2.addDoc(DirectUpdateHandler2.java:217)  at org.apache.solr.update.processor.RunUpdateProcessor.processAdd(RunUpdateProcessorFactory.java:67)  at org.apache.solr.update.processor.UpdateRequestProcessor.processAdd(UpdateRequestProcessor.java:55)  at org.apache.solr.update.processor.DistributedUpdateProcessor.doLocalAdd(DistributedUpdateProcessor.java:991)  at org.apache.solr.update.processor.DistributedUpdateProcessor.versionAdd(DistributedUpdateProcessor.java:1207)  at org.apache.solr.update.processor.DistributedUpdateProcessor.processAdd(DistributedUpdateProcessor.java:753)  at org.apache.solr.update.processor.LogUpdateProcessorFactory$LogUpdateProcessor.processAdd(LogUpdateProcessorFactory.java:103)  at org.apache.solr.update.processor.UpdateRequestProcessor.processAdd(UpdateRequestProcessor.java:55)  at org.apache.solr.update.processor.AddSchemaFieldsUpdateProcessorFactory$AddSchemaFieldsUpdateProcessor.processAdd(AddSchemaFieldsUpdateProcessorFactory.java:336)  at org.apache.solr.update.processor.UpdateRequestProcessor.processAdd(UpdateRequestProcessor.java:55)  at org.apache.solr.update.processor.FieldMutatingUpdateProcessor.processAdd(FieldMutatingUpdateProcessor.java:118)  at org.apache.solr.update.processor.UpdateRequestProcessor.processAdd(UpdateRequestProcessor.java:55)  at org.apache.solr.update.processor.FieldMutatingUpdateProcessor.processAdd(FieldMutatingUpdateProcessor.java:118)  at org.apache.solr.update.processor.UpdateRequestProcessor.processAdd(UpdateRequestProcessor.java:55)  at org.apache.solr.update.processor.FieldMutatingUpdateProcessor.processAdd(FieldMutatingUpdateProcessor.java:118)  at org.apache.solr.update.processor.UpdateRequestProcessor.processAdd(UpdateRequestProcessor.java:55)  at org.apache.solr.update.processor.FieldMutatingUpdateProcessor.processAdd(FieldMutatingUpdateProcessor.java:118)  at org.apache.solr.update.processor.UpdateRequestProcessor.processAdd(UpdateRequestProcessor.java:55)  at org.apache.solr.update.processor.FieldNameMutatingUpdateProcessorFactory$1.processAdd(FieldNameMutatingUpdateProcessorFactory.java:74)  at org.apache.solr.update.processor.UpdateRequestProcessor.processAdd(UpdateRequestProcessor.java:55)  at org.apache.solr.update.processor.FieldMutatingUpdateProcessor.processAdd(FieldMutatingUpdateProcessor.java:118)  at org.apache.solr.update.processor.UpdateRequestProcessor.processAdd(UpdateRequestProcessor.java:55)  at org.apache.solr.update.processor.AbstractDefaultValueUpdateProcessorFactory$DefaultValueUpdateProcessor.processAdd(AbstractDefaultValueUpdateProcessorFactory.java:91)  at org.apache.solr.handler.loader.JavabinLoader$1.update(JavabinLoader.java:98)  at org.apache.solr.client.solrj.request.JavaBinUpdateRequestCodec$1.readOuterMostDocIterator(JavaBinUpdateRequestCodec.java:187)  at org.apache.solr.client.solrj.request.JavaBinUpdateRequestCodec$1.readIterator(JavaBinUpdateRequestCodec.java:143)  at org.apache.solr.common.util.JavaBinCodec.readObject(JavaBinCodec.java:313)  at org.apache.solr.common.util.JavaBinCodec.readVal(JavaBinCodec.java:258)  at org.apache.solr.client.solrj.request.JavaBinUpdateRequestCodec$1.readNamedList(JavaBinUpdateRequestCodec.java:129)  at org.apache.solr.common.util.JavaBinCodec.readObject(JavaBinCodec.java:278)  at org.apache.solr.common.util.JavaBinCodec.readVal(JavaBinCodec.java:258)  at org.apache.solr.common.util.JavaBinCodec.unmarshal(JavaBinCodec.java:180)  at org.apache.solr.client.solrj.request.JavaBinUpdateRequestCodec.unmarshal(JavaBinUpdateRequestCodec.java:194)  at org.apache.solr.handler.loader.JavabinLoader.parseAndLoadDocs(JavabinLoader.java:108)  at org.apache.solr.handler.loader.JavabinLoader.load(JavabinLoader.java:55)  at org.apache.solr.handler.UpdateRequestHandler$1.load(UpdateRequestHandler.java:97)  at org.apache.solr.handler.ContentStreamHandlerBase.handleRequestBody(ContentStreamHandlerBase.java:68)  at org.apache.solr.handler.RequestHandlerBase.handleRequest(RequestHandlerBase.java:178)  at org.apache.solr.core.SolrCore.execute(SolrCore.java:2486)  at org.apache.solr.servlet.HttpSolrCall.execute(HttpSolrCall.java:722)  at org.apache.solr.servlet.HttpSolrCall.call(HttpSolrCall.java:528)  at org.apache.solr.servlet.SolrDispatchFilter.doFilter(SolrDispatchFilter.java:355)  at org.apache.solr.servlet.SolrDispatchFilter.doFilter(SolrDispatchFilter.java:306)  at org.eclipse.jetty.servlet.ServletHandler$CachedChain.doFilter(ServletHandler.java:1699)  at org.apache.solr.client.solrj.embedded.JettySolrRunner$DebugFilter.doFilter(JettySolrRunner.java:139)  at org.eclipse.jetty.servlet.ServletHandler$CachedChain.doFilter(ServletHandler.java:1699)  at org.eclipse.jetty.servlet.ServletHandler.doHandle(ServletHandler.java:582)  at org.eclipse.jetty.server.session.SessionHandler.doHandle(SessionHandler.java:224)  at org.eclipse.jetty.server.handler.ContextHandler.doHandle(ContextHandler.java:1180)  at org.eclipse.jetty.servlet.ServletHandler.doScope(ServletHandler.java:512)  at org.eclipse.jetty.server.session.SessionHandler.doScope(SessionHandler.java:185)  at org.eclipse.jetty.server.handler.ContextHandler.doScope(ContextHandler.java:1112)  at org.eclipse.jetty.server.handler.ScopedHandler.handle(ScopedHandler.java:141)  at org.eclipse.jetty.server.handler.gzip.GzipHandler.handle(GzipHandler.java:395)  at org.eclipse.jetty.server.handler.HandlerWrapper.handle(HandlerWrapper.java:134)  at org.eclipse.jetty.server.Server.handle(Server.java:534)  at org.eclipse.jetty.server.HttpChannel.handle(HttpChannel.java:320)  at org.eclipse.jetty.server.HttpConnection.onFillable(HttpConnection.java:251)  at org.eclipse.jetty.io.AbstractConnection$ReadCallback.succeeded(AbstractConnection.java:273)  at org.eclipse.jetty.io.FillInterest.fillable(FillInterest.java:95)  at org.eclipse.jetty.io.SelectChannelEndPoint$2.run(SelectChannelEndPoint.java:93)  at org.eclipse.jetty.util.thread.strategy.ExecuteProduceConsume.executeProduceConsume(ExecuteProduceConsume.java:303)  at org.eclipse.jetty.util.thread.strategy.ExecuteProduceConsume.produceConsume(ExecuteProduceConsume.java:148)  at org.eclipse.jetty.util.thread.strategy.ExecuteProduceConsume.run(ExecuteProduceConsume.java:136)  at org.eclipse.jetty.util.thread.QueuedThreadPool.runJob(QueuedThreadPool.java:671)  at org.eclipse.jetty.util.thread.QueuedThreadPool$2.run(QueuedThreadPool.java:589)  at java.lang.Thread.run(Thread.java:745)  org.apache.solr.common.util.ObjectReleaseTracker$ObjectTrackerException: org.apache.lucene.store.MockDirectoryWrapper  at org.apache.solr.common.util.ObjectReleaseTracker.track(ObjectReleaseTracker.java:42)  at org.apache.solr.core.CachingDirectoryFactory.get(CachingDirectoryFactory.java:347)  at org.apache.solr.update.SolrIndexWriter.create(SolrIndexWriter.java:92)  at org.apache.solr.core.SolrCore.initIndex(SolrCore.java:752)  at org.apache.solr.core.SolrCore.<init>(SolrCore.java:947)  at org.apache.solr.core.SolrCore.<init>(SolrCore.java:854)  at org.apache.solr.core.CoreContainer.create(CoreContainer.java:958)  at org.apache.solr.core.CoreContainer.create(CoreContainer.java:893)  at org.apache.solr.handler.admin.CoreAdminOperation.lambda$static$0(CoreAdminOperation.java:88)  at org.apache.solr.handler.admin.CoreAdminOperation.execute(CoreAdminOperation.java:370)  at org.apache.solr.handler.admin.CoreAdminHandler$CallInfo.call(CoreAdminHandler.java:388)  at org.apache.solr.handler.admin.CoreAdminHandler.handleRequestBody(CoreAdminHandler.java:174)  at org.apache.solr.handler.RequestHandlerBase.handleRequest(RequestHandlerBase.java:178)  at org.apache.solr.servlet.HttpSolrCall.handleAdmin(HttpSolrCall.java:747)  at org.apache.solr.servlet.HttpSolrCall.handleAdminRequest(HttpSolrCall.java:728)  at org.apache.solr.servlet.HttpSolrCall.call(HttpSolrCall.java:509)  at org.apache.solr.servlet.SolrDispatchFilter.doFilter(SolrDispatchFilter.java:355)  at org.apache.solr.servlet.SolrDispatchFilter.doFilter(SolrDispatchFilter.java:306)  at org.eclipse.jetty.servlet.ServletHandler$CachedChain.doFilter(ServletHandler.java:1699)  at org.apache.solr.client.solrj.embedded.JettySolrRunner$DebugFilter.doFilter(JettySolrRunner.java:139)  at org.eclipse.jetty.servlet.ServletHandler$CachedChain.doFilter(ServletHandler.java:1699)  at org.eclipse.jetty.servlet.ServletHandler.doHandle(ServletHandler.java:582)  at org.eclipse.jetty.server.session.SessionHandler.doHandle(SessionHandler.java:224)  at org.eclipse.jetty.server.handler.ContextHandler.doHandle(ContextHandler.java:1180)  at org.eclipse.jetty.servlet.ServletHandler.doScope(ServletHandler.java:512)  at org.eclipse.jetty.server.session.SessionHandler.doScope(SessionHandler.java:185)  at org.eclipse.jetty.server.handler.ContextHandler.doScope(ContextHandler.java:1112)  at org.eclipse.jetty.server.handler.ScopedHandler.handle(ScopedHandler.java:141)  at org.eclipse.jetty.server.handler.gzip.GzipHandler.handle(GzipHandler.java:395)  at org.eclipse.jetty.server.handler.HandlerWrapper.handle(HandlerWrapper.java:134)  at org.eclipse.jetty.server.Server.handle(Server.java:534)  at org.eclipse.jetty.server.HttpChannel.handle(HttpChannel.java:320)  at org.eclipse.jetty.server.HttpConnection.onFillable(HttpConnection.java:251)  at org.eclipse.jetty.io.AbstractConnection$ReadCallback.succeeded(AbstractConnection.java:273)  at org.eclipse.jetty.io.FillInterest.fillable(FillInterest.java:95)  at org.eclipse.jetty.io.SelectChannelEndPoint$2.run(SelectChannelEndPoint.java:93)  at org.eclipse.jetty.util.thread.strategy.ExecuteProduceConsume.executeProduceConsume(ExecuteProduceConsume.java:303)  at org.eclipse.jetty.util.thread.strategy.ExecuteProduceConsume.produceConsume(ExecuteProduceConsume.java:148)  at org.eclipse.jetty.util.thread.strategy.ExecuteProduceConsume.run(ExecuteProduceConsume.java:136)  at org.eclipse.jetty.util.thread.QueuedThreadPool.runJob(QueuedThreadPool.java:671)  at org.eclipse.jetty.util.thread.QueuedThreadPool$2.run(QueuedThreadPool.java:589)  at java.lang.Thread.run(Thread.java:745)  org.apache.solr.common.util.ObjectReleaseTracker$ObjectTrackerException: org.apache.solr.common.util.ExecutorUtil$MDCAwareThreadPoolExecutor  at org.apache.solr.common.util.ObjectReleaseTracker.track(ObjectReleaseTracker.java:42)  at org.apache.solr.core.SolrCore.<init>(SolrCore.java:883)  at org.apache.solr.core.SolrCore.reload(SolrCore.java:647)  at org.apache.solr.core.CoreContainer.reload(CoreContainer.java:1154)  at org.apache.solr.core.SolrCore.lambda$getConfListener$18(SolrCore.java:2949)  at org.apache.solr.cloud.ZkController.lambda$fireEventListeners$4(ZkController.java:2349)  at java.lang.Thread.run(Thread.java:745)  org.apache.solr.common.util.ObjectReleaseTracker$ObjectTrackerException: org.apache.lucene.store.MockDirectoryWrapper  at org.apache.solr.common.util.ObjectReleaseTracker.track(ObjectReleaseTracker.java:42)  at org.apache.solr.core.CachingDirectoryFactory.get(CachingDirectoryFactory.java:347)  at org.apache.solr.core.SolrCore.initSnapshotMetaDataManager(SolrCore.java:489)  at org.apache.solr.core.SolrCore.<init>(SolrCore.java:941)  at org.apache.solr.core.SolrCore.<init>(SolrCore.java:854)  at org.apache.solr.core.CoreContainer.create(CoreContainer.java:958)  at org.apache.solr.core.CoreContainer.create(CoreContainer.java:893)  at org.apache.solr.handler.admin.CoreAdminOperation.lambda$static$0(CoreAdminOperation.java:88)  at org.apache.solr.handler.admin.CoreAdminOperation.execute(CoreAdminOperation.java:370)  at org.apache.solr.handler.admin.CoreAdminHandler$CallInfo.call(CoreAdminHandler.java:388)  at org.apache.solr.handler.admin.CoreAdminHandler.handleRequestBody(CoreAdminHandler.java:174)  at org.apache.solr.handler.RequestHandlerBase.handleRequest(RequestHandlerBase.java:178)  at org.apache.solr.servlet.HttpSolrCall.handleAdmin(HttpSolrCall.java:747)  at org.apache.solr.servlet.HttpSolrCall.handleAdminRequest(HttpSolrCall.java:728)  at org.apache.solr.servlet.HttpSolrCall.call(HttpSolrCall.java:509)  at org.apache.solr.servlet.SolrDispatchFilter.doFilter(SolrDispatchFilter.java:355)  at org.apache.solr.servlet.SolrDispatchFilter.doFilter(SolrDispatchFilter.java:306)  at org.eclipse.jetty.servlet.ServletHandler$CachedChain.doFilter(ServletHandler.java:1699)  at org.apache.solr.client.solrj.embedded.JettySolrRunner$DebugFilter.doFilter(JettySolrRunner.java:139)  at org.eclipse.jetty.servlet.ServletHandler$CachedChain.doFilter(ServletHandler.java:1699)  at org.eclipse.jetty.servlet.ServletHandler.doHandle(ServletHandler.java:582)  at org.eclipse.jetty.server.session.SessionHandler.doHandle(SessionHandler.java:224)  at org.eclipse.jetty.server.handler.ContextHandler.doHandle(ContextHandler.java:1180)  at org.eclipse.jetty.servlet.ServletHandler.doScope(ServletHandler.java:512)  at org.eclipse.jetty.server.session.SessionHandler.doScope(SessionHandler.java:185)  at org.eclipse.jetty.server.handler.ContextHandler.doScope(ContextHandler.java:1112)  at org.eclipse.jetty.server.handler.ScopedHandler.handle(ScopedHandler.java:141)  at org.eclipse.jetty.server.handler.gzip.GzipHandler.handle(GzipHandler.java:395)  at org.eclipse.jetty.server.handler.HandlerWrapper.handle(HandlerWrapper.java:134)  at org.eclipse.jetty.server.Server.handle(Server.java:534)  at org.eclipse.jetty.server.HttpChannel.handle(HttpChannel.java:320)  at org.eclipse.jetty.server.HttpConnection.onFillable(HttpConnection.java:251)  at org.eclipse.jetty.io.AbstractConnection$ReadCallback.succeeded(AbstractConnection.java:273)  at org.eclipse.jetty.io.FillInterest.fillable(FillInterest.java:95)  at org.eclipse.jetty.io.SelectChannelEndPoint$2.run(SelectChannelEndPoint.java:93)  at org.eclipse.jetty.util.thread.strategy.ExecuteProduceConsume.executeProduceConsume(ExecuteProduceConsume.java:303)  at org.eclipse.jetty.util.thread.strategy.ExecuteProduceConsume.produceConsume(ExecuteProduceConsume.java:148)  at org.eclipse.jetty.util.thread.strategy.ExecuteProduceConsume.run(ExecuteProduceConsume.java:136)  at org.eclipse.jetty.util.thread.QueuedThreadPool.runJob(QueuedThreadPool.java:671)  at org.eclipse.jetty.util.thread.QueuedThreadPool$2.run(QueuedThreadPool.java:589)  at java.lang.Thread.run(Thread.java:745)  

Stack Trace:
java.lang.AssertionError: ObjectTracker found 5 object(s) that were not released!!! [MockDirectoryWrapper, TransactionLog, MockDirectoryWrapper, MDCAwareThreadPoolExecutor, MockDirectoryWrapper]
org.apache.solr.common.util.ObjectReleaseTracker$ObjectTrackerException: org.apache.lucene.store.MockDirectoryWrapper
	at org.apache.solr.common.util.ObjectReleaseTracker.track(ObjectReleaseTracker.java:42)
	at org.apache.solr.core.CachingDirectoryFactory.get(CachingDirectoryFactory.java:347)
	at org.apache.solr.core.SolrCore.getNewIndexDir(SolrCore.java:360)
	at org.apache.solr.core.SolrCore.initIndex(SolrCore.java:720)
	at org.apache.solr.core.SolrCore.<init>(SolrCore.java:947)
	at org.apache.solr.core.SolrCore.<init>(SolrCore.java:854)
	at org.apache.solr.core.CoreContainer.create(CoreContainer.java:958)
	at org.apache.solr.core.CoreContainer.create(CoreContainer.java:893)
	at org.apache.solr.handler.admin.CoreAdminOperation.lambda$static$0(CoreAdminOperation.java:88)
	at org.apache.solr.handler.admin.CoreAdminOperation.execute(CoreAdminOperation.java:370)
	at org.apache.solr.handler.admin.CoreAdminHandler$CallInfo.call(CoreAdminHandler.java:388)
	at org.apache.solr.handler.admin.CoreAdminHandler.handleRequestBody(CoreAdminHandler.java:174)
	at org.apache.solr.handler.RequestHandlerBase.handleRequest(RequestHandlerBase.java:178)
	at org.apache.solr.servlet.HttpSolrCall.handleAdmin(HttpSolrCall.java:747)
	at org.apache.solr.servlet.HttpSolrCall.handleAdminRequest(HttpSolrCall.java:728)
	at org.apache.solr.servlet.HttpSolrCall.call(HttpSolrCall.java:509)
	at org.apache.solr.servlet.SolrDispatchFilter.doFilter(SolrDispatchFilter.java:355)
	at org.apache.solr.servlet.SolrDispatchFilter.doFilter(SolrDispatchFilter.java:306)
	at org.eclipse.jetty.servlet.ServletHandler$CachedChain.doFilter(ServletHandler.java:1699)
	at org.apache.solr.client.solrj.embedded.JettySolrRunner$DebugFilter.doFilter(JettySolrRunner.java:139)
	at org.eclipse.jetty.servlet.ServletHandler$CachedChain.doFilter(ServletHandler.java:1699)
	at org.eclipse.jetty.servlet.ServletHandler.doHandle(ServletHandler.java:582)
	at org.eclipse.jetty.server.session.SessionHandler.doHandle(SessionHandler.java:224)
	at org.eclipse.jetty.server.handler.ContextHandler.doHandle(ContextHandler.java:1180)
	at org.eclipse.jetty.servlet.ServletHandler.doScope(ServletHandler.java:512)
	at org.eclipse.jetty.server.session.SessionHandler.doScope(SessionHandler.java:185)
	at org.eclipse.jetty.server.handler.ContextHandler.doScope(ContextHandler.java:1112)
	at org.eclipse.jetty.server.handler.ScopedHandler.handle(ScopedHandler.java:141)
	at org.eclipse.jetty.server.handler.gzip.GzipHandler.handle(GzipHandler.java:395)
	at org.eclipse.jetty.server.handler.HandlerWrapper.handle(HandlerWrapper.java:134)
	at org.eclipse.jetty.server.Server.handle(Server.java:534)
	at org.eclipse.jetty.server.HttpChannel.handle(HttpChannel.java:320)
	at org.eclipse.jetty.server.HttpConnection.onFillable(HttpConnection.java:251)
	at org.eclipse.jetty.io.AbstractConnection$ReadCallback.succeeded(AbstractConnection.java:273)
	at org.eclipse.jetty.io.FillInterest.fillable(FillInterest.java:95)
	at org.eclipse.jetty.io.SelectChannelEndPoint$2.run(SelectChannelEndPoint.java:93)
	at org.eclipse.jetty.util.thread.strategy.ExecuteProduceConsume.executeProduceConsume(ExecuteProduceConsume.java:303)
	at org.eclipse.jetty.util.thread.strategy.ExecuteProduceConsume.produceConsume(ExecuteProduceConsume.java:148)
	at org.eclipse.jetty.util.thread.strategy.ExecuteProduceConsume.run(ExecuteProduceConsume.java:136)
	at org.eclipse.jetty.util.thread.QueuedThreadPool.runJob(QueuedThreadPool.java:671)
	at org.eclipse.jetty.util.thread.QueuedThreadPool$2.run(QueuedThreadPool.java:589)
	at java.lang.Thread.run(Thread.java:745)

org.apache.solr.common.util.ObjectReleaseTracker$ObjectTrackerException: org.apache.solr.update.TransactionLog
	at org.apache.solr.common.util.ObjectReleaseTracker.track(ObjectReleaseTracker.java:42)
	at org.apache.solr.update.TransactionLog.<init>(TransactionLog.java:190)
	at org.apache.solr.update.UpdateLog.newTransactionLog(UpdateLog.java:438)
	at org.apache.solr.update.UpdateLog.ensureLog(UpdateLog.java:1250)
	at org.apache.solr.update.UpdateLog.add(UpdateLog.java:524)
	at org.apache.solr.update.UpdateLog.add(UpdateLog.java:509)
	at org.apache.solr.update.DirectUpdateHandler2.doNormalUpdate(DirectUpdateHandler2.java:348)
	at org.apache.solr.update.DirectUpdateHandler2.addDoc0(DirectUpdateHandler2.java:267)
	at org.apache.solr.update.DirectUpdateHandler2.addDoc(DirectUpdateHandler2.java:217)
	at org.apache.solr.update.processor.RunUpdateProcessor.processAdd(RunUpdateProcessorFactory.java:67)
	at org.apache.solr.update.processor.UpdateRequestProcessor.processAdd(UpdateRequestProcessor.java:55)
	at org.apache.solr.update.processor.DistributedUpdateProcessor.doLocalAdd(DistributedUpdateProcessor.java:991)
	at org.apache.solr.update.processor.DistributedUpdateProcessor.versionAdd(DistributedUpdateProcessor.java:1207)
	at org.apache.solr.update.processor.DistributedUpdateProcessor.processAdd(DistributedUpdateProcessor.java:753)
	at org.apache.solr.update.processor.LogUpdateProcessorFactory$LogUpdateProcessor.processAdd(LogUpdateProcessorFactory.java:103)
	at org.apache.solr.update.processor.UpdateRequestProcessor.processAdd(UpdateRequestProcessor.java:55)
	at org.apache.solr.update.processor.AddSchemaFieldsUpdateProcessorFactory$AddSchemaFieldsUpdateProcessor.processAdd(AddSchemaFieldsUpdateProcessorFactory.java:336)
	at org.apache.solr.update.processor.UpdateRequestProcessor.processAdd(UpdateRequestProcessor.java:55)
	at org.apache.solr.update.processor.FieldMutatingUpdateProcessor.processAdd(FieldMutatingUpdateProcessor.java:118)
	at org.apache.solr.update.processor.UpdateRequestProcessor.processAdd(UpdateRequestProcessor.java:55)
	at org.apache.solr.update.processor.FieldMutatingUpdateProcessor.processAdd(FieldMutatingUpdateProcessor.java:118)
	at org.apache.solr.update.processor.UpdateRequestProcessor.processAdd(UpdateRequestProcessor.java:55)
	at org.apache.solr.update.processor.FieldMutatingUpdateProcessor.processAdd(FieldMutatingUpdateProcessor.java:118)
	at org.apache.solr.update.processor.UpdateRequestProcessor.processAdd(UpdateRequestProcessor.java:55)
	at org.apache.solr.update.processor.FieldMutatingUpdateProcessor.processAdd(FieldMutatingUpdateProcessor.java:118)
	at org.apache.solr.update.processor.UpdateRequestProcessor.processAdd(UpdateRequestProcessor.java:55)
	at org.apache.solr.update.processor.FieldNameMutatingUpdateProcessorFactory$1.processAdd(FieldNameMutatingUpdateProcessorFactory.java:74)
	at org.apache.solr.update.processor.UpdateRequestProcessor.processAdd(UpdateRequestProcessor.java:55)
	at org.apache.solr.update.processor.FieldMutatingUpdateProcessor.processAdd(FieldMutatingUpdateProcessor.java:118)
	at org.apache.solr.update.processor.UpdateRequestProcessor.processAdd(UpdateRequestProcessor.java:55)
	at org.apache.solr.update.processor.AbstractDefaultValueUpdateProcessorFactory$DefaultValueUpdateProcessor.processAdd(AbstractDefaultValueUpdateProcessorFactory.java:91)
	at org.apache.solr.handler.loader.JavabinLoader$1.update(JavabinLoader.java:98)
	at org.apache.solr.client.solrj.request.JavaBinUpdateRequestCodec$1.readOuterMostDocIterator(JavaBinUpdateRequestCodec.java:187)
	at org.apache.solr.client.solrj.request.JavaBinUpdateRequestCodec$1.readIterator(JavaBinUpdateRequestCodec.java:143)
	at org.apache.solr.common.util.JavaBinCodec.readObject(JavaBinCodec.java:313)
	at org.apache.solr.common.util.JavaBinCodec.readVal(JavaBinCodec.java:258)
	at org.apache.solr.client.solrj.request.JavaBinUpdateRequestCodec$1.readNamedList(JavaBinUpdateRequestCodec.java:129)
	at org.apache.solr.common.util.JavaBinCodec.readObject(JavaBinCodec.java:278)
	at org.apache.solr.common.util.JavaBinCodec.readVal(JavaBinCodec.java:258)
	at org.apache.solr.common.util.JavaBinCodec.unmarshal(JavaBinCodec.java:180)
	at org.apache.solr.client.solrj.request.JavaBinUpdateRequestCodec.unmarshal(JavaBinUpdateRequestCodec.java:194)
	at org.apache.solr.handler.loader.JavabinLoader.parseAndLoadDocs(JavabinLoader.java:108)
	at org.apache.solr.handler.loader.JavabinLoader.load(JavabinLoader.java:55)
	at org.apache.solr.handler.UpdateRequestHandler$1.load(UpdateRequestHandler.java:97)
	at org.apache.solr.handler.ContentStreamHandlerBase.handleRequestBody(ContentStreamHandlerBase.java:68)
	at org.apache.solr.handler.RequestHandlerBase.handleRequest(RequestHandlerBase.java:178)
	at org.apache.solr.core.SolrCore.execute(SolrCore.java:2486)
	at org.apache.solr.servlet.HttpSolrCall.execute(HttpSolrCall.java:722)
	at org.apache.solr.servlet.HttpSolrCall.call(HttpSolrCall.java:528)
	at org.apache.solr.servlet.SolrDispatchFilter.doFilter(SolrDispatchFilter.java:355)
	at org.apache.solr.servlet.SolrDispatchFilter.doFilter(SolrDispatchFilter.java:306)
	at org.eclipse.jetty.servlet.ServletHandler$CachedChain.doFilter(ServletHandler.java:1699)
	at org.apache.solr.client.solrj.embedded.JettySolrRunner$DebugFilter.doFilter(JettySolrRunner.java:139)
	at org.eclipse.jetty.servlet.ServletHandler$CachedChain.doFilter(ServletHandler.java:1699)
	at org.eclipse.jetty.servlet.ServletHandler.doHandle(ServletHandler.java:582)
	at org.eclipse.jetty.server.session.SessionHandler.doHandle(SessionHandler.java:224)
	at org.eclipse.jetty.server.handler.ContextHandler.doHandle(ContextHandler.java:1180)
	at org.eclipse.jetty.servlet.ServletHandler.doScope(ServletHandler.java:512)
	at org.eclipse.jetty.server.session.SessionHandler.doScope(SessionHandler.java:185)
	at org.eclipse.jetty.server.handler.ContextHandler.doScope(ContextHandler.java:1112)
	at org.eclipse.jetty.server.handler.ScopedHandler.handle(ScopedHandler.java:141)
	at org.eclipse.jetty.server.handler.gzip.GzipHandler.handle(GzipHandler.java:395)
	at org.eclipse.jetty.server.handler.HandlerWrapper.handle(HandlerWrapper.java:134)
	at org.eclipse.jetty.server.Server.handle(Server.java:534)
	at org.eclipse.jetty.server.HttpChannel.handle(HttpChannel.java:320)
	at org.eclipse.jetty.server.HttpConnection.onFillable(HttpConnection.java:251)
	at org.eclipse.jetty.io.AbstractConnection$ReadCallback.succeeded(AbstractConnection.java:273)
	at org.eclipse.jetty.io.FillInterest.fillable(FillInterest.java:95)
	at org.eclipse.jetty.io.SelectChannelEndPoint$2.run(SelectChannelEndPoint.java:93)
	at org.eclipse.jetty.util.thread.strategy.ExecuteProduceConsume.executeProduceConsume(ExecuteProduceConsume.java:303)
	at org.eclipse.jetty.util.thread.strategy.ExecuteProduceConsume.produceConsume(ExecuteProduceConsume.java:148)
	at org.eclipse.jetty.util.thread.strategy.ExecuteProduceConsume.run(ExecuteProduceConsume.java:136)
	at org.eclipse.jetty.util.thread.QueuedThreadPool.runJob(QueuedThreadPool.java:671)
	at org.eclipse.jetty.util.thread.QueuedThreadPool$2.run(QueuedThreadPool.java:589)
	at java.lang.Thread.run(Thread.java:745)

org.apache.solr.common.util.ObjectReleaseTracker$ObjectTrackerException: org.apache.lucene.store.MockDirectoryWrapper
	at org.apache.solr.common.util.ObjectReleaseTracker.track(ObjectReleaseTracker.java:42)
	at org.apache.solr.core.CachingDirectoryFactory.get(CachingDirectoryFactory.java:347)
	at org.apache.solr.update.SolrIndexWriter.create(SolrIndexWriter.java:92)
	at org.apache.solr.core.SolrCore.initIndex(SolrCore.java:752)
	at org.apache.solr.core.SolrCore.<init>(SolrCore.java:947)
	at org.apache.solr.core.SolrCore.<init>(SolrCore.java:854)
	at org.apache.solr.core.CoreContainer.create(CoreContainer.java:958)
	at org.apache.solr.core.CoreContainer.create(CoreContainer.java:893)
	at org.apache.solr.handler.admin.CoreAdminOperation.lambda$static$0(CoreAdminOperation.java:88)
	at org.apache.solr.handler.admin.CoreAdminOperation.execute(CoreAdminOperation.java:370)
	at org.apache.solr.handler.admin.CoreAdminHandler$CallInfo.call(CoreAdminHandler.java:388)
	at org.apache.solr.handler.admin.CoreAdminHandler.handleRequestBody(CoreAdminHandler.java:174)
	at org.apache.solr.handler.RequestHandlerBase.handleRequest(RequestHandlerBase.java:178)
	at org.apache.solr.servlet.HttpSolrCall.handleAdmin(HttpSolrCall.java:747)
	at org.apache.solr.servlet.HttpSolrCall.handleAdminRequest(HttpSolrCall.java:728)
	at org.apache.solr.servlet.HttpSolrCall.call(HttpSolrCall.java:509)
	at org.apache.solr.servlet.SolrDispatchFilter.doFilter(SolrDispatchFilter.java:355)
	at org.apache.solr.servlet.SolrDispatchFilter.doFilter(SolrDispatchFilter.java:306)
	at org.eclipse.jetty.servlet.ServletHandler$CachedChain.doFilter(ServletHandler.java:1699)
	at org.apache.solr.client.solrj.embedded.JettySolrRunner$DebugFilter.doFilter(JettySolrRunner.java:139)
	at org.eclipse.jetty.servlet.ServletHandler$CachedChain.doFilter(ServletHandler.java:1699)
	at org.eclipse.jetty.servlet.ServletHandler.doHandle(ServletHandler.java:582)
	at org.eclipse.jetty.server.session.SessionHandler.doHandle(SessionHandler.java:224)
	at org.eclipse.jetty.server.handler.ContextHandler.doHandle(ContextHandler.java:1180)
	at org.eclipse.jetty.servlet.ServletHandler.doScope(ServletHandler.java:512)
	at org.eclipse.jetty.server.session.SessionHandler.doScope(SessionHandler.java:185)
	at org.eclipse.jetty.server.handler.ContextHandler.doScope(ContextHandler.java:1112)
	at org.eclipse.jetty.server.handler.ScopedHandler.handle(ScopedHandler.java:141)
	at org.eclipse.jetty.server.handler.gzip.GzipHandler.handle(GzipHandler.java:395)
	at org.eclipse.jetty.server.handler.HandlerWrapper.handle(HandlerWrapper.java:134)
	at org.eclipse.jetty.server.Server.handle(Server.java:534)
	at org.eclipse.jetty.server.HttpChannel.handle(HttpChannel.java:320)
	at org.eclipse.jetty.server.HttpConnection.onFillable(HttpConnection.java:251)
	at org.eclipse.jetty.io.AbstractConnection$ReadCallback.succeeded(AbstractConnection.java:273)
	at org.eclipse.jetty.io.FillInterest.fillable(FillInterest.java:95)
	at org.eclipse.jetty.io.SelectChannelEndPoint$2.run(SelectChannelEndPoint.java:93)
	at org.eclipse.jetty.util.thread.strategy.ExecuteProduceConsume.executeProduceConsume(ExecuteProduceConsume.java:303)
	at org.eclipse.jetty.util.thread.strategy.ExecuteProduceConsume.produceConsume(ExecuteProduceConsume.java:148)
	at org.eclipse.jetty.util.thread.strategy.ExecuteProduceConsume.run(ExecuteProduceConsume.java:136)
	at org.eclipse.jetty.util.thread.QueuedThreadPool.runJob(QueuedThreadPool.java:671)
	at org.eclipse.jetty.util.thread.QueuedThreadPool$2.run(QueuedThreadPool.java:589)
	at java.lang.Thread.run(Thread.java:745)

org.apache.solr.common.util.ObjectReleaseTracker$ObjectTrackerException: org.apache.solr.common.util.ExecutorUtil$MDCAwareThreadPoolExecutor
	at org.apache.solr.common.util.ObjectReleaseTracker.track(ObjectReleaseTracker.java:42)
	at org.apache.solr.core.SolrCore.<init>(SolrCore.java:883)
	at org.apache.solr.core.SolrCore.reload(SolrCore.java:647)
	at org.apache.solr.core.CoreContainer.reload(CoreContainer.java:1154)
	at org.apache.solr.core.SolrCore.lambda$getConfListener$18(SolrCore.java:2949)
	at org.apache.solr.cloud.ZkController.lambda$fireEventListeners$4(ZkController.java:2349)
	at java.lang.Thread.run(Thread.java:745)

org.apache.solr.common.util.ObjectReleaseTracker$ObjectTrackerException: org.apache.lucene.store.MockDirectoryWrapper
	at org.apache.solr.common.util.ObjectReleaseTracker.track(ObjectReleaseTracker.java:42)
	at org.apache.solr.core.CachingDirectoryFactory.get(CachingDirectoryFactory.java:347)
	at org.apache.solr.core.SolrCore.initSnapshotMetaDataManager(SolrCore.java:489)
	at org.apache.solr.core.SolrCore.<init>(SolrCore.java:941)
	at org.apache.solr.core.SolrCore.<init>(SolrCore.java:854)
	at org.apache.solr.core.CoreContainer.create(CoreContainer.java:958)
	at org.apache.solr.core.CoreContainer.create(CoreContainer.java:893)
	at org.apache.solr.handler.admin.CoreAdminOperation.lambda$static$0(CoreAdminOperation.java:88)
	at org.apache.solr.handler.admin.CoreAdminOperation.execute(CoreAdminOperation.java:370)
	at org.apache.solr.handler.admin.CoreAdminHandler$CallInfo.call(CoreAdminHandler.java:388)
	at org.apache.solr.handler.admin.CoreAdminHandler.handleRequestBody(CoreAdminHandler.java:174)
	at org.apache.solr.handler.RequestHandlerBase.handleRequest(RequestHandlerBase.java:178)
	at org.apache.solr.servlet.HttpSolrCall.handleAdmin(HttpSolrCall.java:747)
	at org.apache.solr.servlet.HttpSolrCall.handleAdminRequest(HttpSolrCall.java:728)
	at org.apache.solr.servlet.HttpSolrCall.call(HttpSolrCall.java:509)
	at org.apache.solr.servlet.SolrDispatchFilter.doFilter(SolrDispatchFilter.java:355)
	at org.apache.solr.servlet.SolrDispatchFilter.doFilter(SolrDispatchFilter.java:306)
	at org.eclipse.jetty.servlet.ServletHandler$CachedChain.doFilter(ServletHandler.java:1699)
	at org.apache.solr.client.solrj.embedded.JettySolrRunner$DebugFilter.doFilter(JettySolrRunner.java:139)
	at org.eclipse.jetty.servlet.ServletHandler$CachedChain.doFilter(ServletHandler.java:1699)
	at org.eclipse.jetty.servlet.ServletHandler.doHandle(ServletHandler.java:582)
	at org.eclipse.jetty.server.session.SessionHandler.doHandle(SessionHandler.java:224)
	at org.eclipse.jetty.server.handler.ContextHandler.doHandle(ContextHandler.java:1180)
	at org.eclipse.jetty.servlet.ServletHandler.doScope(ServletHandler.java:512)
	at org.eclipse.jetty.server.session.SessionHandler.doScope(SessionHandler.java:185)
	at org.eclipse.jetty.server.handler.ContextHandler.doScope(ContextHandler.java:1112)
	at org.eclipse.jetty.server.handler.ScopedHandler.handle(ScopedHandler.java:141)
	at org.eclipse.jetty.server.handler.gzip.GzipHandler.handle(GzipHandler.java:395)
	at org.eclipse.jetty.server.handler.HandlerWrapper.handle(HandlerWrapper.java:134)
	at org.eclipse.jetty.server.Server.handle(Server.java:534)
	at org.eclipse.jetty.server.HttpChannel.handle(HttpChannel.java:320)
	at org.eclipse.jetty.server.HttpConnection.onFillable(HttpConnection.java:251)
	at org.eclipse.jetty.io.AbstractConnection$ReadCallback.succeeded(AbstractConnection.java:273)
	at org.eclipse.jetty.io.FillInterest.fillable(FillInterest.java:95)
	at org.eclipse.jetty.io.SelectChannelEndPoint$2.run(SelectChannelEndPoint.java:93)
	at org.eclipse.jetty.util.thread.strategy.ExecuteProduceConsume.executeProduceConsume(ExecuteProduceConsume.java:303)
	at org.eclipse.jetty.util.thread.strategy.ExecuteProduceConsume.produceConsume(ExecuteProduceConsume.java:148)
	at org.eclipse.jetty.util.thread.strategy.ExecuteProduceConsume.run(ExecuteProduceConsume.java:136)
	at org.eclipse.jetty.util.thread.QueuedThreadPool.runJob(QueuedThreadPool.java:671)
	at org.eclipse.jetty.util.thread.QueuedThreadPool$2.run(QueuedThreadPool.java:589)
	at java.lang.Thread.run(Thread.java:745)


	at __randomizedtesting.SeedInfo.seed([DD9AE3234E1320D4]:0)
	at org.junit.Assert.fail(Assert.java:93)
	at org.junit.Assert.assertTrue(Assert.java:43)
	at org.junit.Assert.assertNull(Assert.java:551)
	at org.apache.solr.SolrTestCaseJ4.teardownTestCases(SolrTestCaseJ4.java:302)
	at sun.reflect.GeneratedMethodAccessor63.invoke(Unknown Source)
	at sun.reflect.DelegatingMethodAccessorImpl.invoke(DelegatingMethodAccessorImpl.java:43)
	at java.lang.reflect.Method.invoke(Method.java:498)
	at com.carrotsearch.randomizedtesting.RandomizedRunner.invoke(RandomizedRunner.java:1713)
	at com.carrotsearch.randomizedtesting.RandomizedRunner$7.evaluate(RandomizedRunner.java:870)
	at com.carrotsearch.randomizedtesting.rules.StatementAdapter.evaluate(StatementAdapter.java:36)
	at com.carrotsearch.randomizedtesting.rules.SystemPropertiesRestoreRule$1.evaluate(SystemPropertiesRestoreRule.java:57)
	at org.apache.lucene.util.AbstractBeforeAfterRule$1.evaluate(AbstractBeforeAfterRule.java:45)
	at com.carrotsearch.randomizedtesting.rules.StatementAdapter.evaluate(StatementAdapter.java:36)
	at org.apache.lucene.util.TestRuleStoreClassName$1.evaluate(TestRuleStoreClassName.java:41)
	at com.carrotsearch.randomizedtesting.rules.NoShadowingOrOverridesOnMethodsRule$1.evaluate(NoShadowingOrOverridesOnMethodsRule.java:40)
	at com.carrotsearch.randomizedtesting.rules.NoShadowingOrOverridesOnMethodsRule$1.evaluate(NoShadowingOrOverridesOnMethodsRule.java:40)
	at com.carrotsearch.randomizedtesting.rules.StatementAdapter.evaluate(StatementAdapter.java:36)
	at com.carrotsearch.randomizedtesting.rules.StatementAdapter.evaluate(StatementAdapter.java:36)
	at com.carrotsearch.randomizedtesting.rules.StatementAdapter.evaluate(StatementAdapter.java:36)
	at org.apache.lucene.util.TestRuleAssertionsRequired$1.evaluate(TestRuleAssertionsRequired.java:53)
	at org.apache.lucene.util.TestRuleMarkFailure$1.evaluate(TestRuleMarkFailure.java:47)
	at org.apache.lucene.util.TestRuleIgnoreAfterMaxFailures$1.evaluate(TestRuleIgnoreAfterMaxFailures.java:64)
	at org.apache.lucene.util.TestRuleIgnoreTestSuites$1.evaluate(TestRuleIgnoreTestSuites.java:54)
	at com.carrotsearch.randomizedtesting.rules.StatementAdapter.evaluate(StatementAdapter.java:36)
	at com.carrotsearch.randomizedtesting.ThreadLeakControl$StatementRunner.run(ThreadLeakControl.java:368)
	at java.lang.Thread.run(Thread.java:745)


FAILED:  org.apache.solr.core.TestJmxIntegration.testJmxRegistration

Error Message:
org.apache.lucene.store.AlreadyClosedException: this IndexReader is closed

Stack Trace:
javax.management.RuntimeMBeanException: org.apache.lucene.store.AlreadyClosedException: this IndexReader is closed
	at __randomizedtesting.SeedInfo.seed([DD9AE3234E1320D4:534B8719235278B1]:0)
	at com.sun.jmx.interceptor.DefaultMBeanServerInterceptor.rethrow(DefaultMBeanServerInterceptor.java:839)
	at com.sun.jmx.interceptor.DefaultMBeanServerInterceptor.rethrowMaybeMBeanException(DefaultMBeanServerInterceptor.java:852)
	at com.sun.jmx.interceptor.DefaultMBeanServerInterceptor.getAttribute(DefaultMBeanServerInterceptor.java:651)
	at com.sun.jmx.mbeanserver.JmxMBeanServer.getAttribute(JmxMBeanServer.java:678)
	at org.apache.solr.core.TestJmxIntegration.testJmxRegistration(TestJmxIntegration.java:121)
	at sun.reflect.NativeMethodAccessorImpl.invoke0(Native Method)
	at sun.reflect.NativeMethodAccessorImpl.invoke(NativeMethodAccessorImpl.java:62)
	at sun.reflect.DelegatingMethodAccessorImpl.invoke(DelegatingMethodAccessorImpl.java:43)
	at java.lang.reflect.Method.invoke(Method.java:498)
	at com.carrotsearch.randomizedtesting.RandomizedRunner.invoke(RandomizedRunner.java:1713)
	at com.carrotsearch.randomizedtesting.RandomizedRunner$8.evaluate(RandomizedRunner.java:907)
	at com.carrotsearch.randomizedtesting.RandomizedRunner$9.evaluate(RandomizedRunner.java:943)
	at com.carrotsearch.randomizedtesting.RandomizedRunner$10.evaluate(RandomizedRunner.java:957)
	at com.carrotsearch.randomizedtesting.rules.SystemPropertiesRestoreRule$1.evaluate(SystemPropertiesRestoreRule.java:57)
	at org.apache.lucene.util.TestRuleSetupTeardownChained$1.evaluate(TestRuleSetupTeardownChained.java:49)
	at org.apache.lucene.util.AbstractBeforeAfterRule$1.evaluate(AbstractBeforeAfterRule.java:45)
	at org.apache.lucene.util.TestRuleThreadAndTestName$1.evaluate(TestRuleThreadAndTestName.java:48)
	at org.apache.lucene.util.TestRuleIgnoreAfterMaxFailures$1.evaluate(TestRuleIgnoreAfterMaxFailures.java:64)
	at org.apache.lucene.util.TestRuleMarkFailure$1.evaluate(TestRuleMarkFailure.java:47)
	at com.carrotsearch.randomizedtesting.rules.StatementAdapter.evaluate(StatementAdapter.java:36)
	at com.carrotsearch.randomizedtesting.ThreadLeakControl$StatementRunner.run(ThreadLeakControl.java:368)
	at com.carrotsearch.randomizedtesting.ThreadLeakControl.forkTimeoutingTask(ThreadLeakControl.java:817)
	at com.carrotsearch.randomizedtesting.ThreadLeakControl$3.evaluate(ThreadLeakControl.java:468)
	at com.carrotsearch.randomizedtesting.RandomizedRunner.runSingleTest(RandomizedRunner.java:916)
	at com.carrotsearch.randomizedtesting.RandomizedRunner$5.evaluate(RandomizedRunner.java:802)
	at com.carrotsearch.randomizedtesting.RandomizedRunner$6.evaluate(RandomizedRunner.java:852)
	at com.carrotsearch.randomizedtesting.RandomizedRunner$7.evaluate(RandomizedRunner.java:863)
	at com.carrotsearch.randomizedtesting.rules.StatementAdapter.evaluate(StatementAdapter.java:36)
	at com.carrotsearch.randomizedtesting.rules.SystemPropertiesRestoreRule$1.evaluate(SystemPropertiesRestoreRule.java:57)
	at org.apache.lucene.util.AbstractBeforeAfterRule$1.evaluate(AbstractBeforeAfterRule.java:45)
	at com.carrotsearch.randomizedtesting.rules.StatementAdapter.evaluate(StatementAdapter.java:36)
	at org.apache.lucene.util.TestRuleStoreClassName$1.evaluate(TestRuleStoreClassName.java:41)
	at com.carrotsearch.randomizedtesting.rules.NoShadowingOrOverridesOnMethodsRule$1.evaluate(NoShadowingOrOverridesOnMethodsRule.java:40)
	at com.carrotsearch.randomizedtesting.rules.NoShadowingOrOverridesOnMethodsRule$1.evaluate(NoShadowingOrOverridesOnMethodsRule.java:40)
	at com.carrotsearch.randomizedtesting.rules.StatementAdapter.evaluate(StatementAdapter.java:36)
	at com.carrotsearch.randomizedtesting.rules.StatementAdapter.evaluate(StatementAdapter.java:36)
	at com.carrotsearch.randomizedtesting.rules.StatementAdapter.evaluate(StatementAdapter.java:36)
	at org.apache.lucene.util.TestRuleAssertionsRequired$1.evaluate(TestRuleAssertionsRequired.java:53)
	at org.apache.lucene.util.TestRuleMarkFailure$1.evaluate(TestRuleMarkFailure.java:47)
	at org.apache.lucene.util.TestRuleIgnoreAfterMaxFailures$1.evaluate(TestRuleIgnoreAfterMaxFailures.java:64)
	at org.apache.lucene.util.TestRuleIgnoreTestSuites$1.evaluate(TestRuleIgnoreTestSuites.java:54)
	at com.carrotsearch.randomizedtesting.rules.StatementAdapter.evaluate(StatementAdapter.java:36)
	at com.carrotsearch.randomizedtesting.ThreadLeakControl$StatementRunner.run(ThreadLeakControl.java:368)
	at java.lang.Thread.run(Thread.java:745)
Caused by: org.apache.lucene.store.AlreadyClosedException: this IndexReader is closed
	at org.apache.lucene.index.IndexReader.ensureOpen(IndexReader.java:266)
	at org.apache.lucene.index.StandardDirectoryReader.getVersion(StandardDirectoryReader.java:338)
	at org.apache.lucene.index.FilterDirectoryReader.getVersion(FilterDirectoryReader.java:119)
	at org.apache.lucene.index.FilterDirectoryReader.getVersion(FilterDirectoryReader.java:119)
	at org.apache.solr.search.SolrIndexSearcher.lambda$initializeMetrics$14(SolrIndexSearcher.java:2251)
	at com.codahale.metrics.JmxReporter$JmxGauge.getValue(JmxReporter.java:189)
	at sun.reflect.GeneratedMethodAccessor81.invoke(Unknown Source)
	at sun.reflect.DelegatingMethodAccessorImpl.invoke(DelegatingMethodAccessorImpl.java:43)
	at java.lang.reflect.Method.invoke(Method.java:498)
	at sun.reflect.misc.Trampoline.invoke(MethodUtil.java:71)
	at sun.reflect.GeneratedMethodAccessor80.invoke(Unknown Source)
	at sun.reflect.DelegatingMethodAccessorImpl.invoke(DelegatingMethodAccessorImpl.java:43)
	at java.lang.reflect.Method.invoke(Method.java:498)
	at sun.reflect.misc.MethodUtil.invoke(MethodUtil.java:275)
	at com.sun.jmx.mbeanserver.StandardMBeanIntrospector.invokeM2(StandardMBeanIntrospector.java:112)
	at com.sun.jmx.mbeanserver.StandardMBeanIntrospector.invokeM2(StandardMBeanIntrospector.java:46)
	at com.sun.jmx.mbeanserver.MBeanIntrospector.invokeM(MBeanIntrospector.java:237)
	at com.sun.jmx.mbeanserver.PerInterface.getAttribute(PerInterface.java:83)
	at com.sun.jmx.mbeanserver.MBeanSupport.getAttribute(MBeanSupport.java:206)
	at com.sun.jmx.interceptor.DefaultMBeanServerInterceptor.getAttribute(DefaultMBeanServerInterceptor.java:647)
	... 41 more




Build Log:
[...truncated 11149 lines...]
   [junit4] Suite: org.apache.solr.util.TestSolrCLIRunExample
   [junit4]   2> Creating dataDir: /home/jenkins/workspace/Lucene-Solr-master-Linux/solr/build/solr-core/test/J1/temp/solr.util.TestSolrCLIRunExample_DD9AE3234E1320D4-001/init-core-data-001
   [junit4]   2> 160799 WARN  (SUITE-TestSolrCLIRunExample-seed#[DD9AE3234E1320D4]-worker) [    ] o.a.s.SolrTestCaseJ4 startTrackingSearchers: numOpens=16 numCloses=16
   [junit4]   2> 160799 INFO  (SUITE-TestSolrCLIRunExample-seed#[DD9AE3234E1320D4]-worker) [    ] o.a.s.SolrTestCaseJ4 Using PointFields
   [junit4]   2> 160800 INFO  (SUITE-TestSolrCLIRunExample-seed#[DD9AE3234E1320D4]-worker) [    ] o.a.s.SolrTestCaseJ4 Randomized ssl (false) and clientAuth (false) via: @org.apache.solr.SolrTestCaseJ4$SuppressSSL(bugUrl=https://issues.apache.org/jira/browse/SOLR-5776)
   [junit4]   2> 160802 INFO  (TEST-TestSolrCLIRunExample.testInteractiveSolrCloudExample-seed#[DD9AE3234E1320D4]) [    ] o.a.s.SolrTestCaseJ4 ###Starting testInteractiveSolrCloudExample
   [junit4]   2> 160836 INFO  (TEST-TestSolrCLIRunExample.testInteractiveSolrCloudExample-seed#[DD9AE3234E1320D4]) [    ] o.a.s.c.MiniSolrCloudCluster Starting cluster of 1 servers in /home/jenkins/workspace/Lucene-Solr-master-Linux/solr/build/solr-core/test/J1/temp/solr.util.TestSolrCLIRunExample_DD9AE3234E1320D4-001/tempDir-002
   [junit4]   2> 160836 INFO  (TEST-TestSolrCLIRunExample.testInteractiveSolrCloudExample-seed#[DD9AE3234E1320D4]) [    ] o.a.s.c.ZkTestServer STARTING ZK TEST SERVER
   [junit4]   2> 160836 INFO  (Thread-346) [    ] o.a.s.c.ZkTestServer client port:0.0.0.0/0.0.0.0:0
   [junit4]   2> 160836 INFO  (Thread-346) [    ] o.a.s.c.ZkTestServer Starting server
   [junit4]   2> 160936 INFO  (TEST-TestSolrCLIRunExample.testInteractiveSolrCloudExample-seed#[DD9AE3234E1320D4]) [    ] o.a.s.c.ZkTestServer start zk server on port:45430
   [junit4]   2> 160941 INFO  (jetty-launcher-319-thread-1) [    ] o.e.j.s.Server jetty-9.3.14.v20161028
   [junit4]   2> 160941 INFO  (jetty-launcher-319-thread-1) [    ] o.e.j.s.h.ContextHandler Started o.e.j.s.ServletContextHandler@9435a6{/solr,null,AVAILABLE}
   [junit4]   2> 160942 INFO  (jetty-launcher-319-thread-1) [    ] o.e.j.s.AbstractConnector Started ServerConnector@1fe8b6a{HTTP/1.1,[http/1.1]}{127.0.0.1:35910}
   [junit4]   2> 160942 INFO  (jetty-launcher-319-thread-1) [    ] o.e.j.s.Server Started @162834ms
   [junit4]   2> 160942 INFO  (jetty-launcher-319-thread-1) [    ] o.a.s.c.s.e.JettySolrRunner Jetty properties: {hostContext=/solr, hostPort=35910}
   [junit4]   2> 160942 ERROR (jetty-launcher-319-thread-1) [    ] o.a.s.s.StartupLoggingUtils Missing Java Option solr.log.dir. Logging may be missing or incomplete.
   [junit4]   2> 160942 INFO  (jetty-launcher-319-thread-1) [    ] o.a.s.s.SolrDispatchFilter  ___      _       Welcome to Apache Solr? version 7.0.0
   [junit4]   2> 160942 INFO  (jetty-launcher-319-thread-1) [    ] o.a.s.s.SolrDispatchFilter / __| ___| |_ _   Starting in cloud mode on port 35910
   [junit4]   2> 160942 INFO  (jetty-launcher-319-thread-1) [    ] o.a.s.s.SolrDispatchFilter \__ \/ _ \ | '_|  Install dir: null
   [junit4]   2> 160942 INFO  (jetty-launcher-319-thread-1) [    ] o.a.s.s.SolrDispatchFilter |___/\___/_|_|    Start time: 2017-04-20T04:01:47.896Z
   [junit4]   2> 160945 INFO  (jetty-launcher-319-thread-1) [    ] o.a.s.s.SolrDispatchFilter solr.xml found in ZooKeeper. Loading...
   [junit4]   2> 160948 INFO  (jetty-launcher-319-thread-1) [    ] o.a.s.c.SolrXmlConfig MBean server found: com.sun.jmx.mbeanserver.JmxMBeanServer@279ec2, but no JMX reporters were configured - adding default JMX reporter.
   [junit4]   2> 160951 INFO  (jetty-launcher-319-thread-1) [    ] o.a.s.c.ZkContainer Zookeeper client=127.0.0.1:45430/solr
   [junit4]   2> 160965 INFO  (jetty-launcher-319-thread-1) [n:localhost:35910_solr    ] o.a.s.c.Overseer Overseer (id=null) closing
   [junit4]   2> 160965 INFO  (jetty-launcher-319-thread-1) [n:localhost:35910_solr    ] o.a.s.c.OverseerElectionContext I am going to be the leader localhost:35910_solr
   [junit4]   2> 160966 INFO  (jetty-launcher-319-thread-1) [n:localhost:35910_solr    ] o.a.s.c.Overseer Overseer (id=97823025252990979-localhost:35910_solr-n_0000000000) starting
   [junit4]   2> 160970 INFO  (jetty-launcher-319-thread-1) [n:localhost:35910_solr    ] o.a.s.c.ZkController Register node as live in ZooKeeper:/live_nodes/localhost:35910_solr
   [junit4]   2> 160971 INFO  (OverseerStateUpdate-97823025252990979-localhost:35910_solr-n_0000000000) [n:localhost:35910_solr    ] o.a.s.c.c.ZkStateReader Updated live nodes from ZooKeeper... (0) -> (1)
   [junit4]   2> 161426 INFO  (jetty-launcher-319-thread-1) [n:localhost:35910_solr    ] o.a.s.m.r.SolrJmxReporter JMX monitoring for 'solr.node' (registry 'solr.node') enabled at server: com.sun.jmx.mbeanserver.JmxMBeanServer@279ec2
   [junit4]   2> 161430 INFO  (jetty-launcher-319-thread-1) [n:localhost:35910_solr    ] o.a.s.m.r.SolrJmxReporter JMX monitoring for 'solr.jvm' (registry 'solr.jvm') enabled at server: com.sun.jmx.mbeanserver.JmxMBeanServer@279ec2
   [junit4]   2> 161430 INFO  (jetty-launcher-319-thread-1) [n:localhost:35910_solr    ] o.a.s.m.r.SolrJmxReporter JMX monitoring for 'solr.jetty' (registry 'solr.jetty') enabled at server: com.sun.jmx.mbeanserver.JmxMBeanServer@279ec2
   [junit4]   2> 161431 INFO  (jetty-launcher-319-thread-1) [n:localhost:35910_solr    ] o.a.s.c.CorePropertiesLocator Found 0 core definitions underneath /home/jenkins/workspace/Lucene-Solr-master-Linux/solr/build/solr-core/test/J1/temp/solr.util.TestSolrCLIRunExample_DD9AE3234E1320D4-001/tempDir-002/node1
   [junit4]   2> 161462 INFO  (qtp20723666-1534) [n:localhost:35910_solr    ] o.a.s.s.HttpSolrCall [admin] webapp=null path=/admin/info/system params={wt=json} status=0 QTime=14
   [junit4]   2> 161466 INFO  (qtp20723666-1535) [n:localhost:35910_solr    ] o.a.s.h.a.CollectionsHandler Invoked Collection Action :clusterstatus with params action=CLUSTERSTATUS&wt=json and sendToOCPQueue=true
   [junit4]   2> 161468 INFO  (qtp20723666-1535) [n:localhost:35910_solr    ] o.a.s.s.HttpSolrCall [admin] webapp=null path=/admin/collections params={action=CLUSTERSTATUS&wt=json} status=0 QTime=1
   [junit4]   2> 161472 INFO  (TEST-TestSolrCLIRunExample.testInteractiveSolrCloudExample-seed#[DD9AE3234E1320D4]) [    ] o.a.s.c.c.ZkStateReader Updated live nodes from ZooKeeper... (0) -> (1)
   [junit4]   2> 161472 INFO  (TEST-TestSolrCLIRunExample.testInteractiveSolrCloudExample-seed#[DD9AE3234E1320D4]) [    ] o.a.s.c.s.i.ZkClientClusterStateProvider Cluster at 127.0.0.1:45430/solr ready
   [junit4]   2> 161475 INFO  (qtp20723666-1535) [n:localhost:35910_solr    ] o.a.s.h.a.CollectionsHandler Invoked Collection Action :list with params action=list&wt=json and sendToOCPQueue=true
   [junit4]   2> 161475 INFO  (qtp20723666-1535) [n:localhost:35910_solr    ] o.a.s.s.HttpSolrCall [admin] webapp=null path=/admin/collections params={action=list&wt=json} status=0 QTime=0
   [junit4]   2> 161484 INFO  (qtp20723666-1535) [n:localhost:35910_solr    ] o.a.s.s.HttpSolrCall [admin] webapp=null path=/admin/info/system params={wt=json} status=0 QTime=5
   [junit4]   2> 161486 INFO  (qtp20723666-1536) [n:localhost:35910_solr    ] o.a.s.h.a.CollectionsHandler Invoked Collection Action :clusterstatus with params action=CLUSTERSTATUS&wt=json and sendToOCPQueue=true
   [junit4]   2> 161487 INFO  (qtp20723666-1536) [n:localhost:35910_solr    ] o.a.s.s.HttpSolrCall [admin] webapp=null path=/admin/collections params={action=CLUSTERSTATUS&wt=json} status=0 QTime=0
   [junit4]   2> 161490 INFO  (TEST-TestSolrCLIRunExample.testInteractiveSolrCloudExample-seed#[DD9AE3234E1320D4]) [    ] o.a.s.c.c.ZkStateReader Updated live nodes from ZooKeeper... (0) -> (1)
   [junit4]   2> 161490 INFO  (TEST-TestSolrCLIRunExample.testInteractiveSolrCloudExample-seed#[DD9AE3234E1320D4]) [    ] o.a.s.c.s.i.ZkClientClusterStateProvider Cluster at 127.0.0.1:45430/solr ready
   [junit4]   2> 161534 INFO  (qtp20723666-1536) [n:localhost:35910_solr    ] o.a.s.h.a.CollectionsHandler Invoked Collection Action :list with params action=list&wt=json and sendToOCPQueue=true
   [junit4]   2> 161534 INFO  (qtp20723666-1536) [n:localhost:35910_solr    ] o.a.s.s.HttpSolrCall [admin] webapp=null path=/admin/collections params={action=list&wt=json} status=0 QTime=0
   [junit4]   2> 161537 INFO  (qtp20723666-1536) [n:localhost:35910_solr    ] o.a.s.h.a.CollectionsHandler Invoked Collection Action :create with params replicationFactor=2&maxShardsPerNode=4&collection.configName=testCloudExamplePrompt&name=testCloudExamplePrompt&action=CREATE&numShards=2&wt=json and sendToOCPQueue=true
   [junit4]   2> 161538 INFO  (OverseerThreadFactory-687-thread-1-processing-n:localhost:35910_solr) [n:localhost:35910_solr    ] o.a.s.c.CreateCollectionCmd Create collection testCloudExamplePrompt
   [junit4]   2> 161539 WARN  (OverseerThreadFactory-687-thread-1-processing-n:localhost:35910_solr) [n:localhost:35910_solr    ] o.a.s.c.CreateCollectionCmd Specified replicationFactor of 2 on collection testCloudExamplePrompt is higher than or equal to the number of Solr instances currently live or live and part of your createNodeSet(1). It's unusual to run two replica of the same slice on the same Solr-instance.
   [junit4]   2> 161642 INFO  (qtp20723666-1534) [n:localhost:35910_solr    ] o.a.s.h.a.CoreAdminOperation core create command qt=/admin/cores&collection.configName=testCloudExamplePrompt&newCollection=true&name=testCloudExamplePrompt_shard2_replica2&action=CREATE&numShards=2&collection=testCloudExamplePrompt&shard=shard2&wt=javabin&version=2
   [junit4]   2> 161642 INFO  (qtp20723666-1531) [n:localhost:35910_solr    ] o.a.s.h.a.CoreAdminOperation core create command qt=/admin/cores&collection.configName=testCloudExamplePrompt&newCollection=true&name=testCloudExamplePrompt_shard1_replica1&action=CREATE&numShards=2&collection=testCloudExamplePrompt&shard=shard1&wt=javabin&version=2
   [junit4]   2> 161642 INFO  (qtp20723666-1530) [n:localhost:35910_solr    ] o.a.s.h.a.CoreAdminOperation core create command qt=/admin/cores&collection.configName=testCloudExamplePrompt&newCollection=true&name=testCloudExamplePrompt_shard2_replica1&action=CREATE&numShards=2&collection=testCloudExamplePrompt&shard=shard2&wt=javabin&version=2
   [junit4]   2> 161642 INFO  (qtp20723666-1535) [n:localhost:35910_solr    ] o.a.s.h.a.CoreAdminOperation core create command qt=/admin/cores&collection.configName=testCloudExamplePrompt&newCollection=true&name=testCloudExamplePrompt_shard1_replica2&action=CREATE&numShards=2&collection=testCloudExamplePrompt&shard=shard1&wt=javabin&version=2
   [junit4]   2> 161643 INFO  (qtp20723666-1534) [n:localhost:35910_solr    ] o.a.s.c.TransientSolrCoreCacheDefault Allocating transient cache for 2147483647 transient cores
   [junit4]   2> 161748 INFO  (zkCallback-326-thread-1-processing-n:localhost:35910_solr) [n:localhost:35910_solr    ] o.a.s.c.c.ZkStateReader A cluster state change: [WatchedEvent state:SyncConnected type:NodeDataChanged path:/collections/testCloudExamplePrompt/state.json] for collection [testCloudExamplePrompt] has occurred - updating... (live nodes size: [1])
   [junit4]   2> 162654 INFO  (qtp20723666-1530) [n:localhost:35910_solr c:testCloudExamplePrompt s:shard2  x:testCloudExamplePrompt_shard2_replica1] o.a.s.c.RequestParams conf resource params.json loaded . version : 0 
   [junit4]   2> 162654 INFO  (qtp20723666-1531) [n:localhost:35910_solr c:testCloudExamplePrompt s:shard1  x:testCloudExamplePrompt_shard1_replica1] o.a.s.c.RequestParams conf resource params.json loaded . version : 0 
   [junit4]   2> 162654 INFO  (qtp20723666-1530) [n:localhost:35910_solr c:testCloudExamplePrompt s:shard2  x:testCloudExamplePrompt_shard2_replica1] o.a.s.c.RequestParams request params refreshed to version 0
   [junit4]   2> 162654 INFO  (qtp20723666-1534) [n:localhost:35910_solr c:testCloudExamplePrompt s:shard2  x:testCloudExamplePrompt_shard2_replica2] o.a.s.c.RequestParams conf resource params.json loaded . version : 0 
   [junit4]   2> 162654 INFO  (qtp20723666-1531) [n:localhost:35910_solr c:testCloudExamplePrompt s:shard1  x:testCloudExamplePrompt_shard1_replica1] o.a.s.c.RequestParams request params refreshed to version 0
   [junit4]   2> 162654 INFO  (qtp20723666-1535) [n:localhost:35910_solr c:testCloudExamplePrompt s:shard1  x:testCloudExamplePrompt_shard1_replica2] o.a.s.c.RequestParams conf resource params.json loaded . version : 0 
   [junit4]   2> 162654 INFO  (qtp20723666-1534) [n:localhost:35910_solr c:testCloudExamplePrompt s:shard2  x:testCloudExamplePrompt_shard2_replica2] o.a.s.c.RequestParams request params refreshed to version 0
   [junit4]   2> 162654 INFO  (qtp20723666-1535) [n:localhost:35910_solr c:testCloudExamplePrompt s:shard1  x:testCloudExamplePrompt_shard1_replica2] o.a.s.c.RequestParams request params refreshed to version 0
   [junit4]   2> 162655 WARN  (qtp20723666-1530) [n:localhost:35910_solr c:testCloudExamplePrompt s:shard2  x:testCloudExamplePrompt_shard2_replica1] o.a.s.c.SolrConfig Couldn't add files from /home/jenkins/workspace/Lucene-Solr-master-Linux/solr/build/solr-core/test/J1/temp/solr.util.TestSolrCLIRunExample_DD9AE3234E1320D4-001/tempDir-002/node1/testCloudExamplePrompt_shard2_replica1/../../../../contrib/extraction/lib filtered by .*\.jar to classpath: /home/jenkins/workspace/Lucene-Solr-master-Linux/solr/build/solr-core/test/J1/temp/solr.util.TestSolrCLIRunExample_DD9AE3234E1320D4-001/tempDir-002/node1/testCloudExamplePrompt_shard2_replica1/../../../../contrib/extraction/lib
   [junit4]   2> 162656 WARN  (qtp20723666-1531) [n:localhost:35910_solr c:testCloudExamplePrompt s:shard1  x:testCloudExamplePrompt_shard1_replica1] o.a.s.c.SolrConfig Couldn't add files from /home/jenkins/workspace/Lucene-Solr-master-Linux/solr/build/solr-core/test/J1/temp/solr.util.TestSolrCLIRunExample_DD9AE3234E1320D4-001/tempDir-002/node1/testCloudExamplePrompt_shard1_replica1/../../../../contrib/extraction/lib filtered by .*\.jar to classpath: /home/jenkins/workspace/Lucene-Solr-master-Linux/solr/build/solr-core/test/J1/temp/solr.util.TestSolrCLIRunExample_DD9AE3234E1320D4-001/tempDir-002/node1/testCloudExamplePrompt_shard1_replica1/../../../../contrib/extraction/lib
   [junit4]   2> 162656 WARN  (qtp20723666-1534) [n:localhost:35910_solr c:testCloudExamplePrompt s:shard2  x:testCloudExamplePrompt_shard2_replica2] o.a.s.c.SolrConfig Couldn't add files from /home/jenkins/workspace/Lucene-Solr-master-Linux/solr/build/solr-core/test/J1/temp/solr.util.TestSolrCLIRunExample_DD9AE3234E1320D4-001/tempDir-002/node1/testCloudExamplePrompt_shard2_replica2/../../../../contrib/extraction/lib filtered by .*\.jar to classpath: /home/jenkins/workspace/Lucene-Solr-master-Linux/solr/build/solr-core/test/J1/temp/solr.util.TestSolrCLIRunExample_DD9AE3234E1320D4-001/tempDir-002/node1/testCloudExamplePrompt_shard2_replica2/../../../../contrib/extraction/lib
   [junit4]   2> 162656 WARN  (qtp20723666-1530) [n:localhost:35910_solr c:testCloudExamplePrompt s:shard2  x:testCloudExamplePrompt_shard2_replica1] o.a.s.c.SolrConfig Couldn't add files from /home/jenkins/workspace/Lucene-Solr-master-Linux/solr/build/solr-core/test/J1/temp/solr.util.TestSolrCLIRunExample_DD9AE3234E1320D4-001/tempDir-002/node1/testCloudExamplePrompt_shard2_replica1/../../../../dist filtered by solr-cell-\d.*\.jar to classpath: /home/jenkins/workspace/Lucene-Solr-master-Linux/solr/build/solr-core/test/J1/temp/solr.util.TestSolrCLIRunExample_DD9AE3234E1320D4-001/tempDir-002/node1/testCloudExamplePrompt_shard2_replica1/../../../../dist
   [junit4]   2> 162656 WARN  (qtp20723666-1535) [n:localhost:35910_solr c:testCloudExamplePrompt s:shard1  x:testCloudExamplePrompt_shard1_replica2] o.a.s.c.SolrConfig Couldn't add files from /home/jenkins/workspace/Lucene-Solr-master-Linux/solr/build/solr-core/test/J1/temp/solr.util.TestSolrCLIRunExample_DD9AE3234E1320D4-001/tempDir-002/node1/testCloudExamplePrompt_shard1_replica2/../../../../contrib/extraction/lib filtered by .*\.jar to classpath: /home/jenkins/workspace/Lucene-Solr-master-Linux/solr/build/solr-core/test/J1/temp/solr.util.TestSolrCLIRunExample_DD9AE3234E1320D4-001/tempDir-002/node1/testCloudExamplePrompt_shard1_replica2/../../../../contrib/extraction/lib
   [junit4]   2> 162656 WARN  (qtp20723666-1531) [n:localhost:35910_solr c:testCloudExamplePrompt s:shard1  x:testCloudExamplePrompt_shard1_replica1] o.a.s.c.SolrConfig Couldn't add files from /home/jenkins/workspace/Lucene-Solr-master-Linux/solr/build/solr-core/test/J1/temp/solr.util.TestSolrCLIRunExample_DD9AE3234E1320D4-001/tempDir-002/node1/testCloudExamplePrompt_shard1_replica1/../../../../dist filtered by solr-cell-\d.*\.jar to classpath: /home/jenkins/workspace/Lucene-Solr-master-Linux/solr/build/solr-core/test/J1/temp/solr.util.TestSolrCLIRunExample_DD9AE3234E1320D4-001/tempDir-002/node1/testCloudExamplePrompt_shard1_replica1/../../../../dist
   [junit4]   2> 162656 WARN  (qtp20723666-1534) [n:localhost:35910_solr c:testCloudExamplePrompt s:shard2  x:testCloudExamplePrompt_shard2_replica2] o.a.s.c.SolrConfig Couldn't add files from /home/jenkins/workspace/Lucene-Solr-master-Linux/solr/build/solr-core/test/J1/temp/solr.util.TestSolrCLIRunExample_DD9AE3234E1320D4-001/tempDir-002/node1/testCloudExamplePrompt_shard2_replica2/../../../../dist filtered by solr-cell-\d.*\.jar to classpath: /home/jenkins/workspace/Lucene-Solr-master-Linux/solr/build/solr-core/test/J1/temp/solr.util.TestSolrCLIRunExample_DD9AE3234E1320D4-001/tempDir-002/node1/testCloudExamplePrompt_shard2_replica2/../../../../dist
   [junit4]   2> 162656 WARN  (qtp20723666-1530) [n:localhost:35910_solr c:testCloudExamplePrompt s:shard2  x:testCloudExamplePrompt_shard2_replica1] o.a.s.c.SolrConfig Couldn't add files from /home/jenkins/workspace/Lucene-Solr-master-Linux/solr/build/solr-core/test/J1/temp/solr.util.TestSolrCLIRunExample_DD9AE3234E1320D4-001/tempDir-002/node1/testCloudExamplePrompt_shard2_replica1/../../../../contrib/clustering/lib filtered by .*\.jar to classpath: /home/jenkins/workspace/Lucene-Solr-master-Linux/solr/build/solr-core/test/J1/temp/solr.util.TestSolrCLIRunExample_DD9AE3234E1320D4-001/tempDir-002/node1/testCloudExamplePrompt_shard2_replica1/../../../../contrib/clustering/lib
   [junit4]   2> 162656 WARN  (qtp20723666-1535) [n:localhost:35910_solr c:testCloudExamplePrompt s:shard1  x:testCloudExamplePrompt_shard1_replica2] o.a.s.c.SolrConfig Couldn't add files from /home/jenkins/workspace/Lucene-Solr-master-Linux/solr/build/solr-core/test/J1/temp/solr.util.TestSolrCLIRunExample_DD9AE3234E1320D4-001/tempDir-002/node1/testCloudExamplePrompt_shard1_replica2/../../../../dist filtered by solr-cell-\d.*\.jar to classpath: /home/jenkins/workspace/Lucene-Solr-master-Linux/solr/build/solr-core/test/J1/temp/solr.util.TestSolrCLIRunExample_DD9AE3234E1320D4-001/tempDir-002/node1/testCloudExamplePrompt_shard1_replica2/../../../../dist
   [junit4]   2> 162656 WARN  (qtp20723666-1530) [n:localhost:35910_solr c:testCloudExamplePrompt s:shard2  x:testCloudExamplePrompt_shard2_replica1] o.a.s.c.SolrConfig Couldn't add files from /home/jenkins/workspace/Lucene-Solr-master-Linux/solr/build/solr-core/test/J1/temp/solr.util.TestSolrCLIRunExample_DD9AE3234E1320D4-001/tempDir-002/node1/testCloudExamplePrompt_shard2_replica1/../../../../dist filtered by solr-clustering-\d.*\.jar to classpath: /home/jenkins/workspace/Lucene-Solr-master-Linux/solr/build/solr-core/test/J1/temp/solr.util.TestSolrCLIRunExample_DD9AE3234E1320D4-001/tempDir-002/node1/testCloudExamplePrompt_shard2_replica1/../../../../dist
   [junit4]   2> 162657 WARN  (qtp20723666-1531) [n:localhost:35910_solr c:testCloudExamplePrompt s:shard1  x:testCloudExamplePrompt_shard1_replica1] o.a.s.c.SolrConfig Couldn't add files from /home/jenkins/workspace/Lucene-Solr-master-Linux/solr/build/solr-core/test/J1/temp/solr.util.TestSolrCLIRunExample_DD9AE3234E1320D4-001/tempDir-002/node1/testCloudExamplePrompt_shard1_replica1/../../../../contrib/clustering/lib filtered by .*\.jar to classpath: /home/jenkins/workspace/Lucene-Solr-master-Linux/solr/build/solr-core/test/J1/temp/solr.util.TestSolrCLIRunExample_DD9AE3234E1320D4-001/tempDir-002/node1/testCloudExamplePrompt_shard1_replica1/../../../../contrib/clustering/lib
   [junit4]   2> 162657 WARN  (qtp20723666-1534) [n:localhost:35910_solr c:testCloudExamplePrompt s:shard2  x:testCloudExamplePrompt_shard2_replica2] o.a.s.c.SolrConfig Couldn't add files from /home/jenkins/workspace/Lucene-Solr-master-Linux/solr/build/solr-core/test/J1/temp/solr.util.TestSolrCLIRunExample_DD9AE3234E1320D4-001/tempDir-002/node1/testCloudExamplePrompt_shard2_replica2/../../../../contrib/clustering/lib filtered by .*\.jar to classpath: /home/jenkins/workspace/Lucene-Solr-master-Linux/solr/build/solr-core/test/J1/temp/solr.util.TestSolrCLIRunExample_DD9AE3234E1320D4-001/tempDir-002/node1/testCloudExamplePrompt_shard2_replica2/../../../../contrib/clustering/lib
   [junit4]   2> 162657 WARN  (qtp20723666-1530) [n:localhost:35910_solr c:testCloudExamplePrompt s:shard2  x:testCloudExamplePrompt_shard2_replica1] o.a.s.c.SolrConfig Couldn't add files from /home/jenkins/workspace/Lucene-Solr-master-Linux/solr/build/solr-core/test/J1/temp/solr.util.TestSolrCLIRunExample_DD9AE3234E1320D4-001/tempDir-002/node1/testCloudExamplePrompt_shard2_replica1/../../../../contrib/langid/lib filtered by .*\.jar to classpath: /home/jenkins/workspace/Lucene-Solr-master-Linux/solr/build/solr-core/test/J1/temp/solr.util.TestSolrCLIRunExample_DD9AE3234E1320D4-001/tempDir-002/node1/testCloudExamplePrompt_shard2_replica1/../../../../contrib/langid/lib
   [junit4]   2> 162657 WARN  (qtp20723666-1535) [n:localhost:35910_solr c:testCloudExamplePrompt s:shard1  x:testCloudExamplePrompt_shard1_replica2] o.a.s.c.SolrConfig Couldn't add files from /home/jenkins/workspace/Lucene-Solr-master-Linux/solr/build/solr-core/test/J1/temp/solr.util.TestSolrCLIRunExample_DD9AE3234E1320D4-001/tempDir-002/node1/testCloudExamplePrompt_shard1_replica2/../../../../contrib/clustering/lib filtered by .*\.jar to classpath: /home/jenkins/workspace/Lucene-Solr-master-Linux/solr/build/solr-core/test/J1/temp/solr.util.TestSolrCLIRunExample_DD9AE3234E1320D4-001/tempDir-002/node1/testCloudExamplePrompt_shard1_replica2/../../../../contrib/clustering/lib
   [junit4]   2> 162657 WARN  (qtp20723666-1534) [n:localhost:35910_solr c:testCloudExamplePrompt s:shard2  x:testCloudExamplePrompt_shard2_replica2] o.a.s.c.SolrConfig Couldn't add files from /home/jenkins/workspace/Lucene-Solr-master-Linux/solr/build/solr-core/test/J1/temp/solr.util.TestSolrCLIRunExample_DD9AE3234E1320D4-001/tempDir-002/node1/testCloudExamplePrompt_shard2_replica2/../../../../dist filtered by solr-clustering-\d.*\.jar to classpath: /home/jenkins/workspace/Lucene-Solr-master-Linux/solr/build/solr-core/test/J1/temp/solr.util.TestSolrCLIRunExample_DD9AE3234E1320D4-001/tempDir-002/node1/testCloudExamplePrompt_shard2_replica2/../../../../dist
   [junit4]   2> 162657 WARN  (qtp20723666-1535) [n:localhost:35910_solr c:testCloudExamplePrompt s:shard1  x:testCloudExamplePrompt_shard1_replica2] o.a.s.c.SolrConfig Couldn't add files from /home/jenkins/workspace/Lucene-Solr-master-Linux/solr/build/solr-core/test/J1/temp/solr.util.TestSolrCLIRunExample_DD9AE3234E1320D4-001/tempDir-002/node1/testCloudExamplePrompt_shard1_replica2/../../../../dist filtered by solr-clustering-\d.*\.jar to classpath: /home/jenkins/workspace/Lucene-Solr-master-Linux/solr/build/solr-core/test/J1/temp/solr.util.TestSolrCLIRunExample_DD9AE3234E1320D4-001/tempDir-002/node1/testCloudExamplePrompt_shard1_replica2/../../../../dist
   [junit4]   2> 162657 WARN  (qtp20723666-1530) [n:localhost:35910_solr c:testCloudExamplePrompt s:shard2  x:testCloudExamplePrompt_shard2_replica1] o.a.s.c.SolrConfig Couldn't add files from /home/jenkins/workspace/Lucene-Solr-master-Linux/solr/build/solr-core/test/J1/temp/solr.util.TestSolrCLIRunExample_DD9AE3234E1320D4-001/tempDir-002/node1/testCloudExamplePrompt_shard2_replica1/../../../../dist filtered by solr-langid-\d.*\.jar to classpath: /home/jenkins/workspace/Lucene-Solr-master-Linux/solr/build/solr-core/test/J1/temp/solr.util.TestSolrCLIRunExample_DD9AE3234E1320D4-001/tempDir-002/node1/testCloudExamplePrompt_shard2_replica1/../../../../dist
   [junit4]   2> 162657 WARN  (qtp20723666-1531) [n:localhost:35910_solr c:testCloudExamplePrompt s:shard1  x:testCloudExamplePrompt_shard1_replica1] o.a.s.c.SolrConfig Couldn't add files from /home/jenkins/workspace/Lucene-Solr-master-Linux/solr/build/solr-core/test/J1/temp/solr.util.TestSolrCLIRunExample_DD9AE3234E1320D4-001/tempDir-002/node1/testCloudExamplePrompt_shard1_replica1/../../../../dist filtered by solr-clustering-\d.*\.jar to classpath: /home/jenkins/workspace/Lucene-Solr-master-Linux/solr/build/solr-core/test/J1/temp/solr.util.TestSolrCLIRunExample_DD9AE3234E1320D4-001/tempDir-002/node1/testCloudExamplePrompt_shard1_replica1/../../../../dist
   [junit4]   2> 162657 WARN  (qtp20723666-1534) [n:localhost:35910_solr c:testCloudExamplePrompt s:shard2  x:testCloudExamplePrompt_shard2_replica2] o.a.s.c.SolrConfig Couldn't add files from /home/jenkins/workspace/Lucene-Solr-master-Linux/solr/build/solr-core/test/J1/temp/solr.util.TestSolrCLIRunExample_DD9AE3234E1320D4-001/tempDir-002/node1/testCloudExamplePrompt_shard2_replica2/../../../../contrib/langid/lib filtered by .*\.jar to classpath: /home/jenkins/workspace/Lucene-Solr-master-Linux/solr/build/solr-core/test/J1/temp/solr.util.TestSolrCLIRunExample_DD9AE3234E1320D4-001/tempDir-002/node1/testCloudExamplePrompt_shard2_replica2/../../../../contrib/langid/lib
   [junit4]   2> 162657 WARN  (qtp20723666-1535) [n:localhost:35910_solr c:testCloudExamplePrompt s:shard1  x:testCloudExamplePrompt_shard1_replica2] o.a.s.c.SolrConfig Couldn't add files from /home/jenkins/workspace/Lucene-Solr-master-Linux/solr/build/solr-core/test/J1/temp/solr.util.TestSolrCLIRunExample_DD9AE3234E1320D4-001/tempDir-002/node1/testCloudExamplePrompt_shard1_replica2/../../../../contrib/langid/lib filtered by .*\.jar to classpath: /home/jenkins/workspace/Lucene-Solr-master-Linux/solr/build/solr-core/test/J1/temp/solr.util.TestSolrCLIRunExample_DD9AE3234E1320D4-001/tempDir-002/node1/testCloudExamplePrompt_shard1_replica2/../../../../contrib/langid/lib
   [junit4]   2> 162657 WARN  (qtp20723666-1530) [n:localhost:35910_solr c:testCloudExamplePrompt s:shard2  x:testCloudExamplePrompt_shard2_replica1] o.a.s.c.SolrConfig Couldn't add files from /home/jenkins/workspace/Lucene-Solr-master-Linux/solr/build/solr-core/test/J1/temp/solr.util.TestSolrCLIRunExample_DD9AE3234E1320D4-001/tempDir-002/node1/testCloudExamplePrompt_shard2_replica1/../../../../contrib/velocity/lib filtered by .*\.jar to classpath: /home/jenkins/workspace/Lucene-Solr-master-Linux/solr/build/solr-core/test/J1/temp/solr.util.TestSolrCLIRunExample_DD9AE3234E1320D4-001/tempDir-002/node1/testCloudExamplePrompt_shard2_replica1/../../../../contrib/velocity/lib
   [junit4]   2> 162657 WARN  (qtp20723666-1534) [n:localhost:35910_solr c:testCloudExamplePrompt s:shard2  x:testCloudExamplePrompt_shard2_replica2] o.a.s.c.SolrConfig Couldn't add files from /home/jenkins/workspace/Lucene-Solr-master-Linux/solr/build/solr-core/test/J1/temp/solr.util.TestSolrCLIRunExample_DD9AE3234E1320D4-001/tempDir-002/node1/testCloudExamplePrompt_shard2_replica2/../../../../dist filtered by solr-langid-\d.*\.jar to classpath: /home/jenkins/workspace/Lucene-Solr-master-Linux/solr/build/solr-core/test/J1/temp/solr.util.TestSolrCLIRunExample_DD9AE3234E1320D4-001/tempDir-002/node1/testCloudExamplePrompt_shard2_replica2/../../../../dist
   [junit4]   2> 162658 WARN  (qtp20723666-1530) [n:localhost:35910_solr c:testCloudExamplePrompt s:shard2  x:testCloudExamplePrompt_shard2_replica1] o.a.s.c.SolrConfig Couldn't add files from /home/jenkins/workspace/Lucene-Solr-master-Linux/solr/build/solr-core/test/J1/temp/solr.util.TestSolrCLIRunExample_DD9AE3234E1320D4-001/tempDir-002/node1/testCloudExamplePrompt_shard2_replica1/../../../../dist filtered by solr-velocity-\d.*\.jar to classpath: /home/jenkins/workspace/Lucene-Solr-master-Linux/solr/build/solr-core/test/J1/temp/solr.util.TestSolrCLIRunExample_DD9AE3234E1320D4-001/tempDir-002/node1/testCloudExamplePrompt_shard2_replica1/../../../../dist
   [junit4]   2> 162657 WARN  (qtp20723666-1531) [n:localhost:35910_solr c:testCloudExamplePrompt s:shard1  x:testCloudExamplePrompt_shard1_replica1] o.a.s.c.SolrConfig Couldn't add files from /home/jenkins/workspace/Lucene-Solr-master-Linux/solr/build/solr-core/test/J1/temp/solr.util.TestSolrCLIRunExample_DD9AE3234E1320D4-001/tempDir-002/node1/testCloudExamplePrompt_shard1_replica1/../../../../contrib/langid/lib filtered by .*\.jar to classpath: /home/jenkins/workspace/Lucene-Solr-master-Linux/solr/build/solr-core/test/J1/temp/solr.util.TestSolrCLIRunExample_DD9AE3234E1320D4-001/tempDir-002/node1/testCloudExamplePrompt_shard1_replica1/../../../../contrib/langid/lib
   [junit4]   2> 162657 WARN  (qtp20723666-1535) [n:localhost:35910_solr c:testCloudExamplePrompt s:shard1  x:testCloudExamplePrompt_shard1_replica2] o.a.s.c.SolrConfig Couldn't add files from /home/jenkins/workspace/Lucene-Solr-master-Linux/solr/build/solr-core/test/J1/temp/solr.util.TestSolrCLIRunExample_DD9AE3234E1320D4-001/tempDir-002/node1/testCloudExamplePrompt_shard1_replica2/../../../../dist filtered by solr-langid-\d.*\.jar to classpath: /home/jenkins/workspace/Lucene-Solr-master-Linux/solr/build/solr-core/test/J1/temp/solr.util.TestSolrCLIRunExample_DD9AE3234E1320D4-001/tempDir-002/node1/testCloudExamplePrompt_shard1_replica2/../../../../dist
   [junit4]   2> 162658 WARN  (qtp20723666-1531) [n:localhost:35910_solr c:testCloudExamplePrompt s:shard1  x:testCloudExamplePrompt_shard1_replica1] o.a.s.c.SolrConfig Couldn't add files from /home/jenkins/workspace/Lucene-Solr-master-Linux/solr/build/solr-core/test/J1/temp/solr.util.TestSolrCLIRunExample_DD9AE3234E1320D4-001/tempDir-002/node1/testCloudExamplePrompt_shard1_replica1/../../../../dist filtered by solr-langid-\d.*\.jar to classpath: /home/jenkins/workspace/Lucene-Solr-master-Linux/solr/build/solr-core/test/J1/temp/solr.util.TestSolrCLIRunExample_DD9AE3234E1320D4-001/tempDir-002/node1/testCloudExamplePrompt_shard1_replica1/../../../../dist
   [junit4]   2> 162658 WARN  (qtp20723666-1534) [n:localhost:35910_solr c:testCloudExamplePrompt s:shard2  x:testCloudExamplePrompt_shard2_replica2] o.a.s.c.SolrConfig Couldn't add files from /home/jenkins/workspace/Lucene-Solr-master-Linux/solr/build/solr-core/test/J1/temp/solr.util.TestSolrCLIRunExample_DD9AE3234E1320D4-001/tempDir-002/node1/testCloudExamplePrompt_shard2_replica2/../../../../contrib/velocity/lib filtered by .*\.jar to classpath: /home/jenkins/workspace/Lucene-Solr-master-Linux/solr/build/solr-core/test/J1/temp/solr.util.TestSolrCLIRunExample_DD9AE3234E1320D4-001/tempDir-002/node1/testCloudExamplePrompt_shard2_replica2/../../../../contrib/velocity/lib
   [junit4]   2> 162658 WARN  (qtp20723666-1535) [n:localhost:35910_solr c:testCloudExamplePrompt s:shard1  x:testCloudExamplePrompt_shard1_replica2] o.a.s.c.SolrConfig Couldn't add files from /home/jenkins/workspace/Lucene-Solr-master-Linux/solr/build/solr-core/test/J1/temp/solr.util.TestSolrCLIRunExample_DD9AE3234E1320D4-001/tempDir-002/node1/testCloudExamplePrompt_shard1_replica2/../../../../contrib/velocity/lib filtered by .*\.jar to classpath: /home/jenkins/workspace/Lucene-Solr-master-Linux/solr/build/solr-core/test/J1/temp/solr.util.TestSolrCLIRunExample_DD9AE3234E1320D4-001/tempDir-002/node1/testCloudExamplePrompt_shard1_replica2/../../../../contrib/velocity/lib
   [junit4]   2> 162658 WARN  (qtp20723666-1531) [n:localhost:35910_solr c:testCloudExamplePrompt s:shard1  x:testCloudExamplePrompt_shard1_replica1] o.a.s.c.SolrConfig Couldn't add files from /home/jenkins/workspace/Lucene-Solr-master-Linux/solr/build/solr-core/test/J1/temp/solr.util.TestSolrCLIRunExample_DD9AE3234E1320D4-001/tempDir-002/node1/testCloudExamplePrompt_shard1_replica1/../../../../contrib/velocity/lib filtered by .*\.jar to classpath: /home/jenkins/workspace/Lucene-Solr-master-Linux/solr/build/solr-core/test/J1/temp/solr.util.TestSolrCLIRunExample_DD9AE3234E1320D4-001/tempDir-002/node1/testCloudExamplePrompt_shard1_replica1/../../../../contrib/velocity/lib
   [junit4]   2> 162658 WARN  (qtp20723666-1534) [n:localhost:35910_solr c:testCloudExamplePrompt s:shard2  x:testCloudExamplePrompt_shard2_replica2] o.a.s.c.SolrConfig Couldn't add files from /home/jenkins/workspace/Lucene-Solr-master-Linux/solr/build/solr-core/test/J1/temp/solr.util.TestSolrCLIRunExample_DD9AE3234E1320D4-001/tempDir-002/node1/testCloudExamplePrompt_shard2_replica2/../../../../dist filtered by solr-velocity-\d.*\.jar to classpath: /home/jenkins/workspace/Lucene-Solr-master-Linux/solr/build/solr-core/test/J1/temp/solr.util.TestSolrCLIRunExample_DD9AE3234E1320D4-001/tempDir-002/node1/testCloudExamplePrompt_shard2_replica2/../../../../dist
   [junit4]   2> 162658 WARN  (qtp20723666-1535) [n:localhost:35910_solr c:testCloudExamplePrompt s:shard1  x:testCloudExamplePrompt_shard1_replica2] o.a.s.c.SolrConfig Couldn't add files from /home/jenkins/workspace/Lucene-Solr-master-Linux/solr/build/solr-core/test/J1/temp/solr.util.TestSolrCLIRunExample_DD9AE3234E1320D4-001/tempDir-002/node1/testCloudExamplePrompt_shard1_replica2/../../../../dist filtered by solr-velocity-\d.*\.jar to classpath: /home/jenkins/workspace/Lucene-Solr-master-Linux/solr/build/solr-core/test/J1/temp/solr.util.TestSolrCLIRunExample_DD9AE3234E1320D4-001/tempDir-002/node1/testCloudExamplePrompt_shard1_replica2/../../../../dist
   [junit4]   2> 162658 WARN  (qtp20723666-1531) [n:localhost:35910_solr c:testCloudExamplePrompt s:shard1  x:testCloudExamplePrompt_shard1_replica1] o.a.s.c.SolrConfig Couldn't add files from /home/jenkins/workspace/Lucene-Solr-master-Linux/solr/build/solr-core/test/J1/temp/solr.util.TestSolrCLIRunExample_DD9AE3234E1320D4-001/tempDir-002/node1/testCloudExamplePrompt_shard1_replica1/../../../../dist filtered by solr-velocity-\d.*\.jar to classpath: /home/jenkins/workspace/Lucene-Solr-master-Linux/solr/build/solr-core/test/J1/temp/solr.util.TestSolrCLIRunExample_DD9AE3234E1320D4-001/tempDir-002/node1/testCloudExamplePrompt_shard1_replica1/../../../../dist
   [junit4]   2> 162664 INFO  (qtp20723666-1530) [n:localhost:35910_solr c:testCloudExamplePrompt s:shard2  x:testCloudExamplePrompt_shard2_replica1] o.a.s.c.SolrConfig Using Lucene MatchVersion: 7.0.0
   [junit4]   2> 162666 INFO  (qtp20723666-1534) [n:localhost:35910_solr c:testCloudExamplePrompt s:shard2  x:testCloudExamplePrompt_shard2_replica2] o.a.s.c.SolrConfig Using Lucene MatchVersion: 7.0.0
   [junit4]   2> 162669 INFO  (qtp20723666-1531) [n:localhost:35910_solr c:testCloudExamplePrompt s:shard1  x:testCloudExamplePrompt_shard1_replica1] o.a.s.c.SolrConfig Using Lucene MatchVersion: 7.0.0
   [junit4]   2> 162669 INFO  (qtp20723666-1535) [n:localhost:35910_solr c:testCloudExamplePrompt s:shard1  x:testCloudExamplePrompt_shard1_replica2] o.a.s.c.SolrConfig Using Lucene MatchVersion: 7.0.0
   [junit4]   2> 162691 INFO  (qtp20723666-1530) [n:localhost:35910_solr c:testCloudExamplePrompt s:shard2  x:testCloudExamplePrompt_shard2_replica1] o.a.s.s.IndexSchema [testCloudExamplePrompt_shard2_replica1] Schema name=example-data-driven-schema
   [junit4]   2> 162692 INFO  (qtp20723666-1534) [n:localhost:35910_solr c:testCloudExamplePrompt s:shard2  x:testCloudExamplePrompt_shard2_replica2] o.a.s.s.IndexSchema [testCloudExamplePrompt_shard2_replica2] Schema name=example-data-driven-schema
   [junit4]   2> 162714 INFO  (qtp20723666-1535) [n:localhost:35910_solr c:testCloudExamplePrompt s:shard1  x:testCloudExamplePrompt_shard1_replica2] o.a.s.s.IndexSchema [testCloudExamplePrompt_shard1_replica2] Schema name=example-data-driven-schema
   [junit4]   2> 162714 INFO  (qtp20723666-1531) [n:localhost:35910_solr c:testCloudExamplePrompt s:shard1  x:testCloudExamplePrompt_shard1_replica1] o.a.s.s.IndexSchema [testCloudExamplePrompt_shard1_replica1] Schema name=example-data-driven-schema
   [junit4]   2> 162994 INFO  (qtp20723666-1530) [n:localhost:35910_solr c:testCloudExamplePrompt s:shard2  x:testCloudExamplePrompt_shard2_replica1] o.a.s.s.IndexSchema Loaded schema example-data-driven-schema/1.6 with uniqueid field id
   [junit4]   2> 162994 INFO  (qtp20723666-1534) [n:localhost:35910_solr c:testCloudExamplePrompt s:shard2  x:testCloudExamplePrompt_shard2_replica2] o.a.s.s.IndexSchema Loaded schema example-data-driven-schema/1.6 with uniqueid field id
   [junit4]   2> 162994 INFO  (qtp20723666-1531) [n:localhost:35910_solr c:testCloudExamplePrompt s:shard1  x:testCloudExamplePrompt_shard1_replica1] o.a.s.s.IndexSchema Loaded schema example-data-driven-schema/1.6 with uniqueid field id
   [junit4]   2> 162994 INFO  (qtp20723666-1535) [n:localhost:35910_solr c:testCloudExamplePrompt s:shard1  x:testCloudExamplePrompt_shard1_replica2] o.a.s.s.IndexSchema Loaded schema example-data-driven-schema/1.6 with uniqueid field id
   [junit4]   2> 163038 INFO  (qtp20723666-1531) [n:localhost:35910_solr c:testCloudExamplePrompt s:shard1  x:testCloudExamplePrompt_shard1_replica1] o.a.s.c.CoreContainer Creating SolrCore 'testCloudExamplePrompt_shard1_replica1' using configuration from collection testCloudExamplePrompt, trusted=true
   [junit4]   2> 163038 INFO  (qtp20723666-1530) [n:localhost:35910_solr c:testCloudExamplePrompt s:shard2  x:testCloudExamplePrompt_shard2_replica1] o.a.s.c.CoreContainer Creating SolrCore 'testCloudExamplePrompt_shard2_replica1' using configuration from collection testCloudExamplePrompt, trusted=true
   [junit4]   2> 163039 INFO  (qtp20723666-1531) [n:localhost:35910_solr c:testCloudExamplePrompt s:shard1  x:testCloudExamplePrompt_shard1_replica1] o.a.s.m.r.SolrJmxReporter JMX monitoring for 'solr.core.testCloudExamplePrompt.shard1.replica1' (registry 'solr.core.testCloudExamplePrompt.shard1.replica1') enabled at server: com.sun.jmx.mbeanserver.JmxMBeanServer@279ec2
   [junit4]   2> 163039 INFO  (qtp20723666-1531) [n:localhost:35910_solr c:testCloudExamplePrompt s:shard1  x:testCloudExamplePrompt_shard1_replica1] o.a.s.c.SolrCore solr.RecoveryStrategy.Builder
   [junit4]   2> 163039 INFO  (qtp20723666-1531) [n:localhost:35910_solr c:testCloudExamplePrompt s:shard1  x:testCloudExamplePrompt_shard1_replica1] o.a.s.c.SolrCore [[testCloudExamplePrompt_shard1_replica1] ] Opening new SolrCore at [/home/jenkins/workspace/Lucene-Solr-master-Linux/solr/build/solr-core/test/J1/temp/solr.util.TestSolrCLIRunExample_DD9AE3234E1320D4-001/tempDir-002/node1/testCloudExamplePrompt_shard1_replica1], dataDir=[/home/jenkins/workspace/Lucene-Solr-master-Linux/solr/build/solr-core/test/J1/temp/solr.util.TestSolrCLIRunExample_DD9AE3234E1320D4-001/tempDir-002/node1/testCloudExamplePrompt_shard1_replica1/data/]
   [junit4]   2> 163039 INFO  (qtp20723666-1534) [n:localhost:35910_solr c:testCloudExamplePrompt s:shard2  x:testCloudExamplePrompt_shard2_replica2] o.a.s.c.CoreContainer Creating SolrCore 'testCloudExamplePrompt_shard2_replica2' using configuration from collection testCloudExamplePrompt, trusted=true
   [junit4]   2> 163039 INFO  (qtp20723666-1530) [n:localhost:35910_solr c:testCloudExamplePrompt s:shard2  x:testCloudExamplePrompt_shard2_replica1] o.a.s.m.r.SolrJmxReporter JMX monitoring for 'solr.core.testCloudExamplePrompt.shard2.replica1' (registry 'solr.core.testCloudExamplePrompt.shard2.replica1') enabled at server: com.sun.jmx.mbeanserver.JmxMBeanServer@279ec2
   [junit4]   2> 163039 INFO  (qtp20723666-1530) [n:localhost:35910_solr c:testCloudExamplePrompt s:shard2  x:testCloudExamplePrompt_shard2_replica1] o.a.s.c.SolrCore solr.RecoveryStrategy.Builder
   [junit4]   2> 163039 INFO  (qtp20723666-1530) [n:localhost:35910_solr c:testCloudExamplePrompt s:shard2  x:testCloudExamplePrompt_shard2_replica1] o.a.s.c.SolrCore [[testCloudExamplePrompt_shard2_replica1] ] Opening new SolrCore at [/home/jenkins/workspace/Lucene-Solr-master-Linux/solr/build/solr-core/test/J1/temp/solr.util.TestSolrCLIRunExample_DD9AE3234E1320D4-001/tempDir-002/node1/testCloudExamplePrompt_shard2_replica1], dataDir=[/home/jenkins/workspace/Lucene-Solr-master-Linux/solr/build/solr-core/test/J1/temp/solr.util.TestSolrCLIRunExample_DD9AE3234E1320D4-001/tempDir-002/node1/testCloudExamplePrompt_shard2_replica1/data/]
   [junit4]   2> 163039 INFO  (qtp20723666-1534) [n:localhost:35910_solr c:testCloudExamplePrompt s:shard2  x:testCloudExamplePrompt_shard2_replica2] o.a.s.m.r.SolrJmxReporter JMX monitoring for 'solr.core.testCloudExamplePrompt.shard2.replica2' (registry 'solr.core.testCloudExamplePrompt.shard2.replica2') enabled at server: com.sun.jmx.mbeanserver.JmxMBeanServer@279ec2
   [junit4]   2> 163039 INFO  (qtp20723666-1534) [n:localhost:35910_solr c:testCloudExamplePrompt s:shard2  x:testCloudExamplePrompt_shard2_replica2] o.a.s.c.SolrCore solr.RecoveryStrategy.Builder
   [junit4]   2> 163040 INFO  (qtp20723666-1534) [n:localhost:35910_solr c:testCloudExamplePrompt s:shard2  x:testCloudExamplePrompt_shard2_replica2] o.a.s.c.SolrCore [[testCloudExamplePrompt_shard2_replica2] ] Opening new SolrCore at [/home/jenkins/workspace/Lucene-Solr-master-Linux/solr/build/solr-core/test/J1/temp/solr.util.TestSolrCLIRunExample_DD9AE3234E1320D4-001/tempDir-002/node1/testCloudExamplePrompt_shard2_replica2], dataDir=[/home/jenkins/workspace/Lucene-Solr-master-Linux/solr/build/solr-core/test/J1/temp/solr.util.TestSolrCLIRunExample_DD9AE3234E1320D4-001/tempDir-002/node1/testCloudExamplePrompt_shard2_replica2/data/]
   [junit4]   2> 163042 INFO  (qtp20723666-1535) [n:localhost:35910_solr c:testCloudExamplePrompt s:shard1  x:testCloudExamplePrompt_shard1_replica2] o.a.s.c.CoreContainer Creating SolrCore 'testCloudExamplePrompt_shard1_replica2' using configuration from collection testCloudExamplePrompt, trusted=true
   [junit4]   2> 163043 INFO  (qtp20723666-1535) [n:localhost:35910_solr c:testCloudExamplePrompt s:shard1  x:testCloudExamplePrompt_shard1_replica2] o.a.s.m.r.SolrJmxReporter JMX monitoring for 'solr.core.testCloudExamplePrompt.shard1.replica2' (registry 'solr.core.testCloudExamplePrompt.shard1.replica2') enabled at server: com.sun.jmx.mbeanserver.JmxMBeanServer@279ec2
   [junit4]   2> 163044 INFO  (qtp20723666-1535) [n:localhost:35910_solr c:testCloudExamplePrompt s:shard1  x:testCloudExamplePrompt_shard1_replica2] o.a.s.c.SolrCore solr.RecoveryStrategy.Builder
   [junit4]   2> 163044 INFO  (qtp20723666-1535) [n:localhost:35910_solr c:testCloudExamplePrompt s:shard1  x:testCloudExamplePrompt_shard1_replica2] o.a.s.c.SolrCore [[testCloudExamplePrompt_shard1_replica2] ] Opening new SolrCore at [/home/jenkins/workspace/Lucene-Solr-master-Linux/solr/build/solr-core/test/J1/temp/solr.util.TestSolrCLIRunExample_DD9AE3234E1320D4-001/tempDir-002/node1/testCloudExamplePrompt_shard1_replica2], dataDir=[/home/jenkins/workspace/Lucene-Solr-master-Linux/solr/build/solr-core/test/J1/temp/solr.util.TestSolrCLIRunExample_DD9AE3234E1320D4-001/tempDir-002/node1/testCloudExamplePrompt_shard1_replica2/data/]
   [junit4]   2> 163074 INFO  (qtp20723666-1534) [n:localhost:35910_solr c:testCloudExamplePrompt s:shard2  x:testCloudExamplePrompt_shard2_replica2] o.a.s.r.XSLTResponseWriter xsltCacheLifetimeSeconds=5
   [junit4]   2> 163074 INFO  (qtp20723666-1530) [n:localhost:35910_solr c

[...truncated too long message...]

ndler2 start commit{,optimize=false,openSearcher=true,waitSearcher=true,expungeDeletes=false,softCommit=false,prepareCommit=false}
   [junit4]   2> 1107436 INFO  (TEST-TestJmxIntegration.testJmxUpdate-seed#[DD9AE3234E1320D4]) [    ] o.a.s.u.SolrIndexWriter Calling setCommitData with IW:org.apache.solr.update.SolrIndexWriter@f58554 commitCommandVersion:0
   [junit4]   2> 1107438 INFO  (TEST-TestJmxIntegration.testJmxUpdate-seed#[DD9AE3234E1320D4]) [    ] o.a.s.s.SolrIndexSearcher Opening [Searcher@1ebb663[collection1] main]
   [junit4]   2> 1107439 INFO  (TEST-TestJmxIntegration.testJmxUpdate-seed#[DD9AE3234E1320D4]) [    ] o.a.s.u.DirectUpdateHandler2 end_commit_flush
   [junit4]   2> 1107441 INFO  (searcherExecutor-4156-thread-1) [    ] o.a.s.c.SolrCore [collection1] Registered new searcher Searcher@1ebb663[collection1] main{ExitableDirectoryReader(UninvertingDirectoryReader(Uninverting(_0(7.0.0):C1)))}
   [junit4]   2> 1107441 INFO  (TEST-TestJmxIntegration.testJmxUpdate-seed#[DD9AE3234E1320D4]) [    ] o.a.s.u.p.LogUpdateProcessorFactory [collection1]  webapp=null path=null params={}{commit=} 0 4
   [junit4]   2> 1107442 INFO  (TEST-TestJmxIntegration.testJmxUpdate-seed#[DD9AE3234E1320D4]) [    ] o.a.s.SolrTestCaseJ4 ###Ending testJmxUpdate
   [junit4]   2> 1107444 INFO  (TEST-TestJmxIntegration.testJmxRegistration-seed#[DD9AE3234E1320D4]) [    ] o.a.s.SolrTestCaseJ4 ###Starting testJmxRegistration
   [junit4]   2> 1107556 INFO  (TEST-TestJmxIntegration.testJmxRegistration-seed#[DD9AE3234E1320D4]) [    ] o.a.s.SolrTestCaseJ4 ###Ending testJmxRegistration
   [junit4]   2> NOTE: reproduce with: ant test  -Dtestcase=TestJmxIntegration -Dtests.method=testJmxRegistration -Dtests.seed=DD9AE3234E1320D4 -Dtests.multiplier=3 -Dtests.slow=true -Dtests.locale=en-MT -Dtests.timezone=EET -Dtests.asserts=true -Dtests.file.encoding=US-ASCII
   [junit4] ERROR   0.12s J1 | TestJmxIntegration.testJmxRegistration <<<
   [junit4]    > Throwable #1: javax.management.RuntimeMBeanException: org.apache.lucene.store.AlreadyClosedException: this IndexReader is closed
   [junit4]    > 	at __randomizedtesting.SeedInfo.seed([DD9AE3234E1320D4:534B8719235278B1]:0)
   [junit4]    > 	at com.sun.jmx.interceptor.DefaultMBeanServerInterceptor.rethrow(DefaultMBeanServerInterceptor.java:839)
   [junit4]    > 	at com.sun.jmx.interceptor.DefaultMBeanServerInterceptor.rethrowMaybeMBeanException(DefaultMBeanServerInterceptor.java:852)
   [junit4]    > 	at com.sun.jmx.interceptor.DefaultMBeanServerInterceptor.getAttribute(DefaultMBeanServerInterceptor.java:651)
   [junit4]    > 	at com.sun.jmx.mbeanserver.JmxMBeanServer.getAttribute(JmxMBeanServer.java:678)
   [junit4]    > 	at org.apache.solr.core.TestJmxIntegration.testJmxRegistration(TestJmxIntegration.java:121)
   [junit4]    > 	at java.lang.Thread.run(Thread.java:745)
   [junit4]    > Caused by: org.apache.lucene.store.AlreadyClosedException: this IndexReader is closed
   [junit4]    > 	at org.apache.lucene.index.IndexReader.ensureOpen(IndexReader.java:266)
   [junit4]    > 	at org.apache.lucene.index.StandardDirectoryReader.getVersion(StandardDirectoryReader.java:338)
   [junit4]    > 	at org.apache.lucene.index.FilterDirectoryReader.getVersion(FilterDirectoryReader.java:119)
   [junit4]    > 	at org.apache.lucene.index.FilterDirectoryReader.getVersion(FilterDirectoryReader.java:119)
   [junit4]    > 	at org.apache.solr.search.SolrIndexSearcher.lambda$initializeMetrics$14(SolrIndexSearcher.java:2251)
   [junit4]    > 	at com.codahale.metrics.JmxReporter$JmxGauge.getValue(JmxReporter.java:189)
   [junit4]    > 	at com.sun.jmx.mbeanserver.StandardMBeanIntrospector.invokeM2(StandardMBeanIntrospector.java:112)
   [junit4]    > 	at com.sun.jmx.mbeanserver.StandardMBeanIntrospector.invokeM2(StandardMBeanIntrospector.java:46)
   [junit4]    > 	at com.sun.jmx.mbeanserver.MBeanIntrospector.invokeM(MBeanIntrospector.java:237)
   [junit4]    > 	at com.sun.jmx.mbeanserver.PerInterface.getAttribute(PerInterface.java:83)
   [junit4]    > 	at com.sun.jmx.mbeanserver.MBeanSupport.getAttribute(MBeanSupport.java:206)
   [junit4]    > 	at com.sun.jmx.interceptor.DefaultMBeanServerInterceptor.getAttribute(DefaultMBeanServerInterceptor.java:647)
   [junit4]    > 	... 41 more
   [junit4]   2> 1107557 INFO  (SUITE-TestJmxIntegration-seed#[DD9AE3234E1320D4]-worker) [    ] o.a.s.SolrTestCaseJ4 ###deleteCore
   [junit4]   2> 1107557 INFO  (SUITE-TestJmxIntegration-seed#[DD9AE3234E1320D4]-worker) [    ] o.a.s.c.CoreContainer Shutting down CoreContainer instance=12791980
   [junit4]   2> 1107557 INFO  (SUITE-TestJmxIntegration-seed#[DD9AE3234E1320D4]-worker) [    ] o.a.s.m.SolrMetricManager Closing metric reporters for registry=solr.node, tag=null
   [junit4]   2> 1107559 INFO  (SUITE-TestJmxIntegration-seed#[DD9AE3234E1320D4]-worker) [    ] o.a.s.m.SolrMetricManager Closing metric reporters for registry=solr.jvm, tag=null
   [junit4]   2> 1107560 INFO  (SUITE-TestJmxIntegration-seed#[DD9AE3234E1320D4]-worker) [    ] o.a.s.m.SolrMetricManager Closing metric reporters for registry=solr.jetty, tag=null
   [junit4]   2> 1107560 INFO  (SUITE-TestJmxIntegration-seed#[DD9AE3234E1320D4]-worker) [    ] o.a.s.c.TransientSolrCoreCacheDefault Allocating transient cache for 2147483647 transient cores
   [junit4]   2> 1107560 INFO  (coreCloseExecutor-4161-thread-1) [    x:collection1] o.a.s.c.SolrCore [collection1]  CLOSING SolrCore org.apache.solr.core.SolrCore@ab3602
   [junit4]   2> 1107561 INFO  (coreCloseExecutor-4161-thread-1) [    x:collection1] o.a.s.m.SolrMetricManager Closing metric reporters for registry=solr.core.collection1, tag=11220482
   [junit4]   2> NOTE: leaving temporary files on disk at: /home/jenkins/workspace/Lucene-Solr-master-Linux/solr/build/solr-core/test/J1/temp/solr.core.TestJmxIntegration_DD9AE3234E1320D4-001
   [junit4]   2> NOTE: test params are: codec=DummyCompressingStoredFields(storedFieldsFormat=CompressingStoredFieldsFormat(compressionMode=DUMMY, chunkSize=5, maxDocsPerChunk=511, blockSize=305), termVectorsFormat=CompressingTermVectorsFormat(compressionMode=DUMMY, chunkSize=5, blockSize=305)), sim=RandomSimilarity(queryNorm=true): {}, locale=en-MT, timezone=EET
   [junit4]   2> NOTE: Linux 4.4.0-72-generic i386/Oracle Corporation 1.8.0_121 (32-bit)/cpus=12,threads=1,free=130456208,total=402128896
   [junit4]   2> NOTE: All tests run in this JVM: [TestCoreAdminApis, TestDefaultStatsCache, TestDynamicLoading, CleanupOldIndexTest, TestConfigSetsAPIExclusivity, FileUtilsTest, TestCharFilters, TestManagedSchemaThreadSafety, TestReplicationHandlerBackup, SoftAutoCommitTest, TestXIncludeConfig, ConvertedLegacyTest, TestQueryUtils, BigEndianAscendingWordDeserializerTest, TestMinMaxOnMultiValuedField, SSLMigrationTest, SpellCheckCollatorTest, SortByFunctionTest, SimplePostToolTest, TestCollationFieldDocValues, TestSubQueryTransformer, CSVRequestHandlerTest, ConnectionReuseTest, SolrSlf4jReporterTest, TestExportWriter, TestSearchPerf, SolrCmdDistributorTest, TestMacroExpander, TestSolrCLIRunExample, TestConfigSets, TestRecoveryHdfs, TestSystemIdResolver, TestExclusionRuleCollectionAccess, TestNonDefinedSimilarityFactory, HttpSolrCallGetCoreTest, TestSolrQueryParserDefaultOperatorResource, OnlyLeaderIndexesTest, WordBreakSolrSpellCheckerTest, IndexBasedSpellCheckerTest, TestFieldCollectionResource, AssignTest, TestWordDelimiterFilterFactory, ResourceLoaderTest, ZkSolrClientTest, TestUpdate, TestXmlQParserPlugin, CollectionStateFormat2Test, TestEmbeddedSolrServerConstructors, TestHashPartitioner, TestSimpleTrackingShardHandler, TestHdfsUpdateLog, TestApiFramework, RecoveryAfterSoftCommitTest, HLLUtilTest, TestSweetSpotSimilarityFactory, TestPerFieldSimilarity, ScriptEngineTest, BlockJoinFacetSimpleTest, TestDeleteCollectionOnDownNodes, DeleteInactiveReplicaTest, SimpleMLTQParserTest, TolerantUpdateProcessorTest, CoreAdminCreateDiscoverTest, TriLevelCompositeIdRoutingTest, HdfsCollectionsAPIDistributedZkTest, FacetPivotSmallTest, ChaosMonkeySafeLeaderTest, DistribCursorPagingTest, TestClusterProperties, TestSchemalessBufferedUpdates, DeleteReplicaTest, TestStressRecovery, TestTolerantUpdateProcessorCloud, UpdateRequestProcessorFactoryTest, TestSolrCoreParser, HighlighterMaxOffsetTest, OverseerStatusTest, SpellCheckComponentTest, SolrIndexSplitterTest, OverseerCollectionConfigSetProcessorTest, TestJavabinTupleStreamParser, TestFiltering, SliceStateTest, TestFastLRUCache, HdfsThreadLeakTest, TestDelegationWithHadoopAuth, TestSQLHandler, TestNoOpRegenerator, TestFuzzyAnalyzedSuggestions, LeaderFailoverAfterPartitionTest, TestSchemaSimilarityResource, CdcrBootstrapTest, TestCloudManagedSchema, QueryParsingTest, TestShardHandlerFactory, BlockCacheTest, PrimUtilsTest, SchemaVersionSpecificBehaviorTest, SpellCheckCollatorWithCollapseTest, DirectSolrConnectionTest, CollectionsAPIDistributedZkTest, ShardRoutingCustomTest, TestScoreJoinQPScore, SubstringBytesRefFilterTest, DistributedTermsComponentTest, SuggesterFSTTest, TestSolrIndexConfig, HdfsDirectoryFactoryTest, SharedFSAutoReplicaFailoverTest, TestFieldSortValues, BJQParserTest, DistanceFunctionTest, TestFileDictionaryLookup, IndexSchemaRuntimeFieldTest, DistributedQueueTest, FullSolrCloudDistribCmdsTest, TestRandomDVFaceting, TermVectorComponentDistributedTest, TestStressVersions, HardAutoCommitTest, StatsComponentTest, BasicFunctionalityTest, TestBadConfig, HighlighterTest, CurrencyFieldOpenExchangeTest, CurrencyFieldXmlFileTest, TestCoreDiscovery, TestExtendedDismaxParser, SolrRequestParserTest, TestFoldingMultitermQuery, DocValuesTest, DebugComponentTest, TestSurroundQueryParser, StandardRequestHandlerTest, DirectSolrSpellCheckerTest, DocumentAnalysisRequestHandlerTest, TestQueryTypes, PrimitiveFieldTypeTest, XmlUpdateRequestHandlerTest, PathHierarchyTokenizerFactoryTest, TestIndexingPerformance, LoggingHandlerTest, TestJmxIntegration]
   [junit4] Completed [424/702 (2!)] on J1 in 0.81s, 3 tests, 1 error, 1 skipped <<< FAILURES!

[...truncated 40254 lines...]


Mime
View raw message