lucene-dev mailing list archives

Site index · List index
Message view « Date » · « Thread »
Top « Date » · « Thread »
From Apache Jenkins Server <jenk...@builds.apache.org>
Subject [JENKINS] Lucene-Solr-NightlyTests-6.x - Build # 331 - Still Unstable
Date Thu, 20 Apr 2017 11:44:52 GMT
Build: https://builds.apache.org/job/Lucene-Solr-NightlyTests-6.x/331/

2 tests failed.
FAILED:  org.apache.solr.cloud.MissingSegmentRecoveryTest.testLeaderRecovery

Error Message:
Expected a collection with one shard and two replicas null Last available state: DocCollection(MissingSegmentRecoveryTest//collections/MissingSegmentRecoveryTest/state.json/7)={   "replicationFactor":"2",   "shards":{"shard1":{       "range":"80000000-7fffffff",       "state":"active",       "replicas":{         "core_node1":{           "core":"MissingSegmentRecoveryTest_shard1_replica1",           "base_url":"http://127.0.0.1:48702/solr",           "node_name":"127.0.0.1:48702_solr",           "state":"active",           "leader":"true"},         "core_node2":{           "core":"MissingSegmentRecoveryTest_shard1_replica2",           "base_url":"http://127.0.0.1:44887/solr",           "node_name":"127.0.0.1:44887_solr",           "state":"down"}}}},   "router":{"name":"compositeId"},   "maxShardsPerNode":"1",   "autoAddReplicas":"false"}

Stack Trace:
java.lang.AssertionError: Expected a collection with one shard and two replicas
null
Last available state: DocCollection(MissingSegmentRecoveryTest//collections/MissingSegmentRecoveryTest/state.json/7)={
  "replicationFactor":"2",
  "shards":{"shard1":{
      "range":"80000000-7fffffff",
      "state":"active",
      "replicas":{
        "core_node1":{
          "core":"MissingSegmentRecoveryTest_shard1_replica1",
          "base_url":"http://127.0.0.1:48702/solr",
          "node_name":"127.0.0.1:48702_solr",
          "state":"active",
          "leader":"true"},
        "core_node2":{
          "core":"MissingSegmentRecoveryTest_shard1_replica2",
          "base_url":"http://127.0.0.1:44887/solr",
          "node_name":"127.0.0.1:44887_solr",
          "state":"down"}}}},
  "router":{"name":"compositeId"},
  "maxShardsPerNode":"1",
  "autoAddReplicas":"false"}
	at __randomizedtesting.SeedInfo.seed([D8ECC85A49A09819:88B9505910812E04]:0)
	at org.junit.Assert.fail(Assert.java:93)
	at org.apache.solr.cloud.SolrCloudTestCase.waitForState(SolrCloudTestCase.java:265)
	at org.apache.solr.cloud.MissingSegmentRecoveryTest.testLeaderRecovery(MissingSegmentRecoveryTest.java:105)
	at sun.reflect.NativeMethodAccessorImpl.invoke0(Native Method)
	at sun.reflect.NativeMethodAccessorImpl.invoke(NativeMethodAccessorImpl.java:62)
	at sun.reflect.DelegatingMethodAccessorImpl.invoke(DelegatingMethodAccessorImpl.java:43)
	at java.lang.reflect.Method.invoke(Method.java:498)
	at com.carrotsearch.randomizedtesting.RandomizedRunner.invoke(RandomizedRunner.java:1713)
	at com.carrotsearch.randomizedtesting.RandomizedRunner$8.evaluate(RandomizedRunner.java:907)
	at com.carrotsearch.randomizedtesting.RandomizedRunner$9.evaluate(RandomizedRunner.java:943)
	at com.carrotsearch.randomizedtesting.RandomizedRunner$10.evaluate(RandomizedRunner.java:957)
	at com.carrotsearch.randomizedtesting.rules.SystemPropertiesRestoreRule$1.evaluate(SystemPropertiesRestoreRule.java:57)
	at org.apache.lucene.util.TestRuleSetupTeardownChained$1.evaluate(TestRuleSetupTeardownChained.java:49)
	at org.apache.lucene.util.AbstractBeforeAfterRule$1.evaluate(AbstractBeforeAfterRule.java:45)
	at org.apache.lucene.util.TestRuleThreadAndTestName$1.evaluate(TestRuleThreadAndTestName.java:48)
	at org.apache.lucene.util.TestRuleIgnoreAfterMaxFailures$1.evaluate(TestRuleIgnoreAfterMaxFailures.java:64)
	at org.apache.lucene.util.TestRuleMarkFailure$1.evaluate(TestRuleMarkFailure.java:47)
	at com.carrotsearch.randomizedtesting.rules.StatementAdapter.evaluate(StatementAdapter.java:36)
	at com.carrotsearch.randomizedtesting.ThreadLeakControl$StatementRunner.run(ThreadLeakControl.java:368)
	at com.carrotsearch.randomizedtesting.ThreadLeakControl.forkTimeoutingTask(ThreadLeakControl.java:817)
	at com.carrotsearch.randomizedtesting.ThreadLeakControl$3.evaluate(ThreadLeakControl.java:468)
	at com.carrotsearch.randomizedtesting.RandomizedRunner.runSingleTest(RandomizedRunner.java:916)
	at com.carrotsearch.randomizedtesting.RandomizedRunner$5.evaluate(RandomizedRunner.java:802)
	at com.carrotsearch.randomizedtesting.RandomizedRunner$6.evaluate(RandomizedRunner.java:852)
	at com.carrotsearch.randomizedtesting.RandomizedRunner$7.evaluate(RandomizedRunner.java:863)
	at com.carrotsearch.randomizedtesting.rules.StatementAdapter.evaluate(StatementAdapter.java:36)
	at com.carrotsearch.randomizedtesting.rules.SystemPropertiesRestoreRule$1.evaluate(SystemPropertiesRestoreRule.java:57)
	at org.apache.lucene.util.AbstractBeforeAfterRule$1.evaluate(AbstractBeforeAfterRule.java:45)
	at com.carrotsearch.randomizedtesting.rules.StatementAdapter.evaluate(StatementAdapter.java:36)
	at org.apache.lucene.util.TestRuleStoreClassName$1.evaluate(TestRuleStoreClassName.java:41)
	at com.carrotsearch.randomizedtesting.rules.NoShadowingOrOverridesOnMethodsRule$1.evaluate(NoShadowingOrOverridesOnMethodsRule.java:40)
	at com.carrotsearch.randomizedtesting.rules.NoShadowingOrOverridesOnMethodsRule$1.evaluate(NoShadowingOrOverridesOnMethodsRule.java:40)
	at com.carrotsearch.randomizedtesting.rules.StatementAdapter.evaluate(StatementAdapter.java:36)
	at com.carrotsearch.randomizedtesting.rules.StatementAdapter.evaluate(StatementAdapter.java:36)
	at com.carrotsearch.randomizedtesting.rules.StatementAdapter.evaluate(StatementAdapter.java:36)
	at org.apache.lucene.util.TestRuleAssertionsRequired$1.evaluate(TestRuleAssertionsRequired.java:53)
	at org.apache.lucene.util.TestRuleMarkFailure$1.evaluate(TestRuleMarkFailure.java:47)
	at org.apache.lucene.util.TestRuleIgnoreAfterMaxFailures$1.evaluate(TestRuleIgnoreAfterMaxFailures.java:64)
	at org.apache.lucene.util.TestRuleIgnoreTestSuites$1.evaluate(TestRuleIgnoreTestSuites.java:54)
	at com.carrotsearch.randomizedtesting.rules.StatementAdapter.evaluate(StatementAdapter.java:36)
	at com.carrotsearch.randomizedtesting.ThreadLeakControl$StatementRunner.run(ThreadLeakControl.java:368)
	at java.lang.Thread.run(Thread.java:745)


FAILED:  org.apache.solr.cloud.TestStressCloudBlindAtomicUpdates.test_dv

Error Message:
java.lang.RuntimeException: Error from server at http://127.0.0.1:38570/solr/test_col: Async exception during distributed update: Error from server at http://127.0.0.1:52802/solr/test_col_shard2_replica1: Server Error    request: http://127.0.0.1:52802/solr/test_col_shard2_replica1/update?update.distrib=TOLEADER&distrib.from=http%3A%2F%2F127.0.0.1%3A38570%2Fsolr%2Ftest_col_shard5_replica1%2F&wt=javabin&version=2 Remote error message: Failed synchronous update on shard StdNode: http://127.0.0.1:47127/solr/test_col_shard2_replica2/ update: org.apache.solr.client.solrj.request.UpdateRequest@7a816014

Stack Trace:
java.util.concurrent.ExecutionException: java.lang.RuntimeException: Error from server at http://127.0.0.1:38570/solr/test_col: Async exception during distributed update: Error from server at http://127.0.0.1:52802/solr/test_col_shard2_replica1: Server Error



request: http://127.0.0.1:52802/solr/test_col_shard2_replica1/update?update.distrib=TOLEADER&distrib.from=http%3A%2F%2F127.0.0.1%3A38570%2Fsolr%2Ftest_col_shard5_replica1%2F&wt=javabin&version=2
Remote error message: Failed synchronous update on shard StdNode: http://127.0.0.1:47127/solr/test_col_shard2_replica2/ update: org.apache.solr.client.solrj.request.UpdateRequest@7a816014
	at __randomizedtesting.SeedInfo.seed([D8ECC85A49A09819:EEF8AA1CC3FDA208]:0)
	at java.util.concurrent.FutureTask.report(FutureTask.java:122)
	at java.util.concurrent.FutureTask.get(FutureTask.java:192)
	at org.apache.solr.cloud.TestStressCloudBlindAtomicUpdates.checkField(TestStressCloudBlindAtomicUpdates.java:281)
	at org.apache.solr.cloud.TestStressCloudBlindAtomicUpdates.test_dv(TestStressCloudBlindAtomicUpdates.java:193)
	at sun.reflect.NativeMethodAccessorImpl.invoke0(Native Method)
	at sun.reflect.NativeMethodAccessorImpl.invoke(NativeMethodAccessorImpl.java:62)
	at sun.reflect.DelegatingMethodAccessorImpl.invoke(DelegatingMethodAccessorImpl.java:43)
	at java.lang.reflect.Method.invoke(Method.java:498)
	at com.carrotsearch.randomizedtesting.RandomizedRunner.invoke(RandomizedRunner.java:1713)
	at com.carrotsearch.randomizedtesting.RandomizedRunner$8.evaluate(RandomizedRunner.java:907)
	at com.carrotsearch.randomizedtesting.RandomizedRunner$9.evaluate(RandomizedRunner.java:943)
	at com.carrotsearch.randomizedtesting.RandomizedRunner$10.evaluate(RandomizedRunner.java:957)
	at com.carrotsearch.randomizedtesting.rules.SystemPropertiesRestoreRule$1.evaluate(SystemPropertiesRestoreRule.java:57)
	at org.apache.lucene.util.TestRuleSetupTeardownChained$1.evaluate(TestRuleSetupTeardownChained.java:49)
	at org.apache.lucene.util.AbstractBeforeAfterRule$1.evaluate(AbstractBeforeAfterRule.java:45)
	at org.apache.lucene.util.TestRuleThreadAndTestName$1.evaluate(TestRuleThreadAndTestName.java:48)
	at org.apache.lucene.util.TestRuleIgnoreAfterMaxFailures$1.evaluate(TestRuleIgnoreAfterMaxFailures.java:64)
	at org.apache.lucene.util.TestRuleMarkFailure$1.evaluate(TestRuleMarkFailure.java:47)
	at com.carrotsearch.randomizedtesting.rules.StatementAdapter.evaluate(StatementAdapter.java:36)
	at com.carrotsearch.randomizedtesting.ThreadLeakControl$StatementRunner.run(ThreadLeakControl.java:368)
	at com.carrotsearch.randomizedtesting.ThreadLeakControl.forkTimeoutingTask(ThreadLeakControl.java:817)
	at com.carrotsearch.randomizedtesting.ThreadLeakControl$3.evaluate(ThreadLeakControl.java:468)
	at com.carrotsearch.randomizedtesting.RandomizedRunner.runSingleTest(RandomizedRunner.java:916)
	at com.carrotsearch.randomizedtesting.RandomizedRunner$5.evaluate(RandomizedRunner.java:802)
	at com.carrotsearch.randomizedtesting.RandomizedRunner$6.evaluate(RandomizedRunner.java:852)
	at com.carrotsearch.randomizedtesting.RandomizedRunner$7.evaluate(RandomizedRunner.java:863)
	at com.carrotsearch.randomizedtesting.rules.StatementAdapter.evaluate(StatementAdapter.java:36)
	at com.carrotsearch.randomizedtesting.rules.SystemPropertiesRestoreRule$1.evaluate(SystemPropertiesRestoreRule.java:57)
	at org.apache.lucene.util.AbstractBeforeAfterRule$1.evaluate(AbstractBeforeAfterRule.java:45)
	at com.carrotsearch.randomizedtesting.rules.StatementAdapter.evaluate(StatementAdapter.java:36)
	at org.apache.lucene.util.TestRuleStoreClassName$1.evaluate(TestRuleStoreClassName.java:41)
	at com.carrotsearch.randomizedtesting.rules.NoShadowingOrOverridesOnMethodsRule$1.evaluate(NoShadowingOrOverridesOnMethodsRule.java:40)
	at com.carrotsearch.randomizedtesting.rules.NoShadowingOrOverridesOnMethodsRule$1.evaluate(NoShadowingOrOverridesOnMethodsRule.java:40)
	at com.carrotsearch.randomizedtesting.rules.StatementAdapter.evaluate(StatementAdapter.java:36)
	at com.carrotsearch.randomizedtesting.rules.StatementAdapter.evaluate(StatementAdapter.java:36)
	at com.carrotsearch.randomizedtesting.rules.StatementAdapter.evaluate(StatementAdapter.java:36)
	at org.apache.lucene.util.TestRuleAssertionsRequired$1.evaluate(TestRuleAssertionsRequired.java:53)
	at org.apache.lucene.util.TestRuleMarkFailure$1.evaluate(TestRuleMarkFailure.java:47)
	at org.apache.lucene.util.TestRuleIgnoreAfterMaxFailures$1.evaluate(TestRuleIgnoreAfterMaxFailures.java:64)
	at org.apache.lucene.util.TestRuleIgnoreTestSuites$1.evaluate(TestRuleIgnoreTestSuites.java:54)
	at com.carrotsearch.randomizedtesting.rules.StatementAdapter.evaluate(StatementAdapter.java:36)
	at com.carrotsearch.randomizedtesting.ThreadLeakControl$StatementRunner.run(ThreadLeakControl.java:368)
	at java.lang.Thread.run(Thread.java:745)
Caused by: java.lang.RuntimeException: Error from server at http://127.0.0.1:38570/solr/test_col: Async exception during distributed update: Error from server at http://127.0.0.1:52802/solr/test_col_shard2_replica1: Server Error



request: http://127.0.0.1:52802/solr/test_col_shard2_replica1/update?update.distrib=TOLEADER&distrib.from=http%3A%2F%2F127.0.0.1%3A38570%2Fsolr%2Ftest_col_shard5_replica1%2F&wt=javabin&version=2
Remote error message: Failed synchronous update on shard StdNode: http://127.0.0.1:47127/solr/test_col_shard2_replica2/ update: org.apache.solr.client.solrj.request.UpdateRequest@7a816014
	at org.apache.solr.cloud.TestStressCloudBlindAtomicUpdates$Worker.run(TestStressCloudBlindAtomicUpdates.java:409)
	at java.util.concurrent.Executors$RunnableAdapter.call(Executors.java:511)
	at java.util.concurrent.FutureTask.run(FutureTask.java:266)
	at org.apache.solr.common.util.ExecutorUtil$MDCAwareThreadPoolExecutor.lambda$execute$0(ExecutorUtil.java:229)
	at java.util.concurrent.ThreadPoolExecutor.runWorker(ThreadPoolExecutor.java:1142)
	at java.util.concurrent.ThreadPoolExecutor$Worker.run(ThreadPoolExecutor.java:617)
	... 1 more
Caused by: org.apache.solr.client.solrj.impl.HttpSolrClient$RemoteSolrException: Error from server at http://127.0.0.1:38570/solr/test_col: Async exception during distributed update: Error from server at http://127.0.0.1:52802/solr/test_col_shard2_replica1: Server Error



request: http://127.0.0.1:52802/solr/test_col_shard2_replica1/update?update.distrib=TOLEADER&distrib.from=http%3A%2F%2F127.0.0.1%3A38570%2Fsolr%2Ftest_col_shard5_replica1%2F&wt=javabin&version=2
Remote error message: Failed synchronous update on shard StdNode: http://127.0.0.1:47127/solr/test_col_shard2_replica2/ update: org.apache.solr.client.solrj.request.UpdateRequest@7a816014
	at org.apache.solr.client.solrj.impl.HttpSolrClient.executeMethod(HttpSolrClient.java:610)
	at org.apache.solr.client.solrj.impl.HttpSolrClient.request(HttpSolrClient.java:279)
	at org.apache.solr.client.solrj.impl.HttpSolrClient.request(HttpSolrClient.java:268)
	at org.apache.solr.client.solrj.SolrRequest.process(SolrRequest.java:160)
	at org.apache.solr.client.solrj.SolrRequest.process(SolrRequest.java:177)
	at org.apache.solr.cloud.TestStressCloudBlindAtomicUpdates$Worker.doRandomAtomicUpdate(TestStressCloudBlindAtomicUpdates.java:368)
	at org.apache.solr.cloud.TestStressCloudBlindAtomicUpdates$Worker.run(TestStressCloudBlindAtomicUpdates.java:397)
	... 6 more




Build Log:
[...truncated 11692 lines...]
   [junit4] Suite: org.apache.solr.cloud.TestStressCloudBlindAtomicUpdates
   [junit4]   2> Creating dataDir: /x1/jenkins/jenkins-slave/workspace/Lucene-Solr-NightlyTests-6.x/checkout/solr/build/solr-core/test/J0/temp/solr.cloud.TestStressCloudBlindAtomicUpdates_D8ECC85A49A09819-001/init-core-data-001
   [junit4]   2> 217533 WARN  (SUITE-TestStressCloudBlindAtomicUpdates-seed#[D8ECC85A49A09819]-worker) [    ] o.a.s.SolrTestCaseJ4 startTrackingSearchers: numOpens=149 numCloses=149
   [junit4]   2> 217533 INFO  (SUITE-TestStressCloudBlindAtomicUpdates-seed#[D8ECC85A49A09819]-worker) [    ] o.a.s.SolrTestCaseJ4 Using TrieFields
   [junit4]   2> 217535 INFO  (SUITE-TestStressCloudBlindAtomicUpdates-seed#[D8ECC85A49A09819]-worker) [    ] o.a.s.SolrTestCaseJ4 Randomized ssl (false) and clientAuth (false) via: @org.apache.solr.SolrTestCaseJ4$SuppressSSL(bugUrl=SSL overhead seems to cause OutOfMemory when stress testing)
   [junit4]   2> 217536 INFO  (SUITE-TestStressCloudBlindAtomicUpdates-seed#[D8ECC85A49A09819]-worker) [    ] o.a.s.c.MiniSolrCloudCluster Starting cluster of 10 servers in /x1/jenkins/jenkins-slave/workspace/Lucene-Solr-NightlyTests-6.x/checkout/solr/build/solr-core/test/J0/temp/solr.cloud.TestStressCloudBlindAtomicUpdates_D8ECC85A49A09819-001/tempDir-001
   [junit4]   2> 217536 INFO  (SUITE-TestStressCloudBlindAtomicUpdates-seed#[D8ECC85A49A09819]-worker) [    ] o.a.s.c.ZkTestServer STARTING ZK TEST SERVER
   [junit4]   2> 217536 INFO  (Thread-181) [    ] o.a.s.c.ZkTestServer client port:0.0.0.0/0.0.0.0:0
   [junit4]   2> 217536 INFO  (Thread-181) [    ] o.a.s.c.ZkTestServer Starting server
   [junit4]   2> 217636 INFO  (SUITE-TestStressCloudBlindAtomicUpdates-seed#[D8ECC85A49A09819]-worker) [    ] o.a.s.c.ZkTestServer start zk server on port:41231
   [junit4]   2> 217665 INFO  (jetty-launcher-131-thread-1) [    ] o.e.j.s.Server jetty-9.3.14.v20161028
   [junit4]   2> 217666 INFO  (jetty-launcher-131-thread-2) [    ] o.e.j.s.Server jetty-9.3.14.v20161028
   [junit4]   2> 217668 INFO  (jetty-launcher-131-thread-3) [    ] o.e.j.s.Server jetty-9.3.14.v20161028
   [junit4]   2> 217670 INFO  (jetty-launcher-131-thread-4) [    ] o.e.j.s.Server jetty-9.3.14.v20161028
   [junit4]   2> 217671 INFO  (jetty-launcher-131-thread-5) [    ] o.e.j.s.Server jetty-9.3.14.v20161028
   [junit4]   2> 217674 INFO  (jetty-launcher-131-thread-6) [    ] o.e.j.s.Server jetty-9.3.14.v20161028
   [junit4]   2> 217691 INFO  (jetty-launcher-131-thread-8) [    ] o.e.j.s.Server jetty-9.3.14.v20161028
   [junit4]   2> 217698 INFO  (jetty-launcher-131-thread-9) [    ] o.e.j.s.Server jetty-9.3.14.v20161028
   [junit4]   2> 217741 INFO  (jetty-launcher-131-thread-7) [    ] o.e.j.s.Server jetty-9.3.14.v20161028
   [junit4]   2> 217868 INFO  (jetty-launcher-131-thread-5) [    ] o.e.j.s.h.ContextHandler Started o.e.j.s.ServletContextHandler@4823fe41{/solr,null,AVAILABLE}
   [junit4]   2> 217869 INFO  (jetty-launcher-131-thread-5) [    ] o.e.j.s.AbstractConnector Started ServerConnector@787f56a8{HTTP/1.1,[http/1.1]}{127.0.0.1:52915}
   [junit4]   2> 217869 INFO  (jetty-launcher-131-thread-5) [    ] o.e.j.s.Server Started @225464ms
   [junit4]   2> 217869 INFO  (jetty-launcher-131-thread-5) [    ] o.a.s.c.s.e.JettySolrRunner Jetty properties: {hostContext=/solr, hostPort=52915}
   [junit4]   2> 217869 ERROR (jetty-launcher-131-thread-5) [    ] o.a.s.s.StartupLoggingUtils Missing Java Option solr.log.dir. Logging may be missing or incomplete.
   [junit4]   2> 217869 INFO  (jetty-launcher-131-thread-5) [    ] o.a.s.s.SolrDispatchFilter  ___      _       Welcome to Apache Solr? version 6.6.0
   [junit4]   2> 217869 INFO  (jetty-launcher-131-thread-5) [    ] o.a.s.s.SolrDispatchFilter / __| ___| |_ _   Starting in cloud mode on port null
   [junit4]   2> 217869 INFO  (jetty-launcher-131-thread-5) [    ] o.a.s.s.SolrDispatchFilter \__ \/ _ \ | '_|  Install dir: null
   [junit4]   2> 217869 INFO  (jetty-launcher-131-thread-5) [    ] o.a.s.s.SolrDispatchFilter |___/\___/_|_|    Start time: 2017-04-20T09:34:54.517Z
   [junit4]   2> 217986 INFO  (jetty-launcher-131-thread-10) [    ] o.e.j.s.Server jetty-9.3.14.v20161028
   [junit4]   2> 217988 INFO  (jetty-launcher-131-thread-9) [    ] o.e.j.s.h.ContextHandler Started o.e.j.s.ServletContextHandler@5cfbbd52{/solr,null,AVAILABLE}
   [junit4]   2> 218140 INFO  (jetty-launcher-131-thread-9) [    ] o.e.j.s.AbstractConnector Started ServerConnector@72c4dca8{HTTP/1.1,[http/1.1]}{127.0.0.1:33833}
   [junit4]   2> 218141 INFO  (jetty-launcher-131-thread-9) [    ] o.e.j.s.Server Started @225737ms
   [junit4]   2> 218141 INFO  (jetty-launcher-131-thread-9) [    ] o.a.s.c.s.e.JettySolrRunner Jetty properties: {hostContext=/solr, hostPort=33833}
   [junit4]   2> 218142 ERROR (jetty-launcher-131-thread-9) [    ] o.a.s.s.StartupLoggingUtils Missing Java Option solr.log.dir. Logging may be missing or incomplete.
   [junit4]   2> 218142 INFO  (jetty-launcher-131-thread-9) [    ] o.a.s.s.SolrDispatchFilter  ___      _       Welcome to Apache Solr? version 6.6.0
   [junit4]   2> 218142 INFO  (jetty-launcher-131-thread-9) [    ] o.a.s.s.SolrDispatchFilter / __| ___| |_ _   Starting in cloud mode on port null
   [junit4]   2> 218142 INFO  (jetty-launcher-131-thread-9) [    ] o.a.s.s.SolrDispatchFilter \__ \/ _ \ | '_|  Install dir: null
   [junit4]   2> 218142 INFO  (jetty-launcher-131-thread-9) [    ] o.a.s.s.SolrDispatchFilter |___/\___/_|_|    Start time: 2017-04-20T09:34:54.790Z
   [junit4]   2> 218146 INFO  (jetty-launcher-131-thread-8) [    ] o.e.j.s.h.ContextHandler Started o.e.j.s.ServletContextHandler@13ce8906{/solr,null,AVAILABLE}
   [junit4]   2> 218150 INFO  (jetty-launcher-131-thread-5) [    ] o.a.s.s.SolrDispatchFilter solr.xml found in ZooKeeper. Loading...
   [junit4]   2> 218151 INFO  (jetty-launcher-131-thread-4) [    ] o.e.j.s.h.ContextHandler Started o.e.j.s.ServletContextHandler@51644e03{/solr,null,AVAILABLE}
   [junit4]   2> 218151 INFO  (jetty-launcher-131-thread-4) [    ] o.e.j.s.AbstractConnector Started ServerConnector@2f604bf0{HTTP/1.1,[http/1.1]}{127.0.0.1:56745}
   [junit4]   2> 218151 INFO  (jetty-launcher-131-thread-4) [    ] o.e.j.s.Server Started @225747ms
   [junit4]   2> 218151 INFO  (jetty-launcher-131-thread-4) [    ] o.a.s.c.s.e.JettySolrRunner Jetty properties: {hostContext=/solr, hostPort=56745}
   [junit4]   2> 218152 ERROR (jetty-launcher-131-thread-4) [    ] o.a.s.s.StartupLoggingUtils Missing Java Option solr.log.dir. Logging may be missing or incomplete.
   [junit4]   2> 218152 INFO  (jetty-launcher-131-thread-4) [    ] o.a.s.s.SolrDispatchFilter  ___      _       Welcome to Apache Solr? version 6.6.0
   [junit4]   2> 218152 INFO  (jetty-launcher-131-thread-4) [    ] o.a.s.s.SolrDispatchFilter / __| ___| |_ _   Starting in cloud mode on port null
   [junit4]   2> 218152 INFO  (jetty-launcher-131-thread-4) [    ] o.a.s.s.SolrDispatchFilter \__ \/ _ \ | '_|  Install dir: null
   [junit4]   2> 218152 INFO  (jetty-launcher-131-thread-4) [    ] o.a.s.s.SolrDispatchFilter |___/\___/_|_|    Start time: 2017-04-20T09:34:54.800Z
   [junit4]   2> 218155 INFO  (jetty-launcher-131-thread-3) [    ] o.e.j.s.h.ContextHandler Started o.e.j.s.ServletContextHandler@4cae4dcd{/solr,null,AVAILABLE}
   [junit4]   2> 218155 INFO  (jetty-launcher-131-thread-2) [    ] o.e.j.s.h.ContextHandler Started o.e.j.s.ServletContextHandler@42ed7c6c{/solr,null,AVAILABLE}
   [junit4]   2> 218156 INFO  (jetty-launcher-131-thread-3) [    ] o.e.j.s.AbstractConnector Started ServerConnector@11f1109b{HTTP/1.1,[http/1.1]}{127.0.0.1:48460}
   [junit4]   2> 218156 INFO  (jetty-launcher-131-thread-3) [    ] o.e.j.s.Server Started @225751ms
   [junit4]   2> 218156 INFO  (jetty-launcher-131-thread-3) [    ] o.a.s.c.s.e.JettySolrRunner Jetty properties: {hostContext=/solr, hostPort=48460}
   [junit4]   2> 218156 INFO  (jetty-launcher-131-thread-2) [    ] o.e.j.s.AbstractConnector Started ServerConnector@1eede3a0{HTTP/1.1,[http/1.1]}{127.0.0.1:52051}
   [junit4]   2> 218156 INFO  (jetty-launcher-131-thread-2) [    ] o.e.j.s.Server Started @225751ms
   [junit4]   2> 218156 INFO  (jetty-launcher-131-thread-2) [    ] o.a.s.c.s.e.JettySolrRunner Jetty properties: {hostContext=/solr, hostPort=52051}
   [junit4]   2> 218156 ERROR (jetty-launcher-131-thread-3) [    ] o.a.s.s.StartupLoggingUtils Missing Java Option solr.log.dir. Logging may be missing or incomplete.
   [junit4]   2> 218156 INFO  (jetty-launcher-131-thread-3) [    ] o.a.s.s.SolrDispatchFilter  ___      _       Welcome to Apache Solr? version 6.6.0
   [junit4]   2> 218156 ERROR (jetty-launcher-131-thread-2) [    ] o.a.s.s.StartupLoggingUtils Missing Java Option solr.log.dir. Logging may be missing or incomplete.
   [junit4]   2> 218156 INFO  (jetty-launcher-131-thread-3) [    ] o.a.s.s.SolrDispatchFilter / __| ___| |_ _   Starting in cloud mode on port null
   [junit4]   2> 218156 INFO  (jetty-launcher-131-thread-3) [    ] o.a.s.s.SolrDispatchFilter \__ \/ _ \ | '_|  Install dir: null
   [junit4]   2> 218156 INFO  (jetty-launcher-131-thread-2) [    ] o.a.s.s.SolrDispatchFilter  ___      _       Welcome to Apache Solr? version 6.6.0
   [junit4]   2> 218156 INFO  (jetty-launcher-131-thread-3) [    ] o.a.s.s.SolrDispatchFilter |___/\___/_|_|    Start time: 2017-04-20T09:34:54.804Z
   [junit4]   2> 218156 INFO  (jetty-launcher-131-thread-2) [    ] o.a.s.s.SolrDispatchFilter / __| ___| |_ _   Starting in cloud mode on port null
   [junit4]   2> 218157 INFO  (jetty-launcher-131-thread-2) [    ] o.a.s.s.SolrDispatchFilter \__ \/ _ \ | '_|  Install dir: null
   [junit4]   2> 218157 INFO  (jetty-launcher-131-thread-2) [    ] o.a.s.s.SolrDispatchFilter |___/\___/_|_|    Start time: 2017-04-20T09:34:54.805Z
   [junit4]   2> 218159 INFO  (jetty-launcher-131-thread-1) [    ] o.e.j.s.h.ContextHandler Started o.e.j.s.ServletContextHandler@20368db4{/solr,null,AVAILABLE}
   [junit4]   2> 218160 INFO  (jetty-launcher-131-thread-1) [    ] o.e.j.s.AbstractConnector Started ServerConnector@7e394609{HTTP/1.1,[http/1.1]}{127.0.0.1:45586}
   [junit4]   2> 218160 INFO  (jetty-launcher-131-thread-1) [    ] o.e.j.s.Server Started @225755ms
   [junit4]   2> 218160 INFO  (jetty-launcher-131-thread-1) [    ] o.a.s.c.s.e.JettySolrRunner Jetty properties: {hostContext=/solr, hostPort=45586}
   [junit4]   2> 218160 ERROR (jetty-launcher-131-thread-1) [    ] o.a.s.s.StartupLoggingUtils Missing Java Option solr.log.dir. Logging may be missing or incomplete.
   [junit4]   2> 218160 INFO  (jetty-launcher-131-thread-1) [    ] o.a.s.s.SolrDispatchFilter  ___      _       Welcome to Apache Solr? version 6.6.0
   [junit4]   2> 218160 INFO  (jetty-launcher-131-thread-1) [    ] o.a.s.s.SolrDispatchFilter / __| ___| |_ _   Starting in cloud mode on port null
   [junit4]   2> 218160 INFO  (jetty-launcher-131-thread-1) [    ] o.a.s.s.SolrDispatchFilter \__ \/ _ \ | '_|  Install dir: null
   [junit4]   2> 218160 INFO  (jetty-launcher-131-thread-1) [    ] o.a.s.s.SolrDispatchFilter |___/\___/_|_|    Start time: 2017-04-20T09:34:54.808Z
   [junit4]   2> 218166 INFO  (jetty-launcher-131-thread-7) [    ] o.e.j.s.h.ContextHandler Started o.e.j.s.ServletContextHandler@3adc36{/solr,null,AVAILABLE}
   [junit4]   2> 218167 INFO  (jetty-launcher-131-thread-7) [    ] o.e.j.s.AbstractConnector Started ServerConnector@791fcc04{HTTP/1.1,[http/1.1]}{127.0.0.1:38570}
   [junit4]   2> 218167 INFO  (jetty-launcher-131-thread-7) [    ] o.e.j.s.Server Started @225762ms
   [junit4]   2> 218167 INFO  (jetty-launcher-131-thread-7) [    ] o.a.s.c.s.e.JettySolrRunner Jetty properties: {hostContext=/solr, hostPort=38570}
   [junit4]   2> 218167 ERROR (jetty-launcher-131-thread-7) [    ] o.a.s.s.StartupLoggingUtils Missing Java Option solr.log.dir. Logging may be missing or incomplete.
   [junit4]   2> 218167 INFO  (jetty-launcher-131-thread-7) [    ] o.a.s.s.SolrDispatchFilter  ___      _       Welcome to Apache Solr? version 6.6.0
   [junit4]   2> 218167 INFO  (jetty-launcher-131-thread-7) [    ] o.a.s.s.SolrDispatchFilter / __| ___| |_ _   Starting in cloud mode on port null
   [junit4]   2> 218167 INFO  (jetty-launcher-131-thread-7) [    ] o.a.s.s.SolrDispatchFilter \__ \/ _ \ | '_|  Install dir: null
   [junit4]   2> 218167 INFO  (jetty-launcher-131-thread-7) [    ] o.a.s.s.SolrDispatchFilter |___/\___/_|_|    Start time: 2017-04-20T09:34:54.815Z
   [junit4]   2> 218168 INFO  (jetty-launcher-131-thread-8) [    ] o.e.j.s.AbstractConnector Started ServerConnector@23d58ac3{HTTP/1.1,[http/1.1]}{127.0.0.1:52802}
   [junit4]   2> 218168 INFO  (jetty-launcher-131-thread-6) [    ] o.e.j.s.h.ContextHandler Started o.e.j.s.ServletContextHandler@648e60d4{/solr,null,AVAILABLE}
   [junit4]   2> 218168 INFO  (jetty-launcher-131-thread-8) [    ] o.e.j.s.Server Started @225764ms
   [junit4]   2> 218168 INFO  (jetty-launcher-131-thread-8) [    ] o.a.s.c.s.e.JettySolrRunner Jetty properties: {hostContext=/solr, hostPort=52802}
   [junit4]   2> 218169 ERROR (jetty-launcher-131-thread-8) [    ] o.a.s.s.StartupLoggingUtils Missing Java Option solr.log.dir. Logging may be missing or incomplete.
   [junit4]   2> 218169 INFO  (jetty-launcher-131-thread-6) [    ] o.e.j.s.AbstractConnector Started ServerConnector@68806224{HTTP/1.1,[http/1.1]}{127.0.0.1:47514}
   [junit4]   2> 218169 INFO  (jetty-launcher-131-thread-8) [    ] o.a.s.s.SolrDispatchFilter  ___      _       Welcome to Apache Solr? version 6.6.0
   [junit4]   2> 218169 INFO  (jetty-launcher-131-thread-6) [    ] o.e.j.s.Server Started @225764ms
   [junit4]   2> 218169 INFO  (jetty-launcher-131-thread-8) [    ] o.a.s.s.SolrDispatchFilter / __| ___| |_ _   Starting in cloud mode on port null
   [junit4]   2> 218169 INFO  (jetty-launcher-131-thread-6) [    ] o.a.s.c.s.e.JettySolrRunner Jetty properties: {hostContext=/solr, hostPort=47514}
   [junit4]   2> 218169 ERROR (jetty-launcher-131-thread-6) [    ] o.a.s.s.StartupLoggingUtils Missing Java Option solr.log.dir. Logging may be missing or incomplete.
   [junit4]   2> 218169 INFO  (jetty-launcher-131-thread-6) [    ] o.a.s.s.SolrDispatchFilter  ___      _       Welcome to Apache Solr? version 6.6.0
   [junit4]   2> 218169 INFO  (jetty-launcher-131-thread-6) [    ] o.a.s.s.SolrDispatchFilter / __| ___| |_ _   Starting in cloud mode on port null
   [junit4]   2> 218169 INFO  (jetty-launcher-131-thread-6) [    ] o.a.s.s.SolrDispatchFilter \__ \/ _ \ | '_|  Install dir: null
   [junit4]   2> 218169 INFO  (jetty-launcher-131-thread-6) [    ] o.a.s.s.SolrDispatchFilter |___/\___/_|_|    Start time: 2017-04-20T09:34:54.817Z
   [junit4]   2> 218169 INFO  (jetty-launcher-131-thread-8) [    ] o.a.s.s.SolrDispatchFilter \__ \/ _ \ | '_|  Install dir: null
   [junit4]   2> 218170 INFO  (jetty-launcher-131-thread-8) [    ] o.a.s.s.SolrDispatchFilter |___/\___/_|_|    Start time: 2017-04-20T09:34:54.818Z
   [junit4]   2> 218199 INFO  (jetty-launcher-131-thread-10) [    ] o.e.j.s.h.ContextHandler Started o.e.j.s.ServletContextHandler@1ccceaf3{/solr,null,AVAILABLE}
   [junit4]   2> 218200 INFO  (jetty-launcher-131-thread-10) [    ] o.e.j.s.AbstractConnector Started ServerConnector@4968008e{HTTP/1.1,[http/1.1]}{127.0.0.1:47127}
   [junit4]   2> 218200 INFO  (jetty-launcher-131-thread-10) [    ] o.e.j.s.Server Started @225795ms
   [junit4]   2> 218200 INFO  (jetty-launcher-131-thread-10) [    ] o.a.s.c.s.e.JettySolrRunner Jetty properties: {hostContext=/solr, hostPort=47127}
   [junit4]   2> 218200 ERROR (jetty-launcher-131-thread-10) [    ] o.a.s.s.StartupLoggingUtils Missing Java Option solr.log.dir. Logging may be missing or incomplete.
   [junit4]   2> 218200 INFO  (jetty-launcher-131-thread-10) [    ] o.a.s.s.SolrDispatchFilter  ___      _       Welcome to Apache Solr? version 6.6.0
   [junit4]   2> 218200 INFO  (jetty-launcher-131-thread-10) [    ] o.a.s.s.SolrDispatchFilter / __| ___| |_ _   Starting in cloud mode on port null
   [junit4]   2> 218200 INFO  (jetty-launcher-131-thread-10) [    ] o.a.s.s.SolrDispatchFilter \__ \/ _ \ | '_|  Install dir: null
   [junit4]   2> 218200 INFO  (jetty-launcher-131-thread-10) [    ] o.a.s.s.SolrDispatchFilter |___/\___/_|_|    Start time: 2017-04-20T09:34:54.848Z
   [junit4]   2> 218204 INFO  (jetty-launcher-131-thread-5) [    ] o.a.s.u.UpdateShardHandler Creating UpdateShardHandler HTTP client with params: socketTimeout=340000&connTimeout=45000&retry=true
   [junit4]   2> 218206 INFO  (jetty-launcher-131-thread-2) [    ] o.a.s.s.SolrDispatchFilter solr.xml found in ZooKeeper. Loading...
   [junit4]   2> 218207 INFO  (jetty-launcher-131-thread-4) [    ] o.a.s.s.SolrDispatchFilter solr.xml found in ZooKeeper. Loading...
   [junit4]   2> 218220 INFO  (jetty-launcher-131-thread-5) [    ] o.a.s.c.ZkContainer Zookeeper client=127.0.0.1:41231/solr
   [junit4]   2> 218226 INFO  (jetty-launcher-131-thread-9) [    ] o.a.s.s.SolrDispatchFilter solr.xml found in ZooKeeper. Loading...
   [junit4]   2> 218226 INFO  (jetty-launcher-131-thread-3) [    ] o.a.s.s.SolrDispatchFilter solr.xml found in ZooKeeper. Loading...
   [junit4]   2> 218243 INFO  (jetty-launcher-131-thread-6) [    ] o.a.s.s.SolrDispatchFilter solr.xml found in ZooKeeper. Loading...
   [junit4]   2> 218250 INFO  (jetty-launcher-131-thread-2) [    ] o.a.s.u.UpdateShardHandler Creating UpdateShardHandler HTTP client with params: socketTimeout=340000&connTimeout=45000&retry=true
   [junit4]   2> 218251 INFO  (jetty-launcher-131-thread-2) [    ] o.a.s.c.ZkContainer Zookeeper client=127.0.0.1:41231/solr
   [junit4]   2> 218260 INFO  (jetty-launcher-131-thread-8) [    ] o.a.s.s.SolrDispatchFilter solr.xml found in ZooKeeper. Loading...
   [junit4]   2> 218264 INFO  (jetty-launcher-131-thread-4) [    ] o.a.s.u.UpdateShardHandler Creating UpdateShardHandler HTTP client with params: socketTimeout=340000&connTimeout=45000&retry=true
   [junit4]   2> 218263 INFO  (jetty-launcher-131-thread-1) [    ] o.a.s.s.SolrDispatchFilter solr.xml found in ZooKeeper. Loading...
   [junit4]   2> 218273 INFO  (jetty-launcher-131-thread-4) [    ] o.a.s.c.ZkContainer Zookeeper client=127.0.0.1:41231/solr
   [junit4]   2> 218261 INFO  (jetty-launcher-131-thread-7) [    ] o.a.s.s.SolrDispatchFilter solr.xml found in ZooKeeper. Loading...
   [junit4]   2> 218287 WARN  (NIOServerCxn.Factory:0.0.0.0/0.0.0.0:0) [    ] o.a.z.s.NIOServerCnxn caught end of stream exception
   [junit4]   2> EndOfStreamException: Unable to read additional data from client sessionid 0x15b8ab6e6e90005, likely client has closed socket
   [junit4]   2> 	at org.apache.zookeeper.server.NIOServerCnxn.doIO(NIOServerCnxn.java:228)
   [junit4]   2> 	at org.apache.zookeeper.server.NIOServerCnxnFactory.run(NIOServerCnxnFactory.java:208)
   [junit4]   2> 	at java.lang.Thread.run(Thread.java:745)
   [junit4]   2> 218294 INFO  (jetty-launcher-131-thread-6) [    ] o.a.s.u.UpdateShardHandler Creating UpdateShardHandler HTTP client with params: socketTimeout=340000&connTimeout=45000&retry=true
   [junit4]   2> 218295 INFO  (jetty-launcher-131-thread-6) [    ] o.a.s.c.ZkContainer Zookeeper client=127.0.0.1:41231/solr
   [junit4]   2> 218303 INFO  (jetty-launcher-131-thread-3) [    ] o.a.s.u.UpdateShardHandler Creating UpdateShardHandler HTTP client with params: socketTimeout=340000&connTimeout=45000&retry=true
   [junit4]   2> 218311 INFO  (jetty-launcher-131-thread-8) [    ] o.a.s.u.UpdateShardHandler Creating UpdateShardHandler HTTP client with params: socketTimeout=340000&connTimeout=45000&retry=true
   [junit4]   2> 218315 INFO  (jetty-launcher-131-thread-10) [    ] o.a.s.s.SolrDispatchFilter solr.xml found in ZooKeeper. Loading...
   [junit4]   2> 218320 WARN  (NIOServerCxn.Factory:0.0.0.0/0.0.0.0:0) [    ] o.a.z.s.NIOServerCnxn caught end of stream exception
   [junit4]   2> EndOfStreamException: Unable to read additional data from client sessionid 0x15b8ab6e6e9000e, likely client has closed socket
   [junit4]   2> 	at org.apache.zookeeper.server.NIOServerCnxn.doIO(NIOServerCnxn.java:228)
   [junit4]   2> 	at org.apache.zookeeper.server.NIOServerCnxnFactory.run(NIOServerCnxnFactory.java:208)
   [junit4]   2> 	at java.lang.Thread.run(Thread.java:745)
   [junit4]   2> 218320 WARN  (NIOServerCxn.Factory:0.0.0.0/0.0.0.0:0) [    ] o.a.z.s.NIOServerCnxn caught end of stream exception
   [junit4]   2> EndOfStreamException: Unable to read additional data from client sessionid 0x15b8ab6e6e9000b, likely client has closed socket
   [junit4]   2> 	at org.apache.zookeeper.server.NIOServerCnxn.doIO(NIOServerCnxn.java:228)
   [junit4]   2> 	at org.apache.zookeeper.server.NIOServerCnxnFactory.run(NIOServerCnxnFactory.java:208)
   [junit4]   2> 	at java.lang.Thread.run(Thread.java:745)
   [junit4]   2> 218322 INFO  (jetty-launcher-131-thread-7) [    ] o.a.s.u.UpdateShardHandler Creating UpdateShardHandler HTTP client with params: socketTimeout=340000&connTimeout=45000&retry=true
   [junit4]   2> 218327 INFO  (jetty-launcher-131-thread-7) [    ] o.a.s.c.ZkContainer Zookeeper client=127.0.0.1:41231/solr
   [junit4]   2> 218329 INFO  (jetty-launcher-131-thread-1) [    ] o.a.s.u.UpdateShardHandler Creating UpdateShardHandler HTTP client with params: socketTimeout=340000&connTimeout=45000&retry=true
   [junit4]   2> 218334 INFO  (jetty-launcher-131-thread-8) [    ] o.a.s.c.ZkContainer Zookeeper client=127.0.0.1:41231/solr
   [junit4]   2> 218336 INFO  (jetty-launcher-131-thread-3) [    ] o.a.s.c.ZkContainer Zookeeper client=127.0.0.1:41231/solr
   [junit4]   2> 218345 INFO  (jetty-launcher-131-thread-9) [    ] o.a.s.u.UpdateShardHandler Creating UpdateShardHandler HTTP client with params: socketTimeout=340000&connTimeout=45000&retry=true
   [junit4]   2> 218348 INFO  (jetty-launcher-131-thread-1) [    ] o.a.s.c.ZkContainer Zookeeper client=127.0.0.1:41231/solr
   [junit4]   2> 218350 INFO  (jetty-launcher-131-thread-9) [    ] o.a.s.c.ZkContainer Zookeeper client=127.0.0.1:41231/solr
   [junit4]   2> 218352 INFO  (jetty-launcher-131-thread-10) [    ] o.a.s.u.UpdateShardHandler Creating UpdateShardHandler HTTP client with params: socketTimeout=340000&connTimeout=45000&retry=true
   [junit4]   2> 218359 WARN  (NIOServerCxn.Factory:0.0.0.0/0.0.0.0:0) [    ] o.a.z.s.NIOServerCnxn caught end of stream exception
   [junit4]   2> EndOfStreamException: Unable to read additional data from client sessionid 0x15b8ab6e6e9000f, likely client has closed socket
   [junit4]   2> 	at org.apache.zookeeper.server.NIOServerCnxn.doIO(NIOServerCnxn.java:228)
   [junit4]   2> 	at org.apache.zookeeper.server.NIOServerCnxnFactory.run(NIOServerCnxnFactory.java:208)
   [junit4]   2> 	at java.lang.Thread.run(Thread.java:745)
   [junit4]   2> 218381 INFO  (jetty-launcher-131-thread-10) [    ] o.a.s.c.ZkContainer Zookeeper client=127.0.0.1:41231/solr
   [junit4]   2> 218389 WARN  (NIOServerCxn.Factory:0.0.0.0/0.0.0.0:0) [    ] o.a.z.s.NIOServerCnxn caught end of stream exception
   [junit4]   2> EndOfStreamException: Unable to read additional data from client sessionid 0x15b8ab6e6e90012, likely client has closed socket
   [junit4]   2> 	at org.apache.zookeeper.server.NIOServerCnxn.doIO(NIOServerCnxn.java:228)
   [junit4]   2> 	at org.apache.zookeeper.server.NIOServerCnxnFactory.run(NIOServerCnxnFactory.java:208)
   [junit4]   2> 	at java.lang.Thread.run(Thread.java:745)
   [junit4]   2> 218395 WARN  (NIOServerCxn.Factory:0.0.0.0/0.0.0.0:0) [    ] o.a.z.s.NIOServerCnxn caught end of stream exception
   [junit4]   2> EndOfStreamException: Unable to read additional data from client sessionid 0x15b8ab6e6e90014, likely client has closed socket
   [junit4]   2> 	at org.apache.zookeeper.server.NIOServerCnxn.doIO(NIOServerCnxn.java:228)
   [junit4]   2> 	at org.apache.zookeeper.server.NIOServerCnxnFactory.run(NIOServerCnxnFactory.java:208)
   [junit4]   2> 	at java.lang.Thread.run(Thread.java:745)
   [junit4]   2> 218395 WARN  (NIOServerCxn.Factory:0.0.0.0/0.0.0.0:0) [    ] o.a.z.s.NIOServerCnxn caught end of stream exception
   [junit4]   2> EndOfStreamException: Unable to read additional data from client sessionid 0x15b8ab6e6e90010, likely client has closed socket
   [junit4]   2> 	at org.apache.zookeeper.server.NIOServerCnxn.doIO(NIOServerCnxn.java:228)
   [junit4]   2> 	at org.apache.zookeeper.server.NIOServerCnxnFactory.run(NIOServerCnxnFactory.java:208)
   [junit4]   2> 	at java.lang.Thread.run(Thread.java:745)
   [junit4]   2> 218424 WARN  (NIOServerCxn.Factory:0.0.0.0/0.0.0.0:0) [    ] o.a.z.s.NIOServerCnxn caught end of stream exception
   [junit4]   2> EndOfStreamException: Unable to read additional data from client sessionid 0x15b8ab6e6e90015, likely client has closed socket
   [junit4]   2> 	at org.apache.zookeeper.server.NIOServerCnxn.doIO(NIOServerCnxn.java:228)
   [junit4]   2> 	at org.apache.zookeeper.server.NIOServerCnxnFactory.run(NIOServerCnxnFactory.java:208)
   [junit4]   2> 	at java.lang.Thread.run(Thread.java:745)
   [junit4]   2> 218425 WARN  (NIOServerCxn.Factory:0.0.0.0/0.0.0.0:0) [    ] o.a.z.s.NIOServerCnxn caught end of stream exception
   [junit4]   2> EndOfStreamException: Unable to read additional data from client sessionid 0x15b8ab6e6e90018, likely client has closed socket
   [junit4]   2> 	at org.apache.zookeeper.server.NIOServerCnxn.doIO(NIOServerCnxn.java:228)
   [junit4]   2> 	at org.apache.zookeeper.server.NIOServerCnxnFactory.run(NIOServerCnxnFactory.java:208)
   [junit4]   2> 	at java.lang.Thread.run(Thread.java:745)
   [junit4]   2> 218498 INFO  (jetty-launcher-131-thread-4) [n:127.0.0.1:56745_solr    ] o.a.s.c.Overseer Overseer (id=null) closing
   [junit4]   2> 218499 INFO  (jetty-launcher-131-thread-2) [n:127.0.0.1:52051_solr    ] o.a.s.c.Overseer Overseer (id=null) closing
   [junit4]   2> 218499 INFO  (jetty-launcher-131-thread-8) [n:127.0.0.1:52802_solr    ] o.a.s.c.Overseer Overseer (id=null) closing
   [junit4]   2> 218500 INFO  (jetty-launcher-131-thread-5) [n:127.0.0.1:52915_solr    ] o.a.s.c.Overseer Overseer (id=null) closing
   [junit4]   2> 218502 INFO  (jetty-launcher-131-thread-7) [n:127.0.0.1:38570_solr    ] o.a.s.c.Overseer Overseer (id=null) closing
   [junit4]   2> 218502 INFO  (jetty-launcher-131-thread-4) [n:127.0.0.1:56745_solr    ] o.a.s.c.OverseerElectionContext I am going to be the leader 127.0.0.1:56745_solr
   [junit4]   2> 218507 INFO  (jetty-launcher-131-thread-6) [n:127.0.0.1:47514_solr    ] o.a.s.c.Overseer Overseer (id=null) closing
   [junit4]   2> 218516 INFO  (jetty-launcher-131-thread-5) [n:127.0.0.1:52915_solr    ] o.a.s.c.ZkController Register node as live in ZooKeeper:/live_nodes/127.0.0.1:52915_solr
   [junit4]   2> 218516 INFO  (jetty-launcher-131-thread-9) [n:127.0.0.1:33833_solr    ] o.a.s.c.Overseer Overseer (id=null) closing
   [junit4]   2> 218516 INFO  (jetty-launcher-131-thread-2) [n:127.0.0.1:52051_solr    ] o.a.s.c.ZkController Register node as live in ZooKeeper:/live_nodes/127.0.0.1:52051_solr
   [junit4]   2> 218518 INFO  (jetty-launcher-131-thread-8) [n:127.0.0.1:52802_solr    ] o.a.s.c.ZkController Register node as live in ZooKeeper:/live_nodes/127.0.0.1:52802_solr
   [junit4]   2> 218521 INFO  (jetty-launcher-131-thread-10) [n:127.0.0.1:47127_solr    ] o.a.s.c.Overseer Overseer (id=null) closing
   [junit4]   2> 218526 INFO  (jetty-launcher-131-thread-6) [n:127.0.0.1:47514_solr    ] o.a.s.c.ZkController Register node as live in ZooKeeper:/live_nodes/127.0.0.1:47514_solr
   [junit4]   2> 218526 INFO  (jetty-launcher-131-thread-7) [n:127.0.0.1:38570_solr    ] o.a.s.c.ZkController Register node as live in ZooKeeper:/live_nodes/127.0.0.1:38570_solr
   [junit4]   2> 218526 INFO  (jetty-launcher-131-thread-4) [n:127.0.0.1:56745_solr    ] o.a.s.c.Overseer Overseer (id=97824335081308177-127.0.0.1:56745_solr-n_0000000000) starting
   [junit4]   2> 218542 INFO  (jetty-launcher-131-thread-1) [n:127.0.0.1:45586_solr    ] o.a.s.c.Overseer Overseer (id=null) closing
   [junit4]   2> 218547 INFO  (zkCallback-175-thread-1-processing-n:127.0.0.1:47514_solr) [n:127.0.0.1:47514_solr    ] o.a.s.c.c.ZkStateReader Updated live nodes from ZooKeeper... (0) -> (2)
   [junit4]   2> 218548 INFO  (zkCallback-178-thread-1-processing-n:127.0.0.1:52802_solr) [n:127.0.0.1:52802_solr    ] o.a.s.c.c.ZkStateReader Updated live nodes from ZooKeeper... (0) -> (2)
   [junit4]   2> 218548 INFO  (zkCallback-151-thread-1-processing-n:127.0.0.1:52915_solr) [n:127.0.0.1:52915_solr    ] o.a.s.c.c.ZkStateReader Updated live nodes from ZooKeeper... (0) -> (2)
   [junit4]   2> 218549 INFO  (zkCallback-185-thread-1-processing-n:127.0.0.1:48460_solr) [n:127.0.0.1:48460_solr    ] o.a.s.c.c.ZkStateReader Updated live nodes from ZooKeeper... (0) -> (2)
   [junit4]   2> 218549 INFO  (zkCallback-186-thread-1-processing-n:127.0.0.1:47127_solr) [n:127.0.0.1:47127_solr    ] o.a.s.c.c.ZkStateReader Updated live nodes from ZooKeeper... (0) -> (2)
   [junit4]   2> 218550 INFO  (zkCallback-180-thread-1-processing-n:127.0.0.1:45586_solr) [n:127.0.0.1:45586_solr    ] o.a.s.c.c.ZkStateReader Updated live nodes from ZooKeeper... (0) -> (2)
   [junit4]   2> 218551 INFO  (zkCallback-184-thread-1-processing-n:127.0.0.1:33833_solr) [n:127.0.0.1:33833_solr    ] o.a.s.c.c.ZkStateReader Updated live nodes from ZooKeeper... (0) -> (2)
   [junit4]   2> 218551 INFO  (zkCallback-163-thread-1-processing-n:127.0.0.1:52051_solr) [n:127.0.0.1:52051_solr    ] o.a.s.c.c.ZkStateReader Updated live nodes from ZooKeeper... (0) -> (2)
   [junit4]   2> 218552 INFO  (zkCallback-179-thread-1-processing-n:127.0.0.1:38570_solr) [n:127.0.0.1:38570_solr    ] o.a.s.c.c.ZkStateReader Updated live nodes from ZooKeeper... (0) -> (2)
   [junit4]   2> 218553 INFO  (zkCallback-164-thread-1-processing-n:127.0.0.1:56745_solr) [n:127.0.0.1:56745_solr    ] o.a.s.c.c.ZkStateReader Updated live nodes from ZooKeeper... (0) -> (2)
   [junit4]   2> 218585 INFO  (zkCallback-185-thread-1-processing-n:127.0.0.1:48460_solr) [n:127.0.0.1:48460_solr    ] o.a.s.c.c.ZkStateReader Updated live nodes from ZooKeeper... (2) -> (4)
   [junit4]   2> 218585 INFO  (zkCallback-175-thread-1-processing-n:127.0.0.1:47514_solr) [n:127.0.0.1:47514_solr    ] o.a.s.c.c.ZkStateReader Updated live nodes from ZooKeeper... (2) -> (4)
   [junit4]   2> 218586 INFO  (zkCallback-180-thread-1-processing-n:127.0.0.1:45586_solr) [n:127.0.0.1:45586_solr    ] o.a.s.c.c.ZkStateReader Updated live nodes from ZooKeeper... (2) -> (4)
   [junit4]   2> 218586 INFO  (zkCallback-151-thread-1-processing-n:127.0.0.1:52915_solr) [n:127.0.0.1:52915_solr    ] o.a.s.c.c.ZkStateReader Updated live nodes from ZooKeeper... (2) -> (4)
   [junit4]   2> 218600 INFO  (zkCallback-164-thread-1-processing-n:127.0.0.1:56745_solr) [n:127.0.0.1:56745_solr    ] o.a.s.c.c.ZkStateReader Updated live nodes from ZooKeeper... (2) -> (4)
   [junit4]   2> 218600 INFO  (zkCallback-178-thread-1-processing-n:127.0.0.1:52802_solr) [n:127.0.0.1:52802_solr    ] o.a.s.c.c.ZkStateReader Updated live nodes from ZooKeeper... (2) -> (4)
   [junit4]   2> 218601 INFO  (zkCallback-184-thread-1-processing-n:127.0.0.1:33833_solr) [n:127.0.0.1:33833_solr    ] o.a.s.c.c.ZkStateReader Updated live nodes from ZooKeeper... (2) -> (4)
   [junit4]   2> 218601 INFO  (zkCallback-179-thread-1-processing-n:127.0.0.1:38570_solr) [n:127.0.0.1:38570_solr    ] o.a.s.c.c.ZkStateReader Updated live nodes from ZooKeeper... (2) -> (4)
   [junit4]   2> 218602 INFO  (zkCallback-186-thread-1-processing-n:127.0.0.1:47127_solr) [n:127.0.0.1:47127_solr    ] o.a.s.c.c.ZkStateReader Updated live nodes from ZooKeeper... (2) -> (4)
   [junit4]   2> 218602 INFO  (zkCallback-163-thread-1-processing-n:127.0.0.1:52051_solr) [n:127.0.0.1:52051_solr    ] o.a.s.c.c.ZkStateReader Updated live nodes from ZooKeeper... (2) -> (4)
   [junit4]   2> 218608 INFO  (jetty-launcher-131-thread-3) [n:127.0.0.1:48460_solr    ] o.a.s.c.Overseer Overseer (id=null) closing
   [junit4]   2> 218625 INFO  (zkCallback-175-thread-1-processing-n:127.0.0.1:47514_solr) [n:127.0.0.1:47514_solr    ] o.a.s.c.c.ZkStateReader Updated live nodes from ZooKeeper... (4) -> (5)
   [junit4]   2> 218625 INFO  (zkCallback-185-thread-1-processing-n:127.0.0.1:48460_solr) [n:127.0.0.1:48460_solr    ] o.a.s.c.c.ZkStateReader Updated live nodes from ZooKeeper... (4) -> (5)
   [junit4]   2> 218626 INFO  (zkCallback-178-thread-1-processing-n:127.0.0.1:52802_solr) [n:127.0.0.1:52802_solr    ] o.a.s.c.c.ZkStateReader Updated live nodes from ZooKeeper... (4) -> (5)
   [junit4]   2> 218631 INFO  (zkCallback-151-thread-1-processing-n:127.0.0.1:52915_solr) [n:127.0.0.1:52915_solr    ] o.a.s.c.c.ZkStateReader Updated live nodes from ZooKeeper... (4) -> (5)
   [junit4]   2> 218632 INFO  (zkCallback-186-thread-1-processing-n:127.0.0.1:47127_solr) [n:127.0.0.1:47127_solr    ] o.a.s.c.c.ZkStateReader Updated live nodes from ZooKeeper... (4) -> (5)
   [junit4]   2> 218632 INFO  (zkCallback-180-thread-1-processing-n:127.0.0.1:45586_solr) [n:127.0.0.1:45586_solr    ] o.a.s.c.c.ZkStateReader Updated live nodes from ZooKeeper... (4) -> (5)
   [junit4]   2> 218632 INFO  (zkCallback-179-thread-1-processing-n:127.0.0.1:38570_solr) [n:127.0.0.1:38570_solr    ] o.a.s.c.c.ZkStateReader Updated live nodes from ZooKeeper... (4) -> (5)
   [junit4]   2> 218633 INFO  (zkCallback-163-thread-1-processing-n:127.0.0.1:52051_solr) [n:127.0.0.1:52051_solr    ] o.a.s.c.c.ZkStateReader Updated live nodes from ZooKeeper... (4) -> (5)
   [junit4]   2> 218634 INFO  (zkCallback-184-thread-1-processing-n:127.0.0.1:33833_solr) [n:127.0.0.1:33833_solr    ] o.a.s.c.c.ZkStateReader Updated live nodes from ZooKeeper... (4) -> (5)
   [junit4]   2> 218634 INFO  (zkCallback-164-thread-1-processing-n:127.0.0.1:56745_solr) [n:127.0.0.1:56745_solr    ] o.a.s.c.c.ZkStateReader Updated live nodes from ZooKeeper... (4) -> (5)
   [junit4]   2> 218659 INFO  (jetty-launcher-131-thread-9) [n:127.0.0.1:33833_solr    ] o.a.s.c.ZkController Register node as live in ZooKeeper:/live_nodes/127.0.0.1:33833_solr
   [junit4]   2> 218661 INFO  (jetty-launcher-131-thread-10) [n:127.0.0.1:47127_solr    ] o.a.s.c.ZkController Register node as live in ZooKeeper:/live_nodes/127.0.0.1:47127_solr
   [junit4]   2> 218663 INFO  (jetty-launcher-131-thread-1) [n:127.0.0.1:45586_solr    ] o.a.s.c.ZkController Register node as live in ZooKeeper:/live_nodes/127.0.0.1:45586_solr
   [junit4]   2> 218702 INFO  (zkCallback-175-thread-1-processing-n:127.0.0.1:47514_solr) [n:127.0.0.1:47514_solr    ] o.a.s.c.c.ZkStateReader Updated live nodes from ZooKeeper... (5) -> (6)
   [junit4]   2> 218702 INFO  (zkCallback-180-thread-1-processing-n:127.0.0.1:45586_solr) [n:127.0.0.1:45586_solr    ] o.a.s.c.c.ZkStateReader Updated live nodes from ZooKeeper... (5) -> (6)
   [junit4]   2> 218703 INFO  (zkCallback-178-thread-1-processing-n:127.0.0.1:52802_solr) [n:127.0.0.1:52802_solr    ] o.a.s.c.c.ZkStateReader Updated live nodes from ZooKeeper... (5) -> (6)
   [junit4]   2> 218703 INFO  (zkCallback-151-thread-1-processing-n:127.0.0.1:52915_solr) [n:127.0.0.1:52915_solr    ] o.a.s.c.c.ZkStateReader Updated live nodes from ZooKeeper... (5) -> (6)
   [junit4]   2> 218703 INFO  (zkCallback-185-thread-1-processing-n:127.0.0.1:48460_solr) [n:127.0.0.1:48460_solr    ] o.a.s.c.c.ZkStateReader Updated live nodes from ZooKeeper... (5) -> (6)
   [junit4]   2> 218703 INFO  (zkCallback-179-thread-1-processing-n:127.0.0.1:38570_solr) [n:127.0.0.1:38570_solr    ] o.a.s.c.c.ZkStateReader Updated live nodes from ZooKeeper... (5) -> (6)
   [junit4]   2> 218703 INFO  (zkCallback-186-thread-1-processing-n:127.0.0.1:47127_solr) [n:127.0.0.1:47127_solr    ] o.a.s.c.c.ZkStateReader Updated live nodes from ZooKeeper... (5) -> (6)
   [junit4]   2> 218703 INFO  (zkCallback-163-thread-1-processing-n:127.0.0.1:52051_solr) [n:127.0.0.1:52051_solr    ] o.a.s.c.c.ZkStateReader Updated live nodes from ZooKeeper... (5) -> (6)
   [junit4]   2> 218704 INFO  (zkCallback-184-thread-1-processing-n:127.0.0.1:33833_solr) [n:127.0.0.1:33833_solr    ] o.a.s.c.c.ZkStateReader Updated live nodes from ZooKeeper... (5) -> (6)
   [junit4]   2> 218704 INFO  (zkCallback-164-thread-1-processing-n:127.0.0.1:56745_solr) [n:127.0.0.1:56745_solr    ] o.a.s.c.c.ZkStateReader Updated live nodes from ZooKeeper... (5) -> (6)
   [junit4]   2> 218719 INFO  (zkCallback-175-thread-1-processing-n:127.0.0.1:47514_solr) [n:127.0.0.1:47514_solr    ] o.a.s.c.c.ZkStateReader Updated live nodes from ZooKeeper... (6) -> (8)
   [junit4]   2> 218719 INFO  (zkCallback-185-thread-1-processing-n:127.0.0.1:48460_solr) [n:127.0.0.1:48460_solr    ] o.a.s.c.c.ZkStateReader Updated live nodes from ZooKeeper... (6) -> (8)
   [junit4]   2> 218719 INFO  (zkCallback-180-thread-1-processing-n:127.0.0.1:45586_solr) [n:127.0.0.1:45586_solr    ] o.a.s.c.c.ZkStateReader Updated live nodes from ZooKeeper... (6) -> (8)
   [junit4]   2> 218719 INFO  (zkCallback-178-thread-1-processing-n:127.0.0.1:52802_solr) [n:127.0.0.1:52802_solr    ] o.a.s.c.c.ZkStateReader Updated live nodes from ZooKeeper... (6) -> (8)
   [junit4]   2> 218720 INFO  (zkCallback-186-thread-1-processing-n:127.0.0.1:47127_solr) [n:127.0.0.1:47127_solr    ] o.a.s.c.c.ZkStateReader Updated live nodes from ZooKeeper... (6) -> (8)
   [junit4]   2> 218720 INFO  (zkCallback-179-thread-1-processing-n:127.0.0.1:38570_solr) [n:127.0.0.1:38570_solr    ] o.a.s.c.c.ZkStateReader Updated live nodes from ZooKeeper... (6) -> (8)
   [junit4]   2> 218720 INFO  (zkCallback-163-thread-1-processing-n:127.0.0.1:52051_solr) [n:127.0.0.1:52051_solr    ] o.a.s.c.c.ZkStateReader Updated live nodes from ZooKeeper... (6) -> (8)
   [junit4]   2> 218720 INFO  (zkCallback-184-thread-1-processing-n:127.0.0.1:33833_solr) [n:127.0.0.1:33833_solr    ] o.a.s.c.c.ZkStateReader Updated live nodes from ZooKeeper... (6) -> (8)
   [junit4]   2> 218721 INFO  (zkCallback-164-thread-1-processing-n:127.0.0.1:56745_solr) [n:127.0.0.1:56745_solr    ] o.a.s.c.c.ZkStateReader Updated live nodes from ZooKeeper... (6) -> (8)
   [junit4]   2> 218723 INFO  (zkCallback-151-thread-1-processing-n:127.0.0.1:52915_solr) [n:127.0.0.1:52915_solr    ] o.a.s.c.c.ZkStateReader Updated live nodes from ZooKeeper... (6) -> (8)
   [junit4]   2> 218747 INFO  (jetty-launcher-131-thread-3) [n:127.0.0.1:48460_solr    ] o.a.s.c.ZkController Register node as live in ZooKeeper:/live_nodes/127.0.0.1:48460_solr
   [junit4]   2> 218756 INFO  (zkCallback-175-thread-1-processing-n:127.0.0.1:47514_solr) [n:127.0.0.1:47514_solr    ] o.a.s.c.c.ZkStateReader Updated live nodes from ZooKeeper... (8) -> (9)
   [junit4]   2> 218756 INFO  (zkCallback-180-thread-1-processing-n:127.0.0.1:45586_solr) [n:127.0.0.1:45586_solr    ] o.a.s.c.c.ZkStateReader Updated live nodes from ZooKeeper... (8) -> (9)
   [junit4]   2> 218757 INFO  (zkCallback-185-thread-1-processing-n:127.0.0.1:48460_solr) [n:127.0.0.1:48460_solr    ] o.a.s.c.c.ZkStateReader Updated live nodes from ZooKeeper... (8) -> (9)
   [junit4]   2> 218757 INFO  (zkCallback-178-thread-1-processing-n:127.0.0.1:52802_solr) [n:127.0.0.1:52802_solr    ] o.a.s.c.c.ZkStateReader Updated live nodes from ZooKeeper... (8) -> (9)
   [junit4]   2> 218757 INFO  (zkCallback-186-thread-1-processing-n:127.0.0.1:47127_solr) [n:127.0.0.1:47127_solr    ] o.a.s.c.c.ZkStateReader Updated live nodes from ZooKeeper... (8) -> (9)
   [junit4]   2> 218757 INFO  (zkCallback-151-thread-1-processing-n:127.0.0.1:52915_solr) [n:127.0.0.1:52915_solr    ] o.a.s.c.c.ZkStateReader Updated live nodes from ZooKeeper... (8) -> (9)
   [junit4]   2> 218757 INFO  (zkCallback-179-thread-1-processing-n:127.0.0.1:38570_solr) [n:127.0.0.1:38570_solr    ] o.a.s.c.c.ZkStateReader Updated live nodes from ZooKeeper... (8) -> (9)
   [junit4]   2> 218757 INFO  (zkCallback-163-thread-1-processing-n:127.0.0.1:52051_solr) [n:127.0.0.1:52051_solr    ] o.a.s.c.c.ZkStateReader Updated live nodes from ZooKeeper... (8) -> (9)
   [junit4]   2> 218758 INFO  (zkCallback-184-thread-1-processing-n:127.0.0.1:33833_solr) [n:127.0.0.1:33833_solr    ] o.a.s.c.c.ZkStateReader Updated live nodes from ZooKeeper... (8) -> (9)
   [junit4]   2> 218758 INFO  (zkCallback-164-thread-1-processing-n:127.0.0.1:56745_solr) [n:127.0.0.1:56745_solr    ] o.a.s.c.c.ZkStateReader Updated live nodes from ZooKeeper... (8) -> (9)
   [junit4]   2> 218837 INFO  (jetty-launcher-131-thread-4) [n:127.0.0.1:56745_solr    ] o.a.s.c.ZkController Register node as live in ZooKeeper:/live_nodes/127.0.0.1:56745_solr
   [junit4]   2> 218844 INFO  (zkCallback-185-thread-1-processing-n:127.0.0.1:48460_solr) [n:127.0.0.1:48460_solr    ] o.a.s.c.c.ZkStateReader Updated live nodes from ZooKeeper... (9) -> (10)
   [junit4]   2> 218844 INFO  (zkCallback-184-thread-1-processing-n:127.0.0.1:33833_solr) [n:127.0.0.1:33833_solr    ] o.a.s.c.c.ZkStateReader Updated live nodes from ZooKeeper... (9) -> (10)
   [junit4]   2> 218844 INFO  (zkCallback-186-thread-1-processing-n:127.0.0.1:47127_solr) [n:127.0.0.1:47127_solr    ] o.a.s.c.c.ZkStateReader Updated live nodes from ZooKeeper... (9) -> (10)
   [junit4]   2> 218844 INFO  (zkCallback-151-thread-1-processing-n:127.0.0.1:52915_solr) [n:127.0.0.1:52915_solr    ] o.a.s.c.c.ZkStateReader Updated live nodes from ZooKeeper... (9) -> (10)
   [junit4]   2> 218844 INFO  (zkCallback-179-thread-1-processing-n:127.0.0.1:38570_solr) [n:127.0.0.1:38570_solr    ] o.a.s.c.c.ZkStateReader Updated live nodes from ZooKeeper... (9) -> (10)
   [junit4]   2> 218844 INFO  (zkCallback-163-thread-1-processing-n:127.0.0.1:52051_solr) [n:127.0.0.1:52051_solr    ] o.a.s.c.c.ZkStateReader Updated live nodes from ZooKeeper... (9) -> (10)
   [junit4]   2> 218844 INFO  (zkCallback-175-thread-1-processing-n:127.0.0.1:47514_solr) [n:127.0.0.1:47514_solr    ] o.a.s.c.c.ZkStateReader Updated live nodes from ZooKeeper... (9) -> (10)
   [junit4]   2> 218845 INFO  (zkCallback-180-thread-1-processing-n:127.0.0.1:45586_solr) [n:127.0.0.1:45586_solr    ] o.a.s.c.c.ZkStateReader Updated live nodes from ZooKeeper... (9) -> (10)
   [junit4]   2> 218845 INFO  (zkCallback-178-thread-1-processing-n:127.0.0.1:52802_solr) [n:127.0.0.1:52802_solr    ] o.a.s.c.c.ZkStateReader Updated live nodes from ZooKeeper... (9) -> (10)
   [junit4]   2> 218846 INFO  (zkCallback-164-thread-1-processing-n:127.0.0.1:56745_solr) [n:127.0.0.1:56745_solr    ] o.a.s.c.c.ZkStateReader Updated live nodes from ZooKeeper... (9) -> (10)
   [junit4]   2> 219315 INFO  (jetty-launcher-131-thread-8) [n:127.0.0.1:52802_solr    ] o.a.s.c.CorePropertiesLocator Found 0 core definitions underneath /x1/jenkins/jenkins-slave/workspace/Lucene-Solr-NightlyTests-6.x/checkout/solr/build/solr-core/test/J0/temp/solr.cloud.TestStressCloudBlindAtomicUpdates_D8ECC85A49A09819-001/tempDir-001/node8/.
   [junit4]   2> 219615 INFO  (jetty-launcher-131-thread-2) [n:127.0.0.1:52051_solr    ] o.a.s.c.CorePropertiesLocator Found 0 core definitions underneath /x1/jenkins/jenkins-slave/workspace/Lucene-Solr-NightlyTests-6.x/checkout/solr/build/solr-core/test/J0/temp/solr.cloud.TestStressCloudBlindAtomicUpdates_D8ECC85A49A09819-001/tempDir-001/node2/.
   [junit4]   2> 219620 INFO  (jetty-launcher-131-thread-7) [n:127.0.0.1:38570_solr    ] o.a.s.c.CorePropertiesLocator Found 0 core definitions underneath /x1/jenkins/jenkins-slave/workspace/Lucene-Solr-NightlyTests-6.x/checkout/solr/build/solr-core/test/J0/temp/solr.cloud.TestStressCloudBlindAtomicUpdates_D8ECC85A49A09819-001/tempDir-001/node7/.
   [junit4]   2> 219628 INFO  (jetty-launcher-131-thread-3) [n:127.0.0.1:48460_solr    ] o.a.s.c.CorePropertiesLocator Found 0 core definitions underneath /x1/jenkins/jenkins-slave/workspace/Lucene-Solr-NightlyTests-6.x/checkout/solr/build/solr-core/test/J0/temp/solr.cloud.TestStressCloudBlindAtomicUpdates_D8ECC85A49A09819-001/tempDir-001/node3/.
   [junit4]   2> 219673 INFO  (jetty-launcher-131-thread-4) [n:127.0.0.1:56745_solr    ] o.a.s.c.CorePropertiesLocator Found 0 core definitions underneath /x1/jenkins/jenkins-slave/workspace/Lucene-Solr-NightlyTests-6.x/checkout/solr/build/solr-core/test/J0/temp/solr.cloud.TestStressCloudBlindAtomicUpdates_D8ECC85A49A09819-001/tempDir-001/node4/.
   [junit4]   2> 219678 INFO  (jetty-launcher-131-thread-9) [n:127.0.0.1:33833_solr    ] o.a.s.c.CorePropertiesLocator Found 0 core definitions underneath /x1/jenkins/jenkins-slave/workspace/Lucene-Solr-NightlyTests-6.x/checkout/solr/build/solr-core/test/J0/temp/solr.cloud.TestStressCloudBlindAtomicUpdates_D8ECC85A49A09819-001/tempDir-001/node9/.
   [junit4]   2> 219706 INFO  (jetty-launcher-131-thread-6) [n:127.0.0.1:47514_solr    ] o.a.s.c.CorePropertiesLocator Found 0 core definitions underneath /x1/jenkins/jenkins-slave/workspace/Lucene-Solr-NightlyTests-6.x/checkout/solr/build/solr-core/test/J0/temp/solr.cloud.TestStressCloudBlindAtomicUpdates_D8ECC85A49A09819-001/tempDir-001/node6/.
   [junit4]   2> 219815 INFO  (jetty-launcher-131-thread-5) [n:127.0.0.1:52915_solr    ] o.a.s.c.CorePropertiesLocator Found 0 core definitions underneath /x1/jenkins/jenkins-slave/workspace/Lucene-Solr-NightlyTests-6.x/checkout/solr/build/solr-core/test/J0/temp/solr.cloud.TestStressCloudBlindAtomicUpdates_D8ECC85A49A09819-001/tempDir-001/node5/.
   [junit4]   2> 219850 INFO  (jetty-launcher-131-thread-10) [n:127.0.0.1:47127_solr    ] o.a.s.c.CorePropertiesLocator Found 0 core definitions underneath /x1/jenkins/jenkins-slave/workspace/Lucene-Solr-NightlyTests-6.x/checkout/solr/build/solr-core/test/J0/temp/solr.cloud.TestStressCloudBlindAtomicUpdates_D8ECC85A49A09819-001/tempDir-001/node10/.
   [junit4]   2> 219947 INFO  (jetty-launcher-131-thread-1) [n:127.0.0.1:45586_solr    ] o.a.s.c.CorePropertiesLocator Found 0 core definitions underneath /x1/jenkins/jenkins-slave/workspace/Lucene-Solr-NightlyTests-6.x/checkout/solr/build/solr-core/test/J0/temp/solr.cloud.TestStressCloudBlindAtomicUpdates_D8ECC85A49A09819-001/tempDir-001/node1/.
   [junit4]   2> 220234 INFO  (SUITE-TestStressCloudBlindAtomicUpdates-seed#[D8ECC85A49A09819]-worker) [    ] o.a.s.c.c.ZkStateReader Updated live nodes from ZooKeeper... (0) -> (10)
   [junit4]   2> 220235 INFO  (SUITE-TestStressCloudBlindAtomicUpdates-seed#[D8ECC85A49A09819]-worker) [    ] o.a.s.c.s.i.ZkClientClusterStateProvider Cluster at 127.0.0.1:41231/solr ready
   [junit4]   2> 221154 INFO  (qtp1044791258-1043) [n:127.0.0.1:52915_solr    ] o.a.s.h.a.CollectionsHandler Invoked Collection Action :create with params replicationFactor=2&property.config=solrconfig-tlog.xml&property.schema=schema-minimal-atomic-stress.xml&collection.configName=org.apache.solr.cloud.TestStressCloudBlindAtomicUpdates_config-set&name=test_col&action=CREATE&numShards=5&wt=javabin&version=2 and sendToOCPQueue=true
   [junit4]   2> 221166 INFO  (OverseerThreadFactory-624-thread-1-processing-n:127.0.0.1:56745_solr) [n:127.0.0.1:56745_solr    ] o.a.s.c.CreateCollectionCmd Create collection test_col
   [junit4]   2> 221424 INFO  (qtp1044791258-1041) [n:127.0.0.1:52915_solr    ] o.a.s.h.a.CoreAdminOperation core create command property.config=solrconfig-tlog.xml&property.schema=schema-minimal-atomic-stress.xml&qt=/admin/cores&collection.configName=org.apache.solr.cloud.TestStressCloudBlindAtomicUpdates_config-set&newCollection=true&name=test_col_shard4_replica1&action=CREATE&numShards=5&collection=test_col&shard=shard4&wt=javabin&version=2
   [junit4]   2> 221424 INFO  (qtp1044791258-1041) [n:127.0.0.1:52915_solr    ] o.a.s.c.TransientSolrCoreCacheDefault Allocating transient cache for 2147483647 transient cores
   [junit4]   2> 221667 INFO  (qtp706866116-1113) [n:127.0.0.1:38570_solr    ] o.a.s.h.a.CoreAdminOperation core create command property.config=solrconfig-tlog.xml&property.schema=schema-minimal-atomic-stress.xml&qt=/admin/cores&collection.configName=org.apache.solr.cloud.TestStressCloudBlindAtomicUpdates_config-set&newCollection=true&name=test_col_shard5_replica1&action=CREATE&numShards=5&collection=test_col&shard=shard5&wt=javabin&version=2
   [junit4]   2> 221668 INFO  (qtp2110216741-1072) [n:127.0.0.1:52051_solr    ] o.a.s.h.a.CoreAdminOperation core create command property.config=solrconfig-tlog.xml&property.schema=schema-minimal-atomic-stress.xml&qt=/admin/cores&collection.configName=org.apache.solr.cloud.TestStressCloudBlindAtomicUpdates_config-set&newCollection=true&name=test_col_shard3_replica2&action=CREATE&numShards=5&collection=test_col&shard=shard3&wt=javabin&version=2
   [junit4]   2> 221669 INFO  (qtp2110216741-1072) [n:127.0.0.1:52051_solr    ] o.a.s.c.TransientSolrCoreCacheDefault Allocating transient cache for 2147483647 transient cores
   [junit4]   2> 221669 INFO  (qtp1049384214-1081) [n:127.0.0.1:45586_solr    ] o.a.s.h.a.CoreAdminOperation core create command property.config=solrconfig-tlog.xml&property.schema=schema-minimal-atomic-stress.xml&qt=/admin/cores&collection.configName=org.apache.solr.cloud.TestStressCloudBlindAtomicUpdates_config-set&newCollection=true&name=test_col_shard5_replica2&action=CREATE&numShards=5&collection=test_col&shard=shard5&wt=javabin&version=2
   [junit4]   2> 221670 INFO  (qtp1049384214-1081) [n:127.0.0.1:45586_solr    ] o.a.s.c.TransientSolrCoreCacheDefault Allocating transient cache for 2147483647 transient cores
   [junit4]   2> 221672 INFO  (qtp831900368-1063) [n:127.0.0.1:48460_solr    ] o.a.s.h.a.CoreAdminOperation core create command property.config=solrconfig-tlog.xml&property.schema=schema-minimal-atomic-stress.xml&qt=/admin/cores&collection.configName=org.apache.solr.cloud.TestStressCloudBlindAtomicUpdates_config-set&newCollection=true&name=test_col_shard4_replica2&action=CREATE&numShards=5&collection=test_col&shard=shard4&wt=javabin&version=2
   [junit4]   2> 221673 INFO  (qtp831900368-1063) [n:127.0.0.1:48460_solr    ] o.a.s.c.TransientSolrCoreCacheDefault Allocating transient cache for 2147483647 transient cores
   [junit4]   2> 221675 INFO  (zkCallback-151-thread-1-processing-n:127.0.0.1:52915_solr) [n:127.0.0.1:52915_solr    ] o.a.s.c.c.ZkStateReader A cluster state change: [WatchedEvent state:SyncConnected type:NodeDataChanged path:/collections/test_col/state.json] for collection [test_col] has occurred - updating... (live nodes size: [10])
   [junit4]   2> 221677 INFO  (qtp706866116-1113) [n:127.0.0.1:38570_solr    ] o.a.s.c.TransientSolrCoreCacheDefault Allocating transient cache for 2147483647 transient cores
   [junit4]   2> 221691 INFO  (qtp104331158-1105) [n:127.0.0.1:52802_solr    ] o.a.s.h.a.CoreAdminOperation core create command property.config=solrconfig-tlog.xml&property.schema=schema-minimal-atomic-stress.xml&qt=/admin/cores&collection.configName=org.apache.solr.cloud.TestStressCloudBlindAtomicUpdates_config-set&newCollection=true&name=test_col_shard2_replica1&action=CREATE&numShards=5&collection=test_col&shard=shard2&wt=javabin&version=2
   [junit4]   2> 221691 INFO  (qtp104331158-1105) [n:127.0.0.1:52802_solr    ] o.a.s.c.TransientSolrCoreCacheDefault Allocating transient cache for 2147483647 transient cores
   [junit4]   2> 221718 INFO  (qtp1770381887-1059) [n:127.0.0.1:56745_solr    ] o.a.s.h.a.CoreAdminOperation core create command property.config=solrconfig-tlog.xml&property.schema=schema-minimal-atomic-stress.xml&qt=/admin/cores&collection.configName=org.apache.solr.cloud.TestStressCloudBlindAtomicUpdates_config-set&newCollection=true&name=test_col_shard3_replica1&action=CREATE&numShards=5&collection=test_col&shard=shard3&wt=javabin&version=2
   [junit4]   2> 221718 INFO  (qtp1770381887-1059) [n:127.0.0.1:56745_solr    ] o.a.s.c.TransientSolrCoreCacheDefault Allocating transient cache for 2147483647 transient cores
   [junit4]   2> 221730 INFO  (qtp449245556-1036) [n:127.0.0.1:47514_solr    ] o.a.s.h.a.CoreAdminOperation core create command property.config=solrconfig-tlog.xml&property.schema=schema-minimal-atomic-stress.xml&qt=/admin/cores&collection.configName=org.apache.solr.cloud.TestStressCloudBlindAtomicUpdates_config-set&newCollection=true&name=test_col_shard1_replica1&action=CREATE&numShards=5&collection=test_col&shard=shard1&wt=javabin&version=2
   [junit4]   2> 221731 INFO  (qtp1422543124-1136) [n:127.0.0.1:47127_solr    ] o.a.s.h.a.CoreAdminOperation core create command property.config=solrconfig-tlog.xml&property.schema=schema-minimal-atomic-stress.xml&qt=/admin/cores&collection.configName=org.apache.solr.cloud.TestStressCloudBlindAtomicUpdates_config-set&newCollection=true&name=test_col_shard2_replica2&action=CREATE&numShards=5&collection=test_col&shard=shard2&wt=javabin&version=2
   [junit4]   2> 221731 INFO  (qtp1422543124-1136) [n:127.0.0.1:47127_solr    ] o.a.s.c.TransientSolrCoreCacheDefault Allocating transient cache for 2147483647 transient cores
   [junit4]   2> 221732 INFO  (qtp1290485782-1094) [n:127.0.0.1:33833_solr    ] o.a.s.h.a.CoreAdminOperation core create command property.config=solrconfig-tlog.xml&property.schema=schema-minimal-atomic-stress.xml&qt=/admin/cores&collection.configName=org.apache.solr.cloud.TestStressCloudBlindAtomicUpdates_config-set&newCollection=true&name=test_col_shard1_replica2&action=CREATE&numShards=5&collection=test_col&shard=shard1&wt=javabin&version=2
   [junit4]   2> 221732 INFO  (qtp1290485782-1094) [n:127.0.0.1:33833_solr    ] o.a.s.c.TransientSolrCoreCacheDefault Allocating transient cache for 2147483647 transient cores
   [junit4]   2> 221739 INFO  (qtp449245556-1036) [n:127.0.0.1:47514_solr    ] o.a.s.c.TransientSolrCoreCacheDefault Allocating transient cache for 2147483647 transient cores
   [junit4]   2> 221849 INFO  (zkCallback-185-thread-1-processing-n:127.0.0.1:48460_solr) [n:127.0.0.1:48460_solr    ] o.a.s.c.c.ZkStateReader A cluster state change: [WatchedEvent state:SyncConnected type:NodeDataChanged path:/collections/test_col/state.json] for collection [test_col] has occurred - updating... (live nodes size: [10])
   [junit4]   2> 221850 INFO  (zkCallback-151-thread-1-processing-n:127.0.0.1:52915_solr) [n:127.0.0.1:52915_solr    ] o.a.s.c.c.ZkStateReader A cluster state change: [WatchedEvent state:SyncConnected type:NodeDataChanged path:/collections/test_col/state.json] for collection [test_col] has occurred - updating... (live nodes size: [10])
   [junit4]   2> 221850 INFO  (zkCallback-175-thread-1-processing-n:127.0.0.1:47514_solr) [n:127.0.0.1:47514_solr    ] o.a.s.c.c.ZkStateReader A cluster state change: [WatchedEvent state:SyncConnected type:NodeDataChanged path:/collections/test_col/state.json] for collection [test_col] has occurred - updating... (live nodes size: [10])
   [junit4]   2> 221850 INFO  (zkCallback-180-thread-1-processing-n:127.0.0.1:45586_solr) [n:127.0.0.1:45586_solr    ] o.a.s.c.c.ZkStateReader A cluster state change: [WatchedEvent state:SyncConnected type:NodeDataChanged path:/collections/test_col/state.json] for collection [test_col] has occurred - updating... (live nodes size: [10])
   [junit4]   2> 221850 INFO  (zkCallback-186-thread-1-processing-n:127.0.0.1:47127_solr) [n:127.0.0.1:47127_solr    ] o.a.s.c.c.ZkStateReader A cluster state change: [WatchedEvent state:SyncConnected type:NodeDataChanged path:/collections/test_col/state.json] for collection [test_col] has occurred - updating... (live nodes size: [10])
   [junit4]   2> 221850 INFO  (zkCallback-178-thread-1-processing-n:127.0.0.1:52802_solr) [n:127.0.0.1:52802_solr    ] o.a.s.c.c.ZkStateReader A cluster state change: [WatchedEvent state:SyncConnected type:NodeDataChanged path:/collections/test_col/state.json] for collection [test_col] has occurred - updating... (live nodes size: [10])
   [junit4]   2> 221850 INFO  (zkCallback-163-thread-1-processing-n:127.0.0.1:52051_solr) [n:127.0.0.1:52051_solr    ] o.a.s.c.c.ZkStateReader A cluster state change: [WatchedEvent state:SyncConnected type:NodeDataChanged path:/collections/test_col/state.json] for collection [test_col] has occurred - updating... (live nodes size: [10])
   [junit4]   2> 221850 INFO  (zkCallback-179-thread-1-processing-n:127.0.0.1:38570_solr) [n:127.0.0.1:38570_solr    ] o.a.s.c.c.ZkStateReader A cluster state change: [WatchedEvent state:SyncConnected type:NodeDataChanged path:/collections/test_col/state.json] for collection [test_col] has occurred - updating... (live nodes size: [10])
   [junit4]   2> 221851 INFO  (zkCallback-184-thread-1-processing-n:127.0.0.1:33833_solr) [n:127.0.0.1:33833_solr    ] o.a.s.c.c.ZkStateReader A cluster state change: [WatchedEvent state:SyncConnected type:NodeDataChanged path:/collections/test_col/state.json] for collection [test_col] has occurred - updating... (live nodes size: [10])
   [junit4]   2> 221851 INFO  (zkCallback-164-thread-1-processing-n:127.0.0.1:56745_solr) [n:127.0.0.1:56745_solr    ] o.a.s.c.c.ZkStateReader A cluster state change: [WatchedEvent state:SyncConnected type:NodeDataChanged path:/collections/test_col/state.json] for collection [test_col] has occurred - updating... (live nodes size: [10])
   [junit4]   2> 222514 WARN  (qtp1044791258-1041) [n:127.0.0.1:52915_solr c:test_col s:shard4  x:test_col_shard4_replica1] o.a.s.c.Config Beginning with Solr 5.5, <mergePolicy> is deprecated, use <mergePolicyFactory> instead.
   [junit4]   2> 222521 INFO  (qtp1044791258-1041) [n:127.0.0.1:52915_solr c:test_col s:shard4  x:test_col_shard4_replica1] o.a.s.c.SolrConfig Using Lucene MatchVersion: 6.6.0
   [junit4]   2> 222537 INFO  (qtp1044791258-1041) [n:127.0.0.1:52915_solr c:test_col s:shard4  x:test_col_shard4_replica1] o.a.s.s.IndexSchema [test_col_shard4_replica1] Schema name=minimal-atomic-stress
   [junit4]   2> 222540 INFO  (qtp1044791258-1041) [n:127.0.0.1:52915_solr c:test_col s:shard4  x:test_col_shard4_replica1] o.a.s.s.IndexSchema Loaded schema minimal-atomic-stress/1.6 with uniqueid field id
   [junit4]   2> 222540 INFO  (qtp1044791258-1041) [n:127.0.0.1:52915_solr c:test_col s:shard4  x:test_col_shard4_replica1] o.a.s.c.CoreContainer Creating SolrCore 'test_col_shard4_replica1' using configuration from collection test_col, trusted=true
   [junit4]   2> 222540 INFO  (qtp1044791258-1041) [n:127.0.0.1:52915_solr c:test_col s:shard4  x:test_col_shard4_replica1] o.a.s.c.SolrCore solr.RecoveryStrategy.Builder
   [junit4]   2> 222541 INFO  (qtp1044791258-1041) [n:127.0.0.1:52915_solr c:test_col s:shard4  x:test_col_shard4_replica1] o.a.s.c.SolrCore [[test_col_shard4_replica1] ] Opening new SolrCore at [/x1/jenkins/jenkins-slave/workspace/Lucene-Solr-NightlyTests-6.x/checkout/solr/build/solr-core/test/J0/temp/solr.cloud.TestStressCloudBlindAtomicUpdates_D8ECC85A49A09819-001/tempDir-001/node5/test_col_shard4_replica1], dataDir=[/x1/jenkins/jenkins-slave/workspace/Lucene-Solr-NightlyTests-6.x/checkout/solr/build/solr-core/test/J0/temp/solr.cloud.TestStressCloudBlindAtomicUpdates_D8ECC85A49A09819-001/tempDir-001/node5/./test_col_shard4_replica1/data/]
   [junit4]   2> 222541 INFO  (qtp1044791258-1041) [n:127.0.0.1:52915_solr c:test_col s:shard4  x:test_col_shard4_replica1] o.a.s.c.JmxMonitoredMap JMX monitoring is enabled. Adding Solr mbeans to JMX Server: com.sun.jmx.mbeanserver.JmxMBeanServer@39b340be
   [junit4]   2> 222544 INFO  (qtp1044791258-1041) [n:127.0.0.1:52915_solr c:test_col s:shard4  x:test_col_shard4_replica1] o.a.s.u.RandomMergePolicy RandomMergePolicy wrapping class org.apache.lucene.index.LogDocMergePolicy: [LogDocMergePolicy: minMergeSize=1000, mergeFactor=43, maxMergeSize=9223372036854775807, maxMergeSizeForForcedMerge=9223372036854775807, calibrateSizeByDeletes=true, maxMergeDocs=2147483647, maxCFSSegmentSizeMB=8.796093022207999E12, noCFSRatio=0.3421058346006094]
   [junit4]   2> 222552 WARN  (qtp1044791258-1041) [n:127.0.0.1:52915_solr c:test_col s:shard4  x:test_col_shard4_replica1] o.a.s.c.RequestHandlers INVALID paramSet a in requestHandler {type = requestHandler,name = /dump,class = DumpRequestHandler,attributes = {initParams=a, name=/dump, class=DumpRequestHandler},args = {defaults={a=A,b=B}}}
   [junit4]   2> 222624 INFO  (qtp1044791258-1041) [n:127.0.0.1:52915_solr c:test_col s:shard4  x:test_col_shard4_replica1] o.a.s.u.UpdateHandler Using UpdateLog implementation: org.apache.solr.update.UpdateLog
   [junit4]   2> 222624 INFO  (qtp1044791258-1041) [n:127.0.0.1:52915_solr c:test_col s:shard4  x:test_col_shard4_replica1] o.a.s.u.UpdateLog Initializing UpdateLog: dataDir= defaultSyncLevel=FLUSH numRecordsToKeep=100 maxNumLogsToKeep=10 numVersionBuckets=65536
   [junit4]   2> 222625 INFO  (qtp1044791258-1041) [n:127.0.0.1:52915_solr c:test_col s:shard4  x:test_col_shard4_replica1] o.a.s.u.CommitTracker Hard AutoCommit: disabled
   [junit4]   2> 222625 INFO  (qtp1044791258-1041) [n:127.0.0.1:52915_solr c:test_col s:shard4  x:test_col_shard4_replica1] o.a.s.u.CommitTracker Soft AutoCommit: disabled
   [junit4]   2> 222626 INFO  (qtp1044791258-1041) [n:127.0.0.1:52915_solr c:test_col s:shard4  x:test_col_shard4_replica1] o.a.s.u.RandomMergePolicy RandomMergePolicy wrapping class org.apache.lucene.index.MockRandomMergePolicy: org.apache.lucene.index.MockRandomMergePolicy@58b16c60
   [junit4]   2> 222626 INFO  (qtp1044791258-1041) [n:127.0.0.1:52915_solr c:test_col s:shard4  x:test_col_shard4_replica1] o.a.s.s.SolrIndexSearcher Opening [Searcher@79dd69ff[test_col_shard4_replica1] main]
   [junit4]   2> 222631 INFO  (qtp1044791258-1041) [n:127.0.0.1:52915_solr c:test_col s:shard4  x:test_col_shard4_replica1] o.a.s.r.ManagedResourceStorage Configured ZooKeeperStorageIO with znodeBase: /configs/org.apache.solr.cloud.TestStressCloudBlindAtomicUpdates_config-set
   [junit4]   2> 222632 INFO  (qtp1044791258-1041) [n:127.0.0.1:52915_solr c:test_col s:shard4  x:test_col_shard4_replica1] o.a.s.r.ManagedResourceStorage Loaded null at path _rest_managed.json using ZooKeeperStorageIO:path=/configs/org.apache.solr.cloud.TestStressCloudBlindAtomicUpdates_config-set
   [junit4]   2> 222632 INFO  (qtp1044791258-1041) [n:127.0.0.1:52915_solr c:test_col s:shard4  x:test_col_shard4_replica1] o.a.s.h.ReplicationHandler Commits will be reserved for  10000
   [junit4]   2> 222633 INFO  (qtp1044791258-1041) [n:127.0.0.1:52915_solr c:test_col s:shard4  x:test_col_shard4_replica1] o.a.s.u.UpdateLog Could not find max version in index or recent updates, using new clock 1565189366644473856
   [junit4]   2> 222639 INFO  (searcherExecutor-645-thread-1-processing-n:127.0.0.1:52915_solr x:test_col_shard4_replica1 s:shard4 c:test_col) [n:127.0.0.1:52915_solr c:test_col s:shard4  x:test_col_shard4_replica1] o.a.s.c.SolrCore [test_col_shard4_replica1] Registered new searcher Searcher@79dd69ff[test_col_shard4_replica1] main{ExitableDirectoryReader(UninvertingDirectoryReader())}
   [junit4]   2> 222646 INFO  (qtp1044791258-1041) [n:127.0.0.1:52915_solr c:test_col s:shard4  x:test_col_shard4_replica1] o.a.s.c.ShardLeaderElectionContext Waiting until we see more replicas up for shard shard4: total=2 found=1 timeoutin=9999ms
   [junit4]   2> 222698 WARN  (qtp831900368-1063) [n:127.0.0.1:48460_solr c:test_col s:shard4  x:test_col_shard4_replica2] o.a.s.c.Config Beginning with Solr 5.5, <mergePolicy> is deprecated, use <mergePolicyFactory> instead.
   [junit4]   2> 222698 INFO  (qtp831900368-1063) [n:127.0.0.1:48460_solr c:test_col s:shard4  x:test_col_shard4_replica2] o.a.s.c.SolrConfig Using Lucene MatchVersion: 6.6.0
   [junit4]   2> 222733 WARN  (qtp1049384214-1081) [n:127.0.0.1:45586_solr c:test_col s:shard5  x:test_col_shard5_replica2] o.a.s.c.Config Beginning with Solr 5.5, <mergePolicy> is deprecated, use <mergePolicyFactory> instead.
   [junit4]   2> 222746 WARN  (qtp706866116-1113) [n:127.0.0.1:38570_solr c:test_col s:shard5  x:test_col_shard5_replica1] o.a.s.c.Config Beginning with Solr 5.5, <mergePolicy> is deprecated, use <mergePolicyFactory> instead.
   [junit4]   2> 222747 INFO  (zkCallback-179-thread-1-processing-n:127.0.0.1:38570_solr) [n:127.0.0.1:38570_solr    ] o.a.s.c.c.ZkStateReader A cluster state change: [WatchedEvent state:SyncConnected type:NodeDataChanged path:/collections/test_col/state.json] for collection [test_col] has occurred - updating... (live nodes size: [10])
   [junit4]   2> 222747 INFO  (zkCallback-185-thread-1-processing-n:127.0.0.1:48460_solr) [n:127.0.0.1:48460_solr    ] o.a.s.c.c.ZkStateReader A cluster state change: [WatchedEvent state:SyncConnected type:NodeDataChanged path:/collections/test_col/state.json] for collection [test_col] has occurred - updating... (live nodes size: [10])
   [junit4]   2> 222747 INFO  (zkCallback-175-thread-1-processing-n:127.0.0.1:47514_solr) [n:127.0.0.1:47514_solr    ] o.a.s.c.c.ZkStateReader A cluster state change: [WatchedEvent state:SyncConnected type:NodeDataChanged path:/collections/test_col/state.json] for collection [test_col] has occurred - updating... (live nodes size: [10])
   [junit4]   2> 222747 INFO  (qtp706866116-1113) [n:127.0.0.1:38570_solr c:test_col s:shard5  x:test_col_shard5_replica1] o.a.s.c.SolrConfig Using Lucene MatchVersion: 6.6.0
   [junit4]   2> 222747 INFO  (zkCallback-151-thread-1-processing-n:127.0.0.1:52915_solr) [n:127.0.0.1:52915_solr    ] o.a.s.c.c.ZkStateReader A cluster state change: [WatchedEvent state:SyncConnected type:NodeDataChanged path:/collections/test_col/state.json] for collection [test_col] has occurred - updating... (live nodes size: [10])
   [junit4]   2> 222747 INFO  (zkCallback-186-thread-1-processing-n:127.0.0.1:47127_solr) [n:127.0.0.1:47127_solr    ] o.a.s.c.c.ZkStateReader A cluster state change: [WatchedEvent state:SyncConnected type:NodeDataChanged path:/collections/test_col/state.json] for collection [test_col] has occurred - updating... (live nodes size: [10])
   [junit4]   2> 222747 INFO  (zkCallback-178-thread-1-processing-n:127.0.0.1:52802_solr) [n:127.0.0.1:52802_solr    ] o.a.s.c.c.ZkStateReader A cluster state change: [WatchedEvent state:SyncConnected type:NodeDataChanged path:/collections/test_col/state.json] for collection [test_col] has occurred - updating... (live nodes size: [10])
   [junit4]   2> 222747 INFO  (zkCallback-184-thread-1-processing-n:127.0.0.1:33833_solr) [n:127.0.0.1:33833_solr    ] o.a.s.c.c.ZkStateReader A cluster state change: [WatchedEvent state:SyncConnected type:NodeDataChanged path:/collections/test_col/state.json] for collection [test_col] has occurred - updating... (live nodes size: [10])
   [junit4]   2> 222748 INFO  (zkCallback-164-thread-1-processing-n:127.0.0.1:56745_solr) [n:127.0.0.1:56745_solr    ] o.a.s.c.c.ZkStateReader A cluster state change: [WatchedEvent state:SyncConnected type:NodeDataChanged path:/collections/test_col/state.json] for collection [test_col] has occurred - updating... (live nodes size: [10])
   [junit4]   2> 222748 INFO  (qtp1049384214-1081) [n:127.0.0.1:45586_solr c:test_col s:shard5  x:test_col_shard5_replica2] o.a.s.c.SolrConfig Using Lucene MatchVersion: 6.6.0
   [junit4]   2> 222748 INFO  (zkCallback-180-thread-1-processing-n:127.0.0.1:45586_solr) [n:127.0.0.1:45586_solr    ] o.a.s.c.c.ZkStateReader A cluster state change: [WatchedEvent state:SyncConnected type:NodeDataChanged path:/collections/test_col/state.json] for collection [test_col] has occurred - updating... (live nodes size: [10])
   [junit4]   2> 222776 INFO  (zkCallback-163-thread-1-processing-n:127.0.0.1:52051_solr) [n:127.0.0.1:52051_solr    ] o.a.s.c.c.ZkStateReader A cluster state change: [WatchedEvent state:SyncConnected type:NodeDataChanged path:/collections/test_col/state.json] for collection [test_col] has occurred - updating... (live nodes size: [10])
   [junit4]   2> 222816 INFO  (qtp831900368-1063) [n:127.0.0.1:48460_solr c:test_col s:shard4  x:test_col_shard4_replica2] o.a.s.s.IndexSchema [test_col_shard4_replica2] Schema name=minimal-atomic-stress
   [junit4]   2> 222819 INFO  (qtp831900368-1063) [n:127.0.0.1:48460_solr c:test_col s:shard4  x:test_col_shard4_replica2] o.a.s.s.IndexSchema Loaded schema minimal-atomic-stress/1.6 with uniqueid field id
   [junit4]   2> 222819 INFO  (qtp831900368-1063) [n:127.0.0.1:48460_solr c:test_col s:shard4  x:test_col_shard4_replica2] o.a.s.c.CoreContainer Creating SolrCore 'test_col_shard4_replica2' using configuration from collection test_col, trusted=true
   [junit4]   2> 222819 INFO  (qtp831900368-1063) [n:127.0.0.1:48460_solr c:test_col s:shard4  x:test_col_shard4_replica2] o.a.s.c.SolrCore solr.RecoveryStrategy.Builder
   [junit4]   2> 222819 WARN  (qtp2110216741-1072) [n:127.0.0.1:52051_solr c:test_col s:shard3  x:test_col_shard3_replica2] o.a.s.c.Config Beginning with Solr 5.5, <mergePolicy> is deprecated, use <mergePolicyFactory> instead.
   [junit4]   2> 222819 INFO  (qtp831900368-1063) [n:127.0.0.1:48460_solr c:test_col s:shard4  x:test_col_shard4_replica2] o.a.s.c.SolrCore [[test_col_shard4_replica2] ] Opening new SolrCore at [/x1/jenkins/jenkins-slave/workspace/Lucene-Solr-NightlyTests-6.x/checkout/solr/build/solr-core/test/J0/temp/solr.cloud.TestStressCloudBlindAtomicUpdates_D8ECC85A49A09819-001/tempDir-001/node3/test_col_shard4_replica2], dataDir=[/x1/jenkins/jenkins-slave/workspace/Lucene-Solr-NightlyTests-6.x/checkout/solr/build/solr-core/test/J0/temp/solr.cloud.TestStressCloudBlindAtomicUpdates_D8ECC85A49A09819-001/tempDir-001/node3/./test_col_shard4_replica2/data/]
   [junit4]   2> 222820 INFO  (qtp831900368-1063) [n:127.0.0.1:48460_solr c:test_col s:shard4  x:test_col_shard4_replica2] o.a.s.c.JmxMonitoredMap JMX monitoring is enabled. Adding Solr mbeans to JMX Server: com.sun.jmx.mbeanserver.JmxMBeanServer@39b340be
   [junit4]   2> 222820 INFO  (qtp2110216741-1072) [n:127.0.0.1:52051_solr c:test_col s:shard3  x:test_col_shard3_replica2] o.a.s.c.SolrConfig Using Lucene MatchVersion: 6.6.0
   [junit4]   2> 222822 INFO  (qtp831900368-1063) [n:127.0.0.1:48460_solr c:test_col s:shard4  x:test_col_shard4_replica2] o.a.s.u.RandomMergePolicy RandomMergePolicy wrapping class org.apache.lucene.index.LogDocMergePolicy: [LogDocMergePolicy: minMergeSize=1000, mergeFactor=43, maxMergeSize=9223372036854775807, maxMergeSizeForForcedMerge=9223372036854775807, calibrateSizeByDeletes=true, maxMergeDocs=2147483647, maxCFSSegmentSizeMB=8.796093022207999E12, noCFSRatio=0.3421058346006094]
   [junit4]   2> 222840 WARN  (qtp1422543124-1136) [n:127.0.0.1:47127_solr c:test_col s:shard2  x:test_col_shard2_replica2] o.a.s.c.Config Beginning with Solr 5.5, <mergePolicy> is deprecated, use <mergePolicyFactory> instead.
   [junit4]   2> 222848 INFO  (qtp1422543124-1136) [n:127.0.0.1:47127_solr c:test_col s:shard2  x:test_col_shard2_replica2] o.a.s.c.SolrConfig Using Lucene MatchVersion: 6.6.0
   [junit4]   2> 222855 WARN  (qtp449245556-1036) [n:127.0.0.1:47514_solr c:test_col s:shard1  x:test_col_shard1_replica1] o.a.s.c.Config Beginning with Solr 5.5, <mergePolicy> is deprecated, use <mergePolicyFactory> instead.
   [junit4]   2> 222856 INFO  (qtp449245556-1036) [n:127.0.0.1:47514_solr c:test_col s:shard1  x:test_col_shard1_replica1] o.a.s.c.SolrConfig Using Lucene MatchVersion: 6.6.0
   [junit4]   2> 222857 WARN  (qtp1290485782-1094) [n:127.0.0.1:33833_solr c:test_col s:shard1  x:test_col_shard1_replica2] o.a.s.c.Config Beginning with Solr 5.5, <mergePolicy> is deprecated, use <mergePolicyFactory> instead.
   [junit4]   2> 222858 INFO  (qtp1290485782-1094) [n:127.0.0.1:33833_solr c:test_col s:shard1  x:test_col_shard1_replica2] o.a.s.c.SolrConfig Using Lucene MatchVersion: 6.6.0
   [junit4]   2> 222861 INFO  (qtp1049384214-1081) [n:127.0.0.1:45586_solr c:test_col s:shard5  x:test_col_shard5_replica2] o.a.s.s.IndexSchema [test_col_shard5_replica2] Schema name=minimal-atomic-stress
   [junit4]   2> 222862 WARN  (qtp1770381887-1059) [n:127.0.0.1:56745_solr c:test_col s:shard3  x:test_col_shard3_replica1] o.a.s.c.Config Beginning with Solr 5.5, <mergePolicy> is deprecated, use <mergePolicyFactory> instead.
   [junit4]   2> 222869 WARN  (qtp104331158-1105) [n:127.0.0.1:52802_solr c:test_col s:shard2  x:test_col_shard2_replica1] o.a.s.c.Config Beginning with Solr 5.5, <mergePolicy> is deprecated, use <mergePolicyFactory> instead.
   [junit4]   2> 222870 INFO  (qtp104331158-1105) [n:127.0.0.1:52802_solr c:test_col s:shard2  x:test_col_shard2_replica1] o.a.s.c.SolrConfig Using Lucene MatchVersion: 6.6.0
   [junit4]   2> 222903 INFO  (qtp1770381887-1059) [n:127.0.0.1:56745_solr c:test_col s:shard3  x:test_col_shard3_replica1] o.a.s.c.SolrConfig Using Lucene MatchVersion: 6.6.0
   [junit4]   2> 222903 WARN  (qtp831900368-1063) [n:127.0.0.1:48460_solr c:test_col s:shard4  x:test_col_shard4_replica2] o.a.s.c.RequestHandlers INVALID paramSet a in requestHandler {type = requestHandler,name = /dump,class = DumpRequestHandler,attributes = {initParams=a, name=/dump, class=DumpRequestHandler},args = {defaults={a=A,b=B}}}
   [junit4]   2> 222933 INFO  (qtp706866116-1113) [n:127.0.0.1:38570_solr c:test_col s:shard5  x:test_col_shard5_replica1] o.a.s.s.IndexSchema [test_col_shard5_replica1] Schema name=minimal-atomic-stress
   [junit4]   2> 222940 INFO  (qtp1049384214-1081) [n:127.0.0.1:45586_solr c:test_col s:shard5  x:test_col_shard5_replica2] o.a.s.s.IndexSchema Loaded schema minimal-atomic-stress/1.6 with uniqueid field id
   [junit4]   2> 222940 INFO  (qtp1049384214-1081) [n:127.0.0.1:45586_solr c:test_col s:shard5  x:test_col_shard5_replica2] o.a.s.c.CoreContainer Creating SolrCore 'test_col_shard5_replica2' using configuration from collection test_col, trusted=true
   [junit4]   2> 222940 INFO  (qtp1049384214-1081) [n:127.0.0.1:45586_solr c:test_col s:shard5  x:test_col_shard5_replica2] o.a.s.c.SolrCore solr.RecoveryStrategy.Builder
   [junit4]   2> 222940 INFO  (qtp1049384214-1081) [n:127.0.0.1:45586_solr c:test_col s:shard5  x:test_col_shard5_replica2] o.a.s.c.SolrCore [[test_col_shard5_replica2] ] Opening new SolrCore at [/x1/jenkins/jenkins-slave/workspace/Lucene-Solr-NightlyTests-6.x/checkout/solr/build/solr-core/test/J0/temp/solr.cloud.TestStressCloudBlindAtomicUpdates_D8ECC85A49A09819-001/tempDir-001/node1/test_col_shard5_replica2], dataDir=[/x1/jenkins/jenkins-slave/workspace/Lucene-Solr-NightlyTests-6.x/checkout/solr/build/solr-core/test/J0/temp/solr.cloud.TestStressCloudBlindAtomicUpdates_D8ECC85A49A09819-001/tempDir-001/node1/./test_col_shard5_replica2/data/]
   [junit4]   2> 222941 INFO  (qtp1049384214-1081) [n:127.0.0.1:45586_solr c:test_col s:shard5  x:test_col_shard5_replica2] o.a.s.c.JmxMonitoredMap JMX monitoring is enabled. Adding Solr mbeans to JMX Server: com.sun.jmx.mbeanserver.JmxMBeanServer@39b340be
   [junit4]   2> 222947 INFO  (qtp706866116-1113) [n:127.0.0.1:38570_solr c:test_col s:shard5  x:test_col_shard5_replica1] o.a.s.s.IndexSchema Loaded schema minimal-atomic-stress/1.6 with uniqueid field id
   [junit4]   2> 222947 INFO  (qtp706866116-1113) [n:127.0.0.1:38570_solr c:test_col s:shard5  x:test_col_shard5_replica1] o.a.s.c.CoreContainer Creating SolrCore 'test_col_shard5_replica1' using configuration from collection test_col, trusted=true
   [junit4]   2> 222947 INFO  (qtp706866116-1113) [n:127.0.0.1:38570_solr c:test_col s:shard5  x:test_col_shard5_replica1] o.a.s.c.SolrCore solr.RecoveryStrategy.Builder
   [junit4]   2> 222947 INFO  (qtp706866116-1113) [n:127.0.0.1:38570_solr c:test_col s:shard5  x:test_col_shard5_replica1] o.a.s.c.SolrCore [[test_col_shard5_replica1] ] Opening new SolrCore at [/x1/jenkins/jenkins-slave/workspace/Lucene-Solr-NightlyTests-6.x/checkout/solr/build/solr-core/test/J0/temp/solr.cloud.TestStressCloudBlindAtomicUpdates_D8ECC85A49A09819-001/tempDir-001/node7/test_col_shard5_replica1], dataDir=[/x1/jenkins/jenkins-slave/workspace/Lucene-Solr-NightlyTests-6.x/checkout/solr/build/solr-core/test/J0/temp/solr.cloud.TestStressCloudBlindAtomicUpdates_D8ECC85A49A09819-001/tempDir-001/node7/./test_col_shard5_replica1/data/]
   [junit4]   2> 222948 INFO  (qtp706866116-1113) [n:127.0.0.1:38570_solr c:test_col s:shard5  x:test_col_shard5_replica1] o.a.s.c.JmxMonitoredMap JMX monitoring is enabled. Adding Solr mbeans to JMX Server: com.sun.jmx.mbeanserver.JmxMBeanServer@39b340be
   [junit4]   2> 222949 INFO  (qtp1049384214-1081) [n:127.0.0.1:45586_solr c:test_col s:shard5  x:test_col_shard5_replica2] o.a.s.u.RandomMergePolicy RandomMergePolicy wrapping class org.apache.lucene.index.LogDocMergePolicy: [LogDocMergePolicy: minMergeSize=1000, mergeFactor=43, maxMergeSize=9223372036854775807, maxMer

[...truncated too long message...]

e shard and two replicas
   [junit4]    > null
   [junit4]    > Last available state: DocCollection(MissingSegmentRecoveryTest//collections/MissingSegmentRecoveryTest/state.json/7)={
   [junit4]    >   "replicationFactor":"2",
   [junit4]    >   "shards":{"shard1":{
   [junit4]    >       "range":"80000000-7fffffff",
   [junit4]    >       "state":"active",
   [junit4]    >       "replicas":{
   [junit4]    >         "core_node1":{
   [junit4]    >           "core":"MissingSegmentRecoveryTest_shard1_replica1",
   [junit4]    >           "base_url":"http://127.0.0.1:48702/solr",
   [junit4]    >           "node_name":"127.0.0.1:48702_solr",
   [junit4]    >           "state":"active",
   [junit4]    >           "leader":"true"},
   [junit4]    >         "core_node2":{
   [junit4]    >           "core":"MissingSegmentRecoveryTest_shard1_replica2",
   [junit4]    >           "base_url":"http://127.0.0.1:44887/solr",
   [junit4]    >           "node_name":"127.0.0.1:44887_solr",
   [junit4]    >           "state":"down"}}}},
   [junit4]    >   "router":{"name":"compositeId"},
   [junit4]    >   "maxShardsPerNode":"1",
   [junit4]    >   "autoAddReplicas":"false"}
   [junit4]    > 	at __randomizedtesting.SeedInfo.seed([D8ECC85A49A09819:88B9505910812E04]:0)
   [junit4]    > 	at org.apache.solr.cloud.SolrCloudTestCase.waitForState(SolrCloudTestCase.java:265)
   [junit4]    > 	at org.apache.solr.cloud.MissingSegmentRecoveryTest.testLeaderRecovery(MissingSegmentRecoveryTest.java:105)
   [junit4]    > 	at java.lang.Thread.run(Thread.java:745)
   [junit4]   2> 4371074 INFO  (jetty-closer-2312-thread-1) [    ] o.e.j.s.AbstractConnector Stopped ServerConnector@4fe78022{HTTP/1.1,[http/1.1]}{127.0.0.1:0}
   [junit4]   2> 4371079 INFO  (jetty-closer-2312-thread-1) [    ] o.a.s.c.CoreContainer Shutting down CoreContainer instance=238710497
   [junit4]   2> 4371102 INFO  (jetty-closer-2312-thread-1) [    ] o.a.s.c.Overseer Overseer (id=97824600616796166-127.0.0.1:48702_solr-n_0000000000) closing
   [junit4]   2> 4371102 INFO  (OverseerStateUpdate-97824600616796166-127.0.0.1:48702_solr-n_0000000000) [n:127.0.0.1:48702_solr    ] o.a.s.c.Overseer Overseer Loop exiting : 127.0.0.1:48702_solr
   [junit4]   2> 4371112 INFO  (zkCallback-2334-thread-3-processing-n:127.0.0.1:44887_solr) [n:127.0.0.1:44887_solr    ] o.a.s.c.c.ZkStateReader Updated live nodes from ZooKeeper... (2) -> (1)
   [junit4]   2> 4371131 INFO  (jetty-closer-2312-thread-2) [    ] o.e.j.s.AbstractConnector Stopped ServerConnector@60540db5{HTTP/1.1,[http/1.1]}{127.0.0.1:44887}
   [junit4]   2> 4371132 INFO  (jetty-closer-2312-thread-2) [    ] o.a.s.c.CoreContainer Shutting down CoreContainer instance=59114691
   [junit4]   2> 4371138 INFO  (zkCallback-2334-thread-4-processing-n:127.0.0.1:44887_solr) [n:127.0.0.1:44887_solr    ] o.a.s.c.OverseerElectionContext I am going to be the leader 127.0.0.1:44887_solr
   [junit4]   2> 4372612 WARN  (zkCallback-2322-thread-2-processing-n:127.0.0.1:48702_solr) [n:127.0.0.1:48702_solr    ] o.a.s.c.c.ZkStateReader ZooKeeper watch triggered, but Solr cannot talk to ZK: [KeeperErrorCode = Session expired for /live_nodes]
   [junit4]   2> 4372613 INFO  (jetty-closer-2312-thread-1) [    ] o.a.s.m.SolrMetricManager Closing metric reporters for: solr.node
   [junit4]   2> 4372613 INFO  (jetty-closer-2312-thread-1) [    ] o.e.j.s.h.ContextHandler Stopped o.e.j.s.ServletContextHandler@9a419e4{/solr,null,UNAVAILABLE}
   [junit4]   2> 4372647 WARN  (zkCallback-2334-thread-3-processing-n:127.0.0.1:44887_solr) [n:127.0.0.1:44887_solr    ] o.a.s.c.c.ZkStateReader ZooKeeper watch triggered, but Solr cannot talk to ZK: [KeeperErrorCode = Session expired for /live_nodes]
   [junit4]   2> 4372648 INFO  (jetty-closer-2312-thread-2) [    ] o.a.s.m.SolrMetricManager Closing metric reporters for: solr.node
   [junit4]   2> 4372648 INFO  (jetty-closer-2312-thread-2) [    ] o.e.j.s.h.ContextHandler Stopped o.e.j.s.ServletContextHandler@21fde1d3{/solr,null,UNAVAILABLE}
   [junit4]   2> 4372649 INFO  (SUITE-MissingSegmentRecoveryTest-seed#[D8ECC85A49A09819]-worker) [    ] o.a.s.c.ZkTestServer connecting to 127.0.0.1:34930 34930
   [junit4]   2> 4372885 INFO  (Thread-55448) [    ] o.a.s.c.ZkTestServer connecting to 127.0.0.1:34930 34930
   [junit4]   2> 4372886 WARN  (Thread-55448) [    ] o.a.s.c.ZkTestServer Watch limit violations: 
   [junit4]   2> Maximum concurrent create/delete watches above limit:
   [junit4]   2> 
   [junit4]   2> 	4	/solr/aliases.json
   [junit4]   2> 	4	/solr/clusterprops.json
   [junit4]   2> 	3	/solr/security.json
   [junit4]   2> 	2	/solr/configs/conf
   [junit4]   2> 
   [junit4]   2> Maximum concurrent data watches above limit:
   [junit4]   2> 
   [junit4]   2> 	4	/solr/clusterstate.json
   [junit4]   2> 	4	/solr/collections/MissingSegmentRecoveryTest/state.json
   [junit4]   2> 	2	/solr/overseer_elect/election/97824600616796166-127.0.0.1:48702_solr-n_0000000000
   [junit4]   2> 
   [junit4]   2> Maximum concurrent children watches above limit:
   [junit4]   2> 
   [junit4]   2> 	4	/solr/collections
   [junit4]   2> 	3	/solr/live_nodes
   [junit4]   2> 
   [junit4]   2> 4372887 INFO  (SUITE-MissingSegmentRecoveryTest-seed#[D8ECC85A49A09819]-worker) [    ] o.a.s.SolrTestCaseJ4 ###deleteCore
   [junit4]   2> NOTE: leaving temporary files on disk at: /x1/jenkins/jenkins-slave/workspace/Lucene-Solr-NightlyTests-6.x/checkout/solr/build/solr-core/test/J0/temp/solr.cloud.MissingSegmentRecoveryTest_D8ECC85A49A09819-001
   [junit4]   2> Apr 20, 2017 10:44:09 AM com.carrotsearch.randomizedtesting.ThreadLeakControl checkThreadLeaks
   [junit4]   2> WARNING: Will linger awaiting termination of 1 leaked thread(s).
   [junit4]   2> NOTE: test params are: codec=Asserting(Lucene62): {_version_=BlockTreeOrds(blocksize=128), id=Lucene50(blocksize=128)}, docValues:{}, maxPointsInLeafNode=1188, maxMBSortInHeap=7.508381859231751, sim=RandomSimilarity(queryNorm=false,coord=yes): {}, locale=de-LU, timezone=Asia/Ulaanbaatar
   [junit4]   2> NOTE: Linux 3.13.0-85-generic amd64/Oracle Corporation 1.8.0_121 (64-bit)/cpus=4,threads=1,free=282479624,total=527433728
   [junit4]   2> NOTE: All tests run in this JVM: [SolrCoreTest, TestAuthenticationFramework, OverseerCollectionConfigSetProcessorTest, SSLMigrationTest, TestPseudoReturnFields, TestFastLRUCache, TestRandomRequestDistribution, ExplicitHLLTest, CustomCollectionTest, TestSolr4Spatial, TestStressCloudBlindAtomicUpdates, TestManagedResourceStorage, TestFilteredDocIdSet, OutputWriterTest, TestAddFieldRealTimeGet, TestFieldCacheSortRandom, AlternateDirectoryTest, ResponseHeaderTest, TestComponentsName, ZkNodePropsTest, SolrMetricManagerTest, DistribJoinFromCollectionTest, TestShardHandlerFactory, DistributedQueryElevationComponentTest, TestExpandComponent, NotRequiredUniqueKeyTest, TriLevelCompositeIdRoutingTest, RuleEngineTest, TestManagedSchema, MBeansHandlerTest, TestPerFieldSimilarity, TestClusterProperties, BasicZkTest, ExternalFileFieldSortTest, CollectionsAPIAsyncDistributedZkTest, HdfsCollectionsAPIDistributedZkTest, DocValuesNotIndexedTest, FileBasedSpellCheckerTest, StandardRequestHandlerTest, BaseCdcrDistributedZkTest, TestMultiWordSynonyms, LeaderElectionContextKeyTest, TestSolrCLIRunExample, PKIAuthenticationIntegrationTest, TestExclusionRuleCollectionAccess, NodeMutatorTest, MergeStrategyTest, CloudMLTQParserTest, TestSortByMinMaxFunction, TestDFISimilarityFactory, ReplicaListTransformerTest, TestScoreJoinQPNoScore, TestJettySolrRunner, TestPointFields, SolrSlf4jReporterTest, StatsReloadRaceTest, TestJmxIntegration, CollectionReloadTest, TestConfigsApi, ReturnFieldsTest, TestDeleteCollectionOnDownNodes, TestDocumentBuilder, TestStressLucene, TestGeoJSONResponseWriter, TestFreeTextSuggestions, TestFoldingMultitermQuery, DistributedExpandComponentTest, ResourceLoaderTest, TestDistributedSearch, TestCodecSupport, TestQueryWrapperFilter, TestConfigSets, SyncSliceTest, CoreMergeIndexesAdminHandlerTest, TestCrossCoreJoin, FastVectorHighlighterTest, SharedFSAutoReplicaFailoverTest, TestConfigSetsAPIExclusivity, TestAtomicUpdateErrorCases, HdfsDirectoryFactoryTest, CdcrUpdateLogTest, TestSegmentSorting, TestRealTimeGet, TestMacros, DefaultValueUpdateProcessorTest, TestInitQParser, TestBadConfig, CacheHeaderTest, OverseerStatusTest, TestPathTrie, JsonValidatorTest, TestHdfsUpdateLog, SolrRequestParserTest, TestIBSimilarityFactory, SignatureUpdateProcessorFactoryTest, TestLRUStatsCache, AliasIntegrationTest, TestDocSet, TestCloudPivotFacet, TestOmitPositions, CurrencyFieldOpenExchangeTest, AnalyticsQueryTest, SynonymTokenizerTest, TestRangeQuery, ChangedSchemaMergeTest, DateFieldTest, QueryElevationComponentTest, TolerantUpdateProcessorTest, TestClassNameShortening, BlockDirectoryTest, RegexBoostProcessorTest, BasicDistributedZkTest, BasicDistributedZk2Test, CollectionsAPIDistributedZkTest, OverseerTest, LeaderElectionIntegrationTest, ShardRoutingTest, FullSolrCloudDistribCmdsTest, ShardRoutingCustomTest, TestDistributedGrouping, TestFaceting, TestHashPartitioner, TermVectorComponentDistributedTest, TestJoin, BadIndexSchemaTest, ConvertedLegacyTest, TestFiltering, DirectUpdateHandlerTest, CurrencyFieldXmlFileTest, SimplePostToolTest, AnalysisAfterCoreReloadTest, TestExtendedDismaxParser, DocValuesTest, DocValuesMultiTest, TestSolrDeletionPolicy1, TestSurroundQueryParser, DisMaxRequestHandlerTest, TestQueryUtils, DocumentAnalysisRequestHandlerTest, TestQueryTypes, XmlUpdateRequestHandlerTest, RequestHandlersTest, DocumentBuilderTest, TermVectorComponentTest, MoreLikeThisHandlerTest, FieldAnalysisRequestHandlerTest, TestCollationField, UniqFieldsUpdateProcessorFactoryTest, TestPHPSerializedResponseWriter, CSVRequestHandlerTest, TestBinaryResponseWriter, TestLFUCache, DeleteShardTest, DistributedVersionInfoTest, LeaderInitiatedRecoveryOnShardRestartTest, MissingSegmentRecoveryTest]
   [junit4] Completed [512/704 (2!)] on J0 in 104.14s, 1 test, 1 failure <<< FAILURES!

[...truncated 43988 lines...]

Mime
View raw message