lucene-dev mailing list archives

Site index · List index
Message view « Date » · « Thread »
Top « Date » · « Thread »
From Policeman Jenkins Server <jenk...@thetaphi.de>
Subject [JENKINS] Lucene-Solr-6.x-Windows (64bit/jdk1.8.0_121) - Build # 846 - Unstable!
Date Thu, 20 Apr 2017 04:17:35 GMT
Build: https://jenkins.thetaphi.de/job/Lucene-Solr-6.x-Windows/846/
Java: 64bit/jdk1.8.0_121 -XX:+UseCompressedOops -XX:+UseParallelGC

1 tests failed.
FAILED:  org.apache.solr.cloud.MissingSegmentRecoveryTest.testLeaderRecovery

Error Message:
Expected a collection with one shard and two replicas null Last available state: DocCollection(MissingSegmentRecoveryTest//collections/MissingSegmentRecoveryTest/state.json/7)={   "replicationFactor":"2",   "shards":{"shard1":{       "range":"80000000-7fffffff",       "state":"active",       "replicas":{         "core_node1":{           "core":"MissingSegmentRecoveryTest_shard1_replica1",           "base_url":"http://127.0.0.1:56955/solr",           "node_name":"127.0.0.1:56955_solr",           "state":"active",           "leader":"true"},         "core_node2":{           "core":"MissingSegmentRecoveryTest_shard1_replica2",           "base_url":"http://127.0.0.1:56954/solr",           "node_name":"127.0.0.1:56954_solr",           "state":"down"}}}},   "router":{"name":"compositeId"},   "maxShardsPerNode":"1",   "autoAddReplicas":"false"}

Stack Trace:
java.lang.AssertionError: Expected a collection with one shard and two replicas
null
Last available state: DocCollection(MissingSegmentRecoveryTest//collections/MissingSegmentRecoveryTest/state.json/7)={
  "replicationFactor":"2",
  "shards":{"shard1":{
      "range":"80000000-7fffffff",
      "state":"active",
      "replicas":{
        "core_node1":{
          "core":"MissingSegmentRecoveryTest_shard1_replica1",
          "base_url":"http://127.0.0.1:56955/solr",
          "node_name":"127.0.0.1:56955_solr",
          "state":"active",
          "leader":"true"},
        "core_node2":{
          "core":"MissingSegmentRecoveryTest_shard1_replica2",
          "base_url":"http://127.0.0.1:56954/solr",
          "node_name":"127.0.0.1:56954_solr",
          "state":"down"}}}},
  "router":{"name":"compositeId"},
  "maxShardsPerNode":"1",
  "autoAddReplicas":"false"}
	at __randomizedtesting.SeedInfo.seed([6C6CDF7F09088FC0:3C39477C502939DD]:0)
	at org.junit.Assert.fail(Assert.java:93)
	at org.apache.solr.cloud.SolrCloudTestCase.waitForState(SolrCloudTestCase.java:265)
	at org.apache.solr.cloud.MissingSegmentRecoveryTest.testLeaderRecovery(MissingSegmentRecoveryTest.java:105)
	at sun.reflect.NativeMethodAccessorImpl.invoke0(Native Method)
	at sun.reflect.NativeMethodAccessorImpl.invoke(NativeMethodAccessorImpl.java:62)
	at sun.reflect.DelegatingMethodAccessorImpl.invoke(DelegatingMethodAccessorImpl.java:43)
	at java.lang.reflect.Method.invoke(Method.java:498)
	at com.carrotsearch.randomizedtesting.RandomizedRunner.invoke(RandomizedRunner.java:1713)
	at com.carrotsearch.randomizedtesting.RandomizedRunner$8.evaluate(RandomizedRunner.java:907)
	at com.carrotsearch.randomizedtesting.RandomizedRunner$9.evaluate(RandomizedRunner.java:943)
	at com.carrotsearch.randomizedtesting.RandomizedRunner$10.evaluate(RandomizedRunner.java:957)
	at com.carrotsearch.randomizedtesting.rules.SystemPropertiesRestoreRule$1.evaluate(SystemPropertiesRestoreRule.java:57)
	at org.apache.lucene.util.TestRuleSetupTeardownChained$1.evaluate(TestRuleSetupTeardownChained.java:49)
	at org.apache.lucene.util.AbstractBeforeAfterRule$1.evaluate(AbstractBeforeAfterRule.java:45)
	at org.apache.lucene.util.TestRuleThreadAndTestName$1.evaluate(TestRuleThreadAndTestName.java:48)
	at org.apache.lucene.util.TestRuleIgnoreAfterMaxFailures$1.evaluate(TestRuleIgnoreAfterMaxFailures.java:64)
	at org.apache.lucene.util.TestRuleMarkFailure$1.evaluate(TestRuleMarkFailure.java:47)
	at com.carrotsearch.randomizedtesting.rules.StatementAdapter.evaluate(StatementAdapter.java:36)
	at com.carrotsearch.randomizedtesting.ThreadLeakControl$StatementRunner.run(ThreadLeakControl.java:368)
	at com.carrotsearch.randomizedtesting.ThreadLeakControl.forkTimeoutingTask(ThreadLeakControl.java:817)
	at com.carrotsearch.randomizedtesting.ThreadLeakControl$3.evaluate(ThreadLeakControl.java:468)
	at com.carrotsearch.randomizedtesting.RandomizedRunner.runSingleTest(RandomizedRunner.java:916)
	at com.carrotsearch.randomizedtesting.RandomizedRunner$5.evaluate(RandomizedRunner.java:802)
	at com.carrotsearch.randomizedtesting.RandomizedRunner$6.evaluate(RandomizedRunner.java:852)
	at com.carrotsearch.randomizedtesting.RandomizedRunner$7.evaluate(RandomizedRunner.java:863)
	at com.carrotsearch.randomizedtesting.rules.StatementAdapter.evaluate(StatementAdapter.java:36)
	at com.carrotsearch.randomizedtesting.rules.SystemPropertiesRestoreRule$1.evaluate(SystemPropertiesRestoreRule.java:57)
	at org.apache.lucene.util.AbstractBeforeAfterRule$1.evaluate(AbstractBeforeAfterRule.java:45)
	at com.carrotsearch.randomizedtesting.rules.StatementAdapter.evaluate(StatementAdapter.java:36)
	at org.apache.lucene.util.TestRuleStoreClassName$1.evaluate(TestRuleStoreClassName.java:41)
	at com.carrotsearch.randomizedtesting.rules.NoShadowingOrOverridesOnMethodsRule$1.evaluate(NoShadowingOrOverridesOnMethodsRule.java:40)
	at com.carrotsearch.randomizedtesting.rules.NoShadowingOrOverridesOnMethodsRule$1.evaluate(NoShadowingOrOverridesOnMethodsRule.java:40)
	at com.carrotsearch.randomizedtesting.rules.StatementAdapter.evaluate(StatementAdapter.java:36)
	at com.carrotsearch.randomizedtesting.rules.StatementAdapter.evaluate(StatementAdapter.java:36)
	at com.carrotsearch.randomizedtesting.rules.StatementAdapter.evaluate(StatementAdapter.java:36)
	at org.apache.lucene.util.TestRuleAssertionsRequired$1.evaluate(TestRuleAssertionsRequired.java:53)
	at org.apache.lucene.util.TestRuleMarkFailure$1.evaluate(TestRuleMarkFailure.java:47)
	at org.apache.lucene.util.TestRuleIgnoreAfterMaxFailures$1.evaluate(TestRuleIgnoreAfterMaxFailures.java:64)
	at org.apache.lucene.util.TestRuleIgnoreTestSuites$1.evaluate(TestRuleIgnoreTestSuites.java:54)
	at com.carrotsearch.randomizedtesting.rules.StatementAdapter.evaluate(StatementAdapter.java:36)
	at com.carrotsearch.randomizedtesting.ThreadLeakControl$StatementRunner.run(ThreadLeakControl.java:368)
	at java.lang.Thread.run(Thread.java:745)




Build Log:
[...truncated 11249 lines...]
   [junit4] Suite: org.apache.solr.cloud.MissingSegmentRecoveryTest
   [junit4]   2> Creating dataDir: C:\Users\jenkins\workspace\Lucene-Solr-6.x-Windows\solr\build\solr-core\test\J1\temp\solr.cloud.MissingSegmentRecoveryTest_6C6CDF7F09088FC0-001\init-core-data-001
   [junit4]   2> 344549 WARN  (SUITE-MissingSegmentRecoveryTest-seed#[6C6CDF7F09088FC0]-worker) [    ] o.a.s.SolrTestCaseJ4 startTrackingSearchers: numOpens=4 numCloses=4
   [junit4]   2> 344549 INFO  (SUITE-MissingSegmentRecoveryTest-seed#[6C6CDF7F09088FC0]-worker) [    ] o.a.s.SolrTestCaseJ4 Using PointFields
   [junit4]   2> 344554 INFO  (SUITE-MissingSegmentRecoveryTest-seed#[6C6CDF7F09088FC0]-worker) [    ] o.a.s.SolrTestCaseJ4 Randomized ssl (false) and clientAuth (false) via: @org.apache.solr.util.RandomizeSSL(reason=, value=NaN, ssl=NaN, clientAuth=NaN)
   [junit4]   2> 344556 INFO  (SUITE-MissingSegmentRecoveryTest-seed#[6C6CDF7F09088FC0]-worker) [    ] o.a.s.c.MiniSolrCloudCluster Starting cluster of 2 servers in C:\Users\jenkins\workspace\Lucene-Solr-6.x-Windows\solr\build\solr-core\test\J1\temp\solr.cloud.MissingSegmentRecoveryTest_6C6CDF7F09088FC0-001\tempDir-001
   [junit4]   2> 344556 INFO  (SUITE-MissingSegmentRecoveryTest-seed#[6C6CDF7F09088FC0]-worker) [    ] o.a.s.c.ZkTestServer STARTING ZK TEST SERVER
   [junit4]   2> 344556 INFO  (Thread-526) [    ] o.a.s.c.ZkTestServer client port:0.0.0.0/0.0.0.0:0
   [junit4]   2> 344556 INFO  (Thread-526) [    ] o.a.s.c.ZkTestServer Starting server
   [junit4]   2> 344656 INFO  (SUITE-MissingSegmentRecoveryTest-seed#[6C6CDF7F09088FC0]-worker) [    ] o.a.s.c.ZkTestServer start zk server on port:56950
   [junit4]   2> 344665 INFO  (jetty-launcher-332-thread-1) [    ] o.e.j.s.Server jetty-9.3.14.v20161028
   [junit4]   2> 344665 INFO  (jetty-launcher-332-thread-2) [    ] o.e.j.s.Server jetty-9.3.14.v20161028
   [junit4]   2> 344667 INFO  (jetty-launcher-332-thread-2) [    ] o.e.j.s.h.ContextHandler Started o.e.j.s.ServletContextHandler@45365ce{/solr,null,AVAILABLE}
   [junit4]   2> 344667 INFO  (jetty-launcher-332-thread-1) [    ] o.e.j.s.h.ContextHandler Started o.e.j.s.ServletContextHandler@3b256911{/solr,null,AVAILABLE}
   [junit4]   2> 344671 INFO  (jetty-launcher-332-thread-2) [    ] o.e.j.s.AbstractConnector Started ServerConnector@2a8b244{HTTP/1.1,[http/1.1]}{127.0.0.1:56954}
   [junit4]   2> 344671 INFO  (jetty-launcher-332-thread-2) [    ] o.e.j.s.Server Started @348714ms
   [junit4]   2> 344671 INFO  (jetty-launcher-332-thread-1) [    ] o.e.j.s.AbstractConnector Started ServerConnector@1fc51811{HTTP/1.1,[http/1.1]}{127.0.0.1:56955}
   [junit4]   2> 344671 INFO  (jetty-launcher-332-thread-2) [    ] o.a.s.c.s.e.JettySolrRunner Jetty properties: {hostContext=/solr, hostPort=56954}
   [junit4]   2> 344671 INFO  (jetty-launcher-332-thread-1) [    ] o.e.j.s.Server Started @348714ms
   [junit4]   2> 344671 INFO  (jetty-launcher-332-thread-1) [    ] o.a.s.c.s.e.JettySolrRunner Jetty properties: {hostContext=/solr, hostPort=56955}
   [junit4]   2> 344671 ERROR (jetty-launcher-332-thread-2) [    ] o.a.s.s.StartupLoggingUtils Missing Java Option solr.log.dir. Logging may be missing or incomplete.
   [junit4]   2> 344671 ERROR (jetty-launcher-332-thread-1) [    ] o.a.s.s.StartupLoggingUtils Missing Java Option solr.log.dir. Logging may be missing or incomplete.
   [junit4]   2> 344671 INFO  (jetty-launcher-332-thread-2) [    ] o.a.s.s.SolrDispatchFilter  ___      _       Welcome to Apache Solr™ version 6.6.0
   [junit4]   2> 344671 INFO  (jetty-launcher-332-thread-1) [    ] o.a.s.s.SolrDispatchFilter  ___      _       Welcome to Apache Solr™ version 6.6.0
   [junit4]   2> 344671 INFO  (jetty-launcher-332-thread-2) [    ] o.a.s.s.SolrDispatchFilter / __| ___| |_ _   Starting in cloud mode on port null
   [junit4]   2> 344671 INFO  (jetty-launcher-332-thread-1) [    ] o.a.s.s.SolrDispatchFilter / __| ___| |_ _   Starting in cloud mode on port null
   [junit4]   2> 344671 INFO  (jetty-launcher-332-thread-2) [    ] o.a.s.s.SolrDispatchFilter \__ \/ _ \ | '_|  Install dir: null
   [junit4]   2> 344671 INFO  (jetty-launcher-332-thread-1) [    ] o.a.s.s.SolrDispatchFilter \__ \/ _ \ | '_|  Install dir: null
   [junit4]   2> 344671 INFO  (jetty-launcher-332-thread-2) [    ] o.a.s.s.SolrDispatchFilter |___/\___/_|_|    Start time: 2017-04-20T03:10:23.773Z
   [junit4]   2> 344671 INFO  (jetty-launcher-332-thread-1) [    ] o.a.s.s.SolrDispatchFilter |___/\___/_|_|    Start time: 2017-04-20T03:10:23.773Z
   [junit4]   2> 344675 INFO  (jetty-launcher-332-thread-1) [    ] o.a.s.s.SolrDispatchFilter solr.xml found in ZooKeeper. Loading...
   [junit4]   2> 344675 INFO  (jetty-launcher-332-thread-2) [    ] o.a.s.s.SolrDispatchFilter solr.xml found in ZooKeeper. Loading...
   [junit4]   2> 344689 WARN  (NIOServerCxn.Factory:0.0.0.0/0.0.0.0:0) [    ] o.a.z.s.NIOServerCnxn caught end of stream exception
   [junit4]   2> EndOfStreamException: Unable to read additional data from client sessionid 0x15b8956dfae0002, likely client has closed socket
   [junit4]   2> 	at org.apache.zookeeper.server.NIOServerCnxn.doIO(NIOServerCnxn.java:228)
   [junit4]   2> 	at org.apache.zookeeper.server.NIOServerCnxnFactory.run(NIOServerCnxnFactory.java:208)
   [junit4]   2> 	at java.lang.Thread.run(Thread.java:745)
   [junit4]   2> 344691 INFO  (jetty-launcher-332-thread-2) [    ] o.a.s.u.UpdateShardHandler Creating UpdateShardHandler HTTP client with params: socketTimeout=340000&connTimeout=45000&retry=true
   [junit4]   2> 344692 INFO  (jetty-launcher-332-thread-1) [    ] o.a.s.u.UpdateShardHandler Creating UpdateShardHandler HTTP client with params: socketTimeout=340000&connTimeout=45000&retry=true
   [junit4]   2> 344692 INFO  (jetty-launcher-332-thread-2) [    ] o.a.s.c.ZkContainer Zookeeper client=127.0.0.1:56950/solr
   [junit4]   2> 344693 INFO  (jetty-launcher-332-thread-1) [    ] o.a.s.c.ZkContainer Zookeeper client=127.0.0.1:56950/solr
   [junit4]   2> 344754 INFO  (jetty-launcher-332-thread-2) [n:127.0.0.1:56954_solr    ] o.a.s.c.Overseer Overseer (id=null) closing
   [junit4]   2> 344754 INFO  (jetty-launcher-332-thread-1) [n:127.0.0.1:56955_solr    ] o.a.s.c.Overseer Overseer (id=null) closing
   [junit4]   2> 344755 INFO  (jetty-launcher-332-thread-2) [n:127.0.0.1:56954_solr    ] o.a.s.c.OverseerElectionContext I am going to be the leader 127.0.0.1:56954_solr
   [junit4]   2> 344756 INFO  (jetty-launcher-332-thread-1) [n:127.0.0.1:56955_solr    ] o.a.s.c.ZkController Register node as live in ZooKeeper:/live_nodes/127.0.0.1:56955_solr
   [junit4]   2> 344757 INFO  (jetty-launcher-332-thread-2) [n:127.0.0.1:56954_solr    ] o.a.s.c.Overseer Overseer (id=97822823131512837-127.0.0.1:56954_solr-n_0000000000) starting
   [junit4]   2> 344758 INFO  (zkCallback-343-thread-1-processing-n:127.0.0.1:56954_solr) [n:127.0.0.1:56954_solr    ] o.a.s.c.c.ZkStateReader Updated live nodes from ZooKeeper... (0) -> (1)
   [junit4]   2> 344759 INFO  (zkCallback-344-thread-1-processing-n:127.0.0.1:56955_solr) [n:127.0.0.1:56955_solr    ] o.a.s.c.c.ZkStateReader Updated live nodes from ZooKeeper... (0) -> (1)
   [junit4]   2> 344769 INFO  (jetty-launcher-332-thread-2) [n:127.0.0.1:56954_solr    ] o.a.s.c.ZkController Register node as live in ZooKeeper:/live_nodes/127.0.0.1:56954_solr
   [junit4]   2> 344816 INFO  (zkCallback-343-thread-1-processing-n:127.0.0.1:56954_solr) [n:127.0.0.1:56954_solr    ] o.a.s.c.c.ZkStateReader Updated live nodes from ZooKeeper... (1) -> (2)
   [junit4]   2> 344816 INFO  (zkCallback-344-thread-1-processing-n:127.0.0.1:56955_solr) [n:127.0.0.1:56955_solr    ] o.a.s.c.c.ZkStateReader Updated live nodes from ZooKeeper... (1) -> (2)
   [junit4]   2> 344920 INFO  (jetty-launcher-332-thread-2) [n:127.0.0.1:56954_solr    ] o.a.s.c.CorePropertiesLocator Found 0 core definitions underneath C:\Users\jenkins\workspace\Lucene-Solr-6.x-Windows\solr\build\solr-core\test\J1\temp\solr.cloud.MissingSegmentRecoveryTest_6C6CDF7F09088FC0-001\tempDir-001\node2\.
   [junit4]   2> 344933 INFO  (jetty-launcher-332-thread-1) [n:127.0.0.1:56955_solr    ] o.a.s.c.CorePropertiesLocator Found 0 core definitions underneath C:\Users\jenkins\workspace\Lucene-Solr-6.x-Windows\solr\build\solr-core\test\J1\temp\solr.cloud.MissingSegmentRecoveryTest_6C6CDF7F09088FC0-001\tempDir-001\node1\.
   [junit4]   2> 345048 INFO  (SUITE-MissingSegmentRecoveryTest-seed#[6C6CDF7F09088FC0]-worker) [    ] o.a.s.c.c.ZkStateReader Updated live nodes from ZooKeeper... (0) -> (2)
   [junit4]   2> 345049 INFO  (SUITE-MissingSegmentRecoveryTest-seed#[6C6CDF7F09088FC0]-worker) [    ] o.a.s.c.s.i.ZkClientClusterStateProvider Cluster at 127.0.0.1:56950/solr ready
   [junit4]   2> 345065 INFO  (TEST-MissingSegmentRecoveryTest.testLeaderRecovery-seed#[6C6CDF7F09088FC0]) [    ] o.a.s.SolrTestCaseJ4 ###Starting testLeaderRecovery
   [junit4]   2> 345073 INFO  (qtp1534658402-2305) [n:127.0.0.1:56955_solr    ] o.a.s.h.a.CollectionsHandler Invoked Collection Action :create with params replicationFactor=2&collection.configName=conf&maxShardsPerNode=1&name=MissingSegmentRecoveryTest&action=CREATE&numShards=1&wt=javabin&version=2 and sendToOCPQueue=true
   [junit4]   2> 345080 INFO  (OverseerThreadFactory-935-thread-1-processing-n:127.0.0.1:56954_solr) [n:127.0.0.1:56954_solr    ] o.a.s.c.CreateCollectionCmd Create collection MissingSegmentRecoveryTest
   [junit4]   2> 345190 INFO  (qtp1534658402-2306) [n:127.0.0.1:56955_solr    ] o.a.s.h.a.CoreAdminOperation core create command qt=/admin/cores&collection.configName=conf&newCollection=true&name=MissingSegmentRecoveryTest_shard1_replica1&action=CREATE&numShards=1&collection=MissingSegmentRecoveryTest&shard=shard1&wt=javabin&version=2
   [junit4]   2> 345190 INFO  (qtp1226228903-2309) [n:127.0.0.1:56954_solr    ] o.a.s.h.a.CoreAdminOperation core create command qt=/admin/cores&collection.configName=conf&newCollection=true&name=MissingSegmentRecoveryTest_shard1_replica2&action=CREATE&numShards=1&collection=MissingSegmentRecoveryTest&shard=shard1&wt=javabin&version=2
   [junit4]   2> 345191 INFO  (qtp1534658402-2306) [n:127.0.0.1:56955_solr    ] o.a.s.c.TransientSolrCoreCacheDefault Allocating transient cache for 2147483647 transient cores
   [junit4]   2> 345193 INFO  (qtp1226228903-2309) [n:127.0.0.1:56954_solr    ] o.a.s.c.TransientSolrCoreCacheDefault Allocating transient cache for 2147483647 transient cores
   [junit4]   2> 345299 INFO  (zkCallback-344-thread-1-processing-n:127.0.0.1:56955_solr) [n:127.0.0.1:56955_solr    ] o.a.s.c.c.ZkStateReader A cluster state change: [WatchedEvent state:SyncConnected type:NodeDataChanged path:/collections/MissingSegmentRecoveryTest/state.json] for collection [MissingSegmentRecoveryTest] has occurred - updating... (live nodes size: [2])
   [junit4]   2> 345299 INFO  (zkCallback-343-thread-1-processing-n:127.0.0.1:56954_solr) [n:127.0.0.1:56954_solr    ] o.a.s.c.c.ZkStateReader A cluster state change: [WatchedEvent state:SyncConnected type:NodeDataChanged path:/collections/MissingSegmentRecoveryTest/state.json] for collection [MissingSegmentRecoveryTest] has occurred - updating... (live nodes size: [2])
   [junit4]   2> 346217 INFO  (qtp1226228903-2309) [n:127.0.0.1:56954_solr c:MissingSegmentRecoveryTest s:shard1  x:MissingSegmentRecoveryTest_shard1_replica2] o.a.s.c.SolrConfig Using Lucene MatchVersion: 6.6.0
   [junit4]   2> 346217 INFO  (qtp1534658402-2306) [n:127.0.0.1:56955_solr c:MissingSegmentRecoveryTest s:shard1  x:MissingSegmentRecoveryTest_shard1_replica1] o.a.s.c.SolrConfig Using Lucene MatchVersion: 6.6.0
   [junit4]   2> 346225 INFO  (qtp1226228903-2309) [n:127.0.0.1:56954_solr c:MissingSegmentRecoveryTest s:shard1  x:MissingSegmentRecoveryTest_shard1_replica2] o.a.s.s.IndexSchema [MissingSegmentRecoveryTest_shard1_replica2] Schema name=minimal
   [junit4]   2> 346225 INFO  (qtp1534658402-2306) [n:127.0.0.1:56955_solr c:MissingSegmentRecoveryTest s:shard1  x:MissingSegmentRecoveryTest_shard1_replica1] o.a.s.s.IndexSchema [MissingSegmentRecoveryTest_shard1_replica1] Schema name=minimal
   [junit4]   2> 346235 INFO  (qtp1226228903-2309) [n:127.0.0.1:56954_solr c:MissingSegmentRecoveryTest s:shard1  x:MissingSegmentRecoveryTest_shard1_replica2] o.a.s.s.IndexSchema Loaded schema minimal/1.1 with uniqueid field id
   [junit4]   2> 346235 INFO  (qtp1534658402-2306) [n:127.0.0.1:56955_solr c:MissingSegmentRecoveryTest s:shard1  x:MissingSegmentRecoveryTest_shard1_replica1] o.a.s.s.IndexSchema Loaded schema minimal/1.1 with uniqueid field id
   [junit4]   2> 346235 INFO  (qtp1226228903-2309) [n:127.0.0.1:56954_solr c:MissingSegmentRecoveryTest s:shard1  x:MissingSegmentRecoveryTest_shard1_replica2] o.a.s.c.CoreContainer Creating SolrCore 'MissingSegmentRecoveryTest_shard1_replica2' using configuration from collection MissingSegmentRecoveryTest, trusted=true
   [junit4]   2> 346235 INFO  (qtp1534658402-2306) [n:127.0.0.1:56955_solr c:MissingSegmentRecoveryTest s:shard1  x:MissingSegmentRecoveryTest_shard1_replica1] o.a.s.c.CoreContainer Creating SolrCore 'MissingSegmentRecoveryTest_shard1_replica1' using configuration from collection MissingSegmentRecoveryTest, trusted=true
   [junit4]   2> 346235 INFO  (qtp1534658402-2306) [n:127.0.0.1:56955_solr c:MissingSegmentRecoveryTest s:shard1  x:MissingSegmentRecoveryTest_shard1_replica1] o.a.s.c.SolrCore solr.RecoveryStrategy.Builder
   [junit4]   2> 346235 INFO  (qtp1534658402-2306) [n:127.0.0.1:56955_solr c:MissingSegmentRecoveryTest s:shard1  x:MissingSegmentRecoveryTest_shard1_replica1] o.a.s.c.SolrCore [[MissingSegmentRecoveryTest_shard1_replica1] ] Opening new SolrCore at [C:\Users\jenkins\workspace\Lucene-Solr-6.x-Windows\solr\build\solr-core\test\J1\temp\solr.cloud.MissingSegmentRecoveryTest_6C6CDF7F09088FC0-001\tempDir-001\node1\MissingSegmentRecoveryTest_shard1_replica1], dataDir=[C:\Users\jenkins\workspace\Lucene-Solr-6.x-Windows\solr\build\solr-core\test\J1\temp\solr.cloud.MissingSegmentRecoveryTest_6C6CDF7F09088FC0-001\tempDir-001\node1\.\MissingSegmentRecoveryTest_shard1_replica1\data\]
   [junit4]   2> 346238 INFO  (qtp1226228903-2309) [n:127.0.0.1:56954_solr c:MissingSegmentRecoveryTest s:shard1  x:MissingSegmentRecoveryTest_shard1_replica2] o.a.s.c.SolrCore solr.RecoveryStrategy.Builder
   [junit4]   2> 346238 INFO  (qtp1226228903-2309) [n:127.0.0.1:56954_solr c:MissingSegmentRecoveryTest s:shard1  x:MissingSegmentRecoveryTest_shard1_replica2] o.a.s.c.SolrCore [[MissingSegmentRecoveryTest_shard1_replica2] ] Opening new SolrCore at [C:\Users\jenkins\workspace\Lucene-Solr-6.x-Windows\solr\build\solr-core\test\J1\temp\solr.cloud.MissingSegmentRecoveryTest_6C6CDF7F09088FC0-001\tempDir-001\node2\MissingSegmentRecoveryTest_shard1_replica2], dataDir=[C:\Users\jenkins\workspace\Lucene-Solr-6.x-Windows\solr\build\solr-core\test\J1\temp\solr.cloud.MissingSegmentRecoveryTest_6C6CDF7F09088FC0-001\tempDir-001\node2\.\MissingSegmentRecoveryTest_shard1_replica2\data\]
   [junit4]   2> 346388 INFO  (qtp1226228903-2309) [n:127.0.0.1:56954_solr c:MissingSegmentRecoveryTest s:shard1  x:MissingSegmentRecoveryTest_shard1_replica2] o.a.s.u.UpdateHandler Using UpdateLog implementation: org.apache.solr.update.UpdateLog
   [junit4]   2> 346388 INFO  (qtp1534658402-2306) [n:127.0.0.1:56955_solr c:MissingSegmentRecoveryTest s:shard1  x:MissingSegmentRecoveryTest_shard1_replica1] o.a.s.u.UpdateHandler Using UpdateLog implementation: org.apache.solr.update.UpdateLog
   [junit4]   2> 346388 INFO  (qtp1226228903-2309) [n:127.0.0.1:56954_solr c:MissingSegmentRecoveryTest s:shard1  x:MissingSegmentRecoveryTest_shard1_replica2] o.a.s.u.UpdateLog Initializing UpdateLog: dataDir=null defaultSyncLevel=FLUSH numRecordsToKeep=100 maxNumLogsToKeep=10 numVersionBuckets=65536
   [junit4]   2> 346388 INFO  (qtp1534658402-2306) [n:127.0.0.1:56955_solr c:MissingSegmentRecoveryTest s:shard1  x:MissingSegmentRecoveryTest_shard1_replica1] o.a.s.u.UpdateLog Initializing UpdateLog: dataDir=null defaultSyncLevel=FLUSH numRecordsToKeep=100 maxNumLogsToKeep=10 numVersionBuckets=65536
   [junit4]   2> 346390 INFO  (qtp1534658402-2306) [n:127.0.0.1:56955_solr c:MissingSegmentRecoveryTest s:shard1  x:MissingSegmentRecoveryTest_shard1_replica1] o.a.s.u.CommitTracker Hard AutoCommit: disabled
   [junit4]   2> 346390 INFO  (qtp1226228903-2309) [n:127.0.0.1:56954_solr c:MissingSegmentRecoveryTest s:shard1  x:MissingSegmentRecoveryTest_shard1_replica2] o.a.s.u.CommitTracker Hard AutoCommit: disabled
   [junit4]   2> 346390 INFO  (qtp1534658402-2306) [n:127.0.0.1:56955_solr c:MissingSegmentRecoveryTest s:shard1  x:MissingSegmentRecoveryTest_shard1_replica1] o.a.s.u.CommitTracker Soft AutoCommit: disabled
   [junit4]   2> 346390 INFO  (qtp1226228903-2309) [n:127.0.0.1:56954_solr c:MissingSegmentRecoveryTest s:shard1  x:MissingSegmentRecoveryTest_shard1_replica2] o.a.s.u.CommitTracker Soft AutoCommit: disabled
   [junit4]   2> 346393 INFO  (qtp1534658402-2306) [n:127.0.0.1:56955_solr c:MissingSegmentRecoveryTest s:shard1  x:MissingSegmentRecoveryTest_shard1_replica1] o.a.s.s.SolrIndexSearcher Opening [Searcher@75f442d5[MissingSegmentRecoveryTest_shard1_replica1] main]
   [junit4]   2> 346393 INFO  (qtp1226228903-2309) [n:127.0.0.1:56954_solr c:MissingSegmentRecoveryTest s:shard1  x:MissingSegmentRecoveryTest_shard1_replica2] o.a.s.s.SolrIndexSearcher Opening [Searcher@5862fc8d[MissingSegmentRecoveryTest_shard1_replica2] main]
   [junit4]   2> 346395 INFO  (qtp1226228903-2309) [n:127.0.0.1:56954_solr c:MissingSegmentRecoveryTest s:shard1  x:MissingSegmentRecoveryTest_shard1_replica2] o.a.s.r.ManagedResourceStorage Configured ZooKeeperStorageIO with znodeBase: /configs/conf
   [junit4]   2> 346395 INFO  (qtp1534658402-2306) [n:127.0.0.1:56955_solr c:MissingSegmentRecoveryTest s:shard1  x:MissingSegmentRecoveryTest_shard1_replica1] o.a.s.r.ManagedResourceStorage Configured ZooKeeperStorageIO with znodeBase: /configs/conf
   [junit4]   2> 346395 INFO  (qtp1534658402-2306) [n:127.0.0.1:56955_solr c:MissingSegmentRecoveryTest s:shard1  x:MissingSegmentRecoveryTest_shard1_replica1] o.a.s.r.ManagedResourceStorage Loaded null at path _rest_managed.json using ZooKeeperStorageIO:path=/configs/conf
   [junit4]   2> 346395 INFO  (qtp1226228903-2309) [n:127.0.0.1:56954_solr c:MissingSegmentRecoveryTest s:shard1  x:MissingSegmentRecoveryTest_shard1_replica2] o.a.s.r.ManagedResourceStorage Loaded null at path _rest_managed.json using ZooKeeperStorageIO:path=/configs/conf
   [junit4]   2> 346395 INFO  (qtp1534658402-2306) [n:127.0.0.1:56955_solr c:MissingSegmentRecoveryTest s:shard1  x:MissingSegmentRecoveryTest_shard1_replica1] o.a.s.h.ReplicationHandler Commits will be reserved for  10000
   [junit4]   2> 346395 INFO  (qtp1226228903-2309) [n:127.0.0.1:56954_solr c:MissingSegmentRecoveryTest s:shard1  x:MissingSegmentRecoveryTest_shard1_replica2] o.a.s.h.ReplicationHandler Commits will be reserved for  10000
   [junit4]   2> 346396 INFO  (searcherExecutor-941-thread-1-processing-n:127.0.0.1:56955_solr x:MissingSegmentRecoveryTest_shard1_replica1 s:shard1 c:MissingSegmentRecoveryTest) [n:127.0.0.1:56955_solr c:MissingSegmentRecoveryTest s:shard1  x:MissingSegmentRecoveryTest_shard1_replica1] o.a.s.c.SolrCore [MissingSegmentRecoveryTest_shard1_replica1] Registered new searcher Searcher@75f442d5[MissingSegmentRecoveryTest_shard1_replica1] main{ExitableDirectoryReader(UninvertingDirectoryReader())}
   [junit4]   2> 346396 INFO  (qtp1226228903-2309) [n:127.0.0.1:56954_solr c:MissingSegmentRecoveryTest s:shard1  x:MissingSegmentRecoveryTest_shard1_replica2] o.a.s.u.UpdateLog Could not find max version in index or recent updates, using new clock 1565165172029390848
   [junit4]   2> 346396 INFO  (qtp1534658402-2306) [n:127.0.0.1:56955_solr c:MissingSegmentRecoveryTest s:shard1  x:MissingSegmentRecoveryTest_shard1_replica1] o.a.s.u.UpdateLog Could not find max version in index or recent updates, using new clock 1565165172029390848
   [junit4]   2> 346396 INFO  (searcherExecutor-940-thread-1-processing-n:127.0.0.1:56954_solr x:MissingSegmentRecoveryTest_shard1_replica2 s:shard1 c:MissingSegmentRecoveryTest) [n:127.0.0.1:56954_solr c:MissingSegmentRecoveryTest s:shard1  x:MissingSegmentRecoveryTest_shard1_replica2] o.a.s.c.SolrCore [MissingSegmentRecoveryTest_shard1_replica2] Registered new searcher Searcher@5862fc8d[MissingSegmentRecoveryTest_shard1_replica2] main{ExitableDirectoryReader(UninvertingDirectoryReader())}
   [junit4]   2> 346403 INFO  (qtp1534658402-2306) [n:127.0.0.1:56955_solr c:MissingSegmentRecoveryTest s:shard1  x:MissingSegmentRecoveryTest_shard1_replica1] o.a.s.c.ShardLeaderElectionContext Enough replicas found to continue.
   [junit4]   2> 346403 INFO  (qtp1534658402-2306) [n:127.0.0.1:56955_solr c:MissingSegmentRecoveryTest s:shard1  x:MissingSegmentRecoveryTest_shard1_replica1] o.a.s.c.ShardLeaderElectionContext I may be the new leader - try and sync
   [junit4]   2> 346403 INFO  (qtp1534658402-2306) [n:127.0.0.1:56955_solr c:MissingSegmentRecoveryTest s:shard1  x:MissingSegmentRecoveryTest_shard1_replica1] o.a.s.c.SyncStrategy Sync replicas to http://127.0.0.1:56955/solr/MissingSegmentRecoveryTest_shard1_replica1/
   [junit4]   2> 346403 INFO  (qtp1534658402-2306) [n:127.0.0.1:56955_solr c:MissingSegmentRecoveryTest s:shard1  x:MissingSegmentRecoveryTest_shard1_replica1] o.a.s.u.PeerSync PeerSync: core=MissingSegmentRecoveryTest_shard1_replica1 url=http://127.0.0.1:56955/solr START replicas=[http://127.0.0.1:56954/solr/MissingSegmentRecoveryTest_shard1_replica2/] nUpdates=100
   [junit4]   2> 346403 INFO  (qtp1534658402-2306) [n:127.0.0.1:56955_solr c:MissingSegmentRecoveryTest s:shard1  x:MissingSegmentRecoveryTest_shard1_replica1] o.a.s.u.PeerSync PeerSync: core=MissingSegmentRecoveryTest_shard1_replica1 url=http://127.0.0.1:56955/solr DONE.  We have no versions.  sync failed.
   [junit4]   2> 346407 INFO  (qtp1226228903-2311) [n:127.0.0.1:56954_solr c:MissingSegmentRecoveryTest s:shard1 r:core_node2 x:MissingSegmentRecoveryTest_shard1_replica2] o.a.s.c.S.Request [MissingSegmentRecoveryTest_shard1_replica2]  webapp=/solr path=/get params={distrib=false&qt=/get&fingerprint=false&getVersions=100&wt=javabin&version=2} status=0 QTime=0
   [junit4]   2> 346407 INFO  (qtp1534658402-2306) [n:127.0.0.1:56955_solr c:MissingSegmentRecoveryTest s:shard1  x:MissingSegmentRecoveryTest_shard1_replica1] o.a.s.c.SyncStrategy Leader's attempt to sync with shard failed, moving to the next candidate
   [junit4]   2> 346407 INFO  (qtp1534658402-2306) [n:127.0.0.1:56955_solr c:MissingSegmentRecoveryTest s:shard1  x:MissingSegmentRecoveryTest_shard1_replica1] o.a.s.c.ShardLeaderElectionContext We failed sync, but we have no versions - we can't sync in that case - we were active before, so become leader anyway
   [junit4]   2> 346407 INFO  (qtp1534658402-2306) [n:127.0.0.1:56955_solr c:MissingSegmentRecoveryTest s:shard1  x:MissingSegmentRecoveryTest_shard1_replica1] o.a.s.c.ShardLeaderElectionContext Found all replicas participating in election, clear LIR
   [junit4]   2> 346412 INFO  (qtp1534658402-2306) [n:127.0.0.1:56955_solr c:MissingSegmentRecoveryTest s:shard1  x:MissingSegmentRecoveryTest_shard1_replica1] o.a.s.c.ShardLeaderElectionContext I am the new leader: http://127.0.0.1:56955/solr/MissingSegmentRecoveryTest_shard1_replica1/ shard1
   [junit4]   2> 346517 INFO  (zkCallback-343-thread-1-processing-n:127.0.0.1:56954_solr) [n:127.0.0.1:56954_solr    ] o.a.s.c.c.ZkStateReader A cluster state change: [WatchedEvent state:SyncConnected type:NodeDataChanged path:/collections/MissingSegmentRecoveryTest/state.json] for collection [MissingSegmentRecoveryTest] has occurred - updating... (live nodes size: [2])
   [junit4]   2> 346517 INFO  (zkCallback-344-thread-1-processing-n:127.0.0.1:56955_solr) [n:127.0.0.1:56955_solr    ] o.a.s.c.c.ZkStateReader A cluster state change: [WatchedEvent state:SyncConnected type:NodeDataChanged path:/collections/MissingSegmentRecoveryTest/state.json] for collection [MissingSegmentRecoveryTest] has occurred - updating... (live nodes size: [2])
   [junit4]   2> 346565 INFO  (qtp1534658402-2306) [n:127.0.0.1:56955_solr c:MissingSegmentRecoveryTest s:shard1  x:MissingSegmentRecoveryTest_shard1_replica1] o.a.s.c.ZkController I am the leader, no recovery necessary
   [junit4]   2> 346570 INFO  (qtp1534658402-2306) [n:127.0.0.1:56955_solr c:MissingSegmentRecoveryTest s:shard1  x:MissingSegmentRecoveryTest_shard1_replica1] o.a.s.s.HttpSolrCall [admin] webapp=null path=/admin/cores params={qt=/admin/cores&collection.configName=conf&newCollection=true&name=MissingSegmentRecoveryTest_shard1_replica1&action=CREATE&numShards=1&collection=MissingSegmentRecoveryTest&shard=shard1&wt=javabin&version=2} status=0 QTime=1380
   [junit4]   2> 346671 INFO  (zkCallback-343-thread-1-processing-n:127.0.0.1:56954_solr) [n:127.0.0.1:56954_solr    ] o.a.s.c.c.ZkStateReader A cluster state change: [WatchedEvent state:SyncConnected type:NodeDataChanged path:/collections/MissingSegmentRecoveryTest/state.json] for collection [MissingSegmentRecoveryTest] has occurred - updating... (live nodes size: [2])
   [junit4]   2> 346671 INFO  (zkCallback-344-thread-1-processing-n:127.0.0.1:56955_solr) [n:127.0.0.1:56955_solr    ] o.a.s.c.c.ZkStateReader A cluster state change: [WatchedEvent state:SyncConnected type:NodeDataChanged path:/collections/MissingSegmentRecoveryTest/state.json] for collection [MissingSegmentRecoveryTest] has occurred - updating... (live nodes size: [2])
   [junit4]   2> 347409 INFO  (qtp1226228903-2309) [n:127.0.0.1:56954_solr c:MissingSegmentRecoveryTest s:shard1  x:MissingSegmentRecoveryTest_shard1_replica2] o.a.s.s.HttpSolrCall [admin] webapp=null path=/admin/cores params={qt=/admin/cores&collection.configName=conf&newCollection=true&name=MissingSegmentRecoveryTest_shard1_replica2&action=CREATE&numShards=1&collection=MissingSegmentRecoveryTest&shard=shard1&wt=javabin&version=2} status=0 QTime=2217
   [junit4]   2> 347414 INFO  (qtp1534658402-2305) [n:127.0.0.1:56955_solr    ] o.a.s.h.a.CollectionsHandler Wait for new collection to be active for at most 30 seconds. Check all shard replicas
   [junit4]   2> 347511 INFO  (zkCallback-343-thread-1-processing-n:127.0.0.1:56954_solr) [n:127.0.0.1:56954_solr    ] o.a.s.c.c.ZkStateReader A cluster state change: [WatchedEvent state:SyncConnected type:NodeDataChanged path:/collections/MissingSegmentRecoveryTest/state.json] for collection [MissingSegmentRecoveryTest] has occurred - updating... (live nodes size: [2])
   [junit4]   2> 347511 INFO  (zkCallback-344-thread-1-processing-n:127.0.0.1:56955_solr) [n:127.0.0.1:56955_solr    ] o.a.s.c.c.ZkStateReader A cluster state change: [WatchedEvent state:SyncConnected type:NodeDataChanged path:/collections/MissingSegmentRecoveryTest/state.json] for collection [MissingSegmentRecoveryTest] has occurred - updating... (live nodes size: [2])
   [junit4]   2> 348414 INFO  (qtp1534658402-2305) [n:127.0.0.1:56955_solr    ] o.a.s.s.HttpSolrCall [admin] webapp=null path=/admin/collections params={replicationFactor=2&collection.configName=conf&maxShardsPerNode=1&name=MissingSegmentRecoveryTest&action=CREATE&numShards=1&wt=javabin&version=2} status=0 QTime=3341
   [junit4]   2> 348434 INFO  (qtp1226228903-2312) [n:127.0.0.1:56954_solr c:MissingSegmentRecoveryTest s:shard1 r:core_node2 x:MissingSegmentRecoveryTest_shard1_replica2] o.a.s.u.p.LogUpdateProcessorFactory [MissingSegmentRecoveryTest_shard1_replica2]  webapp=/solr path=/update params={update.distrib=FROMLEADER&distrib.from=http://127.0.0.1:56955/solr/MissingSegmentRecoveryTest_shard1_replica1/&wt=javabin&version=2}{add=[0 (1565165174154854400), 1 (1565165174161145856), 2 (1565165174161145857), 3 (1565165174161145858), 4 (1565165174161145859), 5 (1565165174161145860), 6 (1565165174161145861), 7 (1565165174161145862), 8 (1565165174161145863), 9 (1565165174161145864)]} 0 4
   [junit4]   2> 348434 INFO  (qtp1534658402-2308) [n:127.0.0.1:56955_solr c:MissingSegmentRecoveryTest s:shard1 r:core_node1 x:MissingSegmentRecoveryTest_shard1_replica1] o.a.s.u.p.LogUpdateProcessorFactory [MissingSegmentRecoveryTest_shard1_replica1]  webapp=/solr path=/update params={wt=javabin&version=2}{add=[0 (1565165174154854400), 1 (1565165174161145856), 2 (1565165174161145857), 3 (1565165174161145858), 4 (1565165174161145859), 5 (1565165174161145860), 6 (1565165174161145861), 7 (1565165174161145862), 8 (1565165174161145863), 9 (1565165174161145864)]} 0 11
   [junit4]   2> 348440 INFO  (qtp1226228903-2313) [n:127.0.0.1:56954_solr c:MissingSegmentRecoveryTest s:shard1 r:core_node2 x:MissingSegmentRecoveryTest_shard1_replica2] o.a.s.u.DirectUpdateHandler2 start commit{,optimize=false,openSearcher=true,waitSearcher=true,expungeDeletes=false,softCommit=false,prepareCommit=false}
   [junit4]   2> 348440 INFO  (qtp1226228903-2313) [n:127.0.0.1:56954_solr c:MissingSegmentRecoveryTest s:shard1 r:core_node2 x:MissingSegmentRecoveryTest_shard1_replica2] o.a.s.u.SolrIndexWriter Calling setCommitData with IW:org.apache.solr.update.SolrIndexWriter@7acc2a7b
   [junit4]   2> 348440 INFO  (qtp1534658402-2315) [n:127.0.0.1:56955_solr c:MissingSegmentRecoveryTest s:shard1 r:core_node1 x:MissingSegmentRecoveryTest_shard1_replica1] o.a.s.u.DirectUpdateHandler2 start commit{,optimize=false,openSearcher=true,waitSearcher=true,expungeDeletes=false,softCommit=false,prepareCommit=false}
   [junit4]   2> 348440 INFO  (qtp1534658402-2315) [n:127.0.0.1:56955_solr c:MissingSegmentRecoveryTest s:shard1 r:core_node1 x:MissingSegmentRecoveryTest_shard1_replica1] o.a.s.u.SolrIndexWriter Calling setCommitData with IW:org.apache.solr.update.SolrIndexWriter@3de734d
   [junit4]   2> 348476 INFO  (qtp1534658402-2315) [n:127.0.0.1:56955_solr c:MissingSegmentRecoveryTest s:shard1 r:core_node1 x:MissingSegmentRecoveryTest_shard1_replica1] o.a.s.s.SolrIndexSearcher Opening [Searcher@553b6139[MissingSegmentRecoveryTest_shard1_replica1] main]
   [junit4]   2> 348477 INFO  (qtp1534658402-2315) [n:127.0.0.1:56955_solr c:MissingSegmentRecoveryTest s:shard1 r:core_node1 x:MissingSegmentRecoveryTest_shard1_replica1] o.a.s.u.DirectUpdateHandler2 end_commit_flush
   [junit4]   2> 348477 INFO  (searcherExecutor-941-thread-1-processing-n:127.0.0.1:56955_solr x:MissingSegmentRecoveryTest_shard1_replica1 s:shard1 c:MissingSegmentRecoveryTest r:core_node1) [n:127.0.0.1:56955_solr c:MissingSegmentRecoveryTest s:shard1 r:core_node1 x:MissingSegmentRecoveryTest_shard1_replica1] o.a.s.c.SolrCore [MissingSegmentRecoveryTest_shard1_replica1] Registered new searcher Searcher@553b6139[MissingSegmentRecoveryTest_shard1_replica1] main{ExitableDirectoryReader(UninvertingDirectoryReader(Uninverting(_0(6.6.0):C10)))}
   [junit4]   2> 348477 INFO  (qtp1534658402-2315) [n:127.0.0.1:56955_solr c:MissingSegmentRecoveryTest s:shard1 r:core_node1 x:MissingSegmentRecoveryTest_shard1_replica1] o.a.s.u.p.LogUpdateProcessorFactory [MissingSegmentRecoveryTest_shard1_replica1]  webapp=/solr path=/update params={update.distrib=FROMLEADER&waitSearcher=true&openSearcher=true&commit=true&softCommit=false&distrib.from=http://127.0.0.1:56955/solr/MissingSegmentRecoveryTest_shard1_replica1/&commit_end_point=true&wt=javabin&version=2&expungeDeletes=false}{commit=} 0 36
   [junit4]   2> 348478 INFO  (qtp1226228903-2313) [n:127.0.0.1:56954_solr c:MissingSegmentRecoveryTest s:shard1 r:core_node2 x:MissingSegmentRecoveryTest_shard1_replica2] o.a.s.s.SolrIndexSearcher Opening [Searcher@236adb65[MissingSegmentRecoveryTest_shard1_replica2] main]
   [junit4]   2> 348479 INFO  (qtp1226228903-2313) [n:127.0.0.1:56954_solr c:MissingSegmentRecoveryTest s:shard1 r:core_node2 x:MissingSegmentRecoveryTest_shard1_replica2] o.a.s.u.DirectUpdateHandler2 end_commit_flush
   [junit4]   2> 348479 INFO  (searcherExecutor-940-thread-1-processing-n:127.0.0.1:56954_solr x:MissingSegmentRecoveryTest_shard1_replica2 s:shard1 c:MissingSegmentRecoveryTest r:core_node2) [n:127.0.0.1:56954_solr c:MissingSegmentRecoveryTest s:shard1 r:core_node2 x:MissingSegmentRecoveryTest_shard1_replica2] o.a.s.c.SolrCore [MissingSegmentRecoveryTest_shard1_replica2] Registered new searcher Searcher@236adb65[MissingSegmentRecoveryTest_shard1_replica2] main{ExitableDirectoryReader(UninvertingDirectoryReader(Uninverting(_0(6.6.0):C10)))}
   [junit4]   2> 348479 INFO  (qtp1226228903-2313) [n:127.0.0.1:56954_solr c:MissingSegmentRecoveryTest s:shard1 r:core_node2 x:MissingSegmentRecoveryTest_shard1_replica2] o.a.s.u.p.LogUpdateProcessorFactory [MissingSegmentRecoveryTest_shard1_replica2]  webapp=/solr path=/update params={update.distrib=FROMLEADER&waitSearcher=true&openSearcher=true&commit=true&softCommit=false&distrib.from=http://127.0.0.1:56955/solr/MissingSegmentRecoveryTest_shard1_replica1/&commit_end_point=true&wt=javabin&version=2&expungeDeletes=false}{commit=} 0 39
   [junit4]   2> 348479 INFO  (qtp1534658402-2310) [n:127.0.0.1:56955_solr c:MissingSegmentRecoveryTest s:shard1 r:core_node1 x:MissingSegmentRecoveryTest_shard1_replica1] o.a.s.u.p.LogUpdateProcessorFactory [MissingSegmentRecoveryTest_shard1_replica1]  webapp=/solr path=/update params={_stateVer_=MissingSegmentRecoveryTest:4&waitSearcher=true&commit=true&softCommit=false&wt=javabin&version=2}{commit=} 0 41
   [junit4]   2> 348483 INFO  (TEST-MissingSegmentRecoveryTest.testLeaderRecovery-seed#[6C6CDF7F09088FC0]) [    ] o.e.j.s.AbstractConnector Stopped ServerConnector@2a8b244{HTTP/1.1,[http/1.1]}{127.0.0.1:0}
   [junit4]   2> 348483 INFO  (TEST-MissingSegmentRecoveryTest.testLeaderRecovery-seed#[6C6CDF7F09088FC0]) [    ] o.a.s.c.CoreContainer Shutting down CoreContainer instance=1832979702
   [junit4]   2> 348487 INFO  (coreCloseExecutor-950-thread-1) [n:127.0.0.1:56954_solr c:MissingSegmentRecoveryTest s:shard1 r:core_node2 x:MissingSegmentRecoveryTest_shard1_replica2] o.a.s.c.SolrCore [MissingSegmentRecoveryTest_shard1_replica2]  CLOSING SolrCore org.apache.solr.core.SolrCore@72899f6b
   [junit4]   2> 348490 INFO  (coreCloseExecutor-950-thread-1) [n:127.0.0.1:56954_solr c:MissingSegmentRecoveryTest s:shard1 r:core_node2 x:MissingSegmentRecoveryTest_shard1_replica2] o.a.s.m.SolrMetricManager Closing metric reporters for: solr.core.MissingSegmentRecoveryTest.shard1.replica2
   [junit4]   2> 348492 INFO  (TEST-MissingSegmentRecoveryTest.testLeaderRecovery-seed#[6C6CDF7F09088FC0]) [    ] o.a.s.c.Overseer Overseer (id=97822823131512837-127.0.0.1:56954_solr-n_0000000000) closing
   [junit4]   2> 348492 INFO  (OverseerStateUpdate-97822823131512837-127.0.0.1:56954_solr-n_0000000000) [n:127.0.0.1:56954_solr    ] o.a.s.c.Overseer Overseer Loop exiting : 127.0.0.1:56954_solr
   [junit4]   2> 348497 WARN  (zkCallback-343-thread-1-processing-n:127.0.0.1:56954_solr) [n:127.0.0.1:56954_solr    ] o.a.s.c.c.ZkStateReader ZooKeeper watch triggered, but Solr cannot talk to ZK: [KeeperErrorCode = Session expired for /live_nodes]
   [junit4]   2> 348497 INFO  (TEST-MissingSegmentRecoveryTest.testLeaderRecovery-seed#[6C6CDF7F09088FC0]) [    ] o.a.s.m.SolrMetricManager Closing metric reporters for: solr.node
   [junit4]   2> 348499 INFO  (TEST-MissingSegmentRecoveryTest.testLeaderRecovery-seed#[6C6CDF7F09088FC0]) [    ] o.e.j.s.h.ContextHandler Stopped o.e.j.s.ServletContextHandler@45365ce{/solr,null,UNAVAILABLE}
   [junit4]   2> 348500 WARN  (NIOServerCxn.Factory:0.0.0.0/0.0.0.0:0) [    ] o.a.z.s.NIOServerCnxn caught end of stream exception
   [junit4]   2> EndOfStreamException: Unable to read additional data from client sessionid 0x15b8956dfae0005, likely client has closed socket
   [junit4]   2> 	at org.apache.zookeeper.server.NIOServerCnxn.doIO(NIOServerCnxn.java:228)
   [junit4]   2> 	at org.apache.zookeeper.server.NIOServerCnxnFactory.run(NIOServerCnxnFactory.java:208)
   [junit4]   2> 	at java.lang.Thread.run(Thread.java:745)
   [junit4]   2> 348501 INFO  (zkCallback-344-thread-2-processing-n:127.0.0.1:56955_solr) [n:127.0.0.1:56955_solr    ] o.a.s.c.OverseerElectionContext I am going to be the leader 127.0.0.1:56955_solr
   [junit4]   2> 348501 INFO  (TEST-MissingSegmentRecoveryTest.testLeaderRecovery-seed#[6C6CDF7F09088FC0]) [    ] o.e.j.s.Server jetty-9.3.14.v20161028
   [junit4]   2> 348502 INFO  (zkCallback-350-thread-1) [    ] o.a.s.c.c.ZkStateReader Updated live nodes from ZooKeeper... (2) -> (1)
   [junit4]   2> 348502 INFO  (zkCallback-344-thread-1-processing-n:127.0.0.1:56955_solr) [n:127.0.0.1:56955_solr    ] o.a.s.c.c.ZkStateReader Updated live nodes from ZooKeeper... (2) -> (1)
   [junit4]   2> 348502 INFO  (TEST-MissingSegmentRecoveryTest.testLeaderRecovery-seed#[6C6CDF7F09088FC0]) [    ] o.e.j.s.h.ContextHandler Started o.e.j.s.ServletContextHandler@3147a36d{/solr,null,AVAILABLE}
   [junit4]   2> 348503 INFO  (TEST-MissingSegmentRecoveryTest.testLeaderRecovery-seed#[6C6CDF7F09088FC0]) [    ] o.e.j.s.AbstractConnector Started ServerConnector@6a0c60cd{HTTP/1.1,[http/1.1]}{127.0.0.1:56954}
   [junit4]   2> 348503 INFO  (TEST-MissingSegmentRecoveryTest.testLeaderRecovery-seed#[6C6CDF7F09088FC0]) [    ] o.e.j.s.Server Started @352546ms
   [junit4]   2> 348503 INFO  (TEST-MissingSegmentRecoveryTest.testLeaderRecovery-seed#[6C6CDF7F09088FC0]) [    ] o.a.s.c.s.e.JettySolrRunner Jetty properties: {hostContext=/solr, hostPort=56954}
   [junit4]   2> 348504 ERROR (TEST-MissingSegmentRecoveryTest.testLeaderRecovery-seed#[6C6CDF7F09088FC0]) [    ] o.a.s.s.StartupLoggingUtils Missing Java Option solr.log.dir. Logging may be missing or incomplete.
   [junit4]   2> 348504 INFO  (TEST-MissingSegmentRecoveryTest.testLeaderRecovery-seed#[6C6CDF7F09088FC0]) [    ] o.a.s.s.SolrDispatchFilter  ___      _       Welcome to Apache Solr™ version 6.6.0
   [junit4]   2> 348504 INFO  (TEST-MissingSegmentRecoveryTest.testLeaderRecovery-seed#[6C6CDF7F09088FC0]) [    ] o.a.s.s.SolrDispatchFilter / __| ___| |_ _   Starting in cloud mode on port null
   [junit4]   2> 348504 INFO  (TEST-MissingSegmentRecoveryTest.testLeaderRecovery-seed#[6C6CDF7F09088FC0]) [    ] o.a.s.s.SolrDispatchFilter \__ \/ _ \ | '_|  Install dir: null
   [junit4]   2> 348504 INFO  (TEST-MissingSegmentRecoveryTest.testLeaderRecovery-seed#[6C6CDF7F09088FC0]) [    ] o.a.s.s.SolrDispatchFilter |___/\___/_|_|    Start time: 2017-04-20T03:10:27.606Z
   [junit4]   2> 348506 INFO  (zkCallback-344-thread-2-processing-n:127.0.0.1:56955_solr) [n:127.0.0.1:56955_solr    ] o.a.s.c.Overseer Overseer (id=97822823131512838-127.0.0.1:56955_solr-n_0000000001) starting
   [junit4]   2> 348514 INFO  (TEST-MissingSegmentRecoveryTest.testLeaderRecovery-seed#[6C6CDF7F09088FC0]) [    ] o.a.s.s.SolrDispatchFilter solr.xml found in ZooKeeper. Loading...
   [junit4]   2> 348526 INFO  (zkCallback-344-thread-2-processing-n:127.0.0.1:56955_solr) [n:127.0.0.1:56955_solr    ] o.a.s.c.c.ZkStateReader A cluster state change: [WatchedEvent state:SyncConnected type:NodeDataChanged path:/collections/MissingSegmentRecoveryTest/state.json] for collection [MissingSegmentRecoveryTest] has occurred - updating... (live nodes size: [1])
   [junit4]   2> 348532 INFO  (TEST-MissingSegmentRecoveryTest.testLeaderRecovery-seed#[6C6CDF7F09088FC0]) [    ] o.a.s.u.UpdateShardHandler Creating UpdateShardHandler HTTP client with params: socketTimeout=340000&connTimeout=45000&retry=true
   [junit4]   2> 348533 INFO  (TEST-MissingSegmentRecoveryTest.testLeaderRecovery-seed#[6C6CDF7F09088FC0]) [    ] o.a.s.c.ZkContainer Zookeeper client=127.0.0.1:56950/solr
   [junit4]   2> 348548 INFO  (TEST-MissingSegmentRecoveryTest.testLeaderRecovery-seed#[6C6CDF7F09088FC0]) [n:127.0.0.1:56954_solr    ] o.a.s.c.c.ZkStateReader Updated live nodes from ZooKeeper... (0) -> (1)
   [junit4]   2> 348552 INFO  (TEST-MissingSegmentRecoveryTest.testLeaderRecovery-seed#[6C6CDF7F09088FC0]) [n:127.0.0.1:56954_solr    ] o.a.s.c.Overseer Overseer (id=null) closing
   [junit4]   2> 348556 INFO  (TEST-MissingSegmentRecoveryTest.testLeaderRecovery-seed#[6C6CDF7F09088FC0]) [n:127.0.0.1:56954_solr    ] o.a.s.c.ZkController Register node as live in ZooKeeper:/live_nodes/127.0.0.1:56954_solr
   [junit4]   2> 348566 INFO  (zkCallback-355-thread-1-processing-n:127.0.0.1:56954_solr) [n:127.0.0.1:56954_solr    ] o.a.s.c.c.ZkStateReader Updated live nodes from ZooKeeper... (1) -> (2)
   [junit4]   2> 348566 INFO  (zkCallback-344-thread-2-processing-n:127.0.0.1:56955_solr) [n:127.0.0.1:56955_solr    ] o.a.s.c.c.ZkStateReader Updated live nodes from ZooKeeper... (1) -> (2)
   [junit4]   2> 348566 INFO  (zkCallback-350-thread-1) [    ] o.a.s.c.c.ZkStateReader Updated live nodes from ZooKeeper... (1) -> (2)
   [junit4]   2> 348686 INFO  (TEST-MissingSegmentRecoveryTest.testLeaderRecovery-seed#[6C6CDF7F09088FC0]) [n:127.0.0.1:56954_solr    ] o.a.s.c.CorePropertiesLocator Found 1 core definitions underneath C:\Users\jenkins\workspace\Lucene-Solr-6.x-Windows\solr\build\solr-core\test\J1\temp\solr.cloud.MissingSegmentRecoveryTest_6C6CDF7F09088FC0-001\tempDir-001\node2\.
   [junit4]   2> 348686 INFO  (TEST-MissingSegmentRecoveryTest.testLeaderRecovery-seed#[6C6CDF7F09088FC0]) [n:127.0.0.1:56954_solr    ] o.a.s.c.CorePropertiesLocator Cores are: [MissingSegmentRecoveryTest_shard1_replica2]
   [junit4]   2> 348823 INFO  (zkCallback-344-thread-2-processing-n:127.0.0.1:56955_solr) [n:127.0.0.1:56955_solr    ] o.a.s.c.c.ZkStateReader A cluster state change: [WatchedEvent state:SyncConnected type:NodeDataChanged path:/collections/MissingSegmentRecoveryTest/state.json] for collection [MissingSegmentRecoveryTest] has occurred - updating... (live nodes size: [2])
   [junit4]   2> 348830 INFO  (coreLoadExecutor-959-thread-1-processing-n:127.0.0.1:56954_solr) [n:127.0.0.1:56954_solr c:MissingSegmentRecoveryTest s:shard1 r:core_node2 x:MissingSegmentRecoveryTest_shard1_replica2] o.a.s.c.TransientSolrCoreCacheDefault Allocating transient cache for 2147483647 transient cores
   [junit4]   2> 348869 INFO  (coreLoadExecutor-959-thread-1-processing-n:127.0.0.1:56954_solr) [n:127.0.0.1:56954_solr c:MissingSegmentRecoveryTest s:shard1 r:core_node2 x:MissingSegmentRecoveryTest_shard1_replica2] o.a.s.c.SolrConfig Using Lucene MatchVersion: 6.6.0
   [junit4]   2> 348880 INFO  (coreLoadExecutor-959-thread-1-processing-n:127.0.0.1:56954_solr) [n:127.0.0.1:56954_solr c:MissingSegmentRecoveryTest s:shard1 r:core_node2 x:MissingSegmentRecoveryTest_shard1_replica2] o.a.s.s.IndexSchema [MissingSegmentRecoveryTest_shard1_replica2] Schema name=minimal
   [junit4]   2> 348886 INFO  (coreLoadExecutor-959-thread-1-processing-n:127.0.0.1:56954_solr) [n:127.0.0.1:56954_solr c:MissingSegmentRecoveryTest s:shard1 r:core_node2 x:MissingSegmentRecoveryTest_shard1_replica2] o.a.s.s.IndexSchema Loaded schema minimal/1.1 with uniqueid field id
   [junit4]   2> 348886 INFO  (coreLoadExecutor-959-thread-1-processing-n:127.0.0.1:56954_solr) [n:127.0.0.1:56954_solr c:MissingSegmentRecoveryTest s:shard1 r:core_node2 x:MissingSegmentRecoveryTest_shard1_replica2] o.a.s.c.CoreContainer Creating SolrCore 'MissingSegmentRecoveryTest_shard1_replica2' using configuration from collection MissingSegmentRecoveryTest, trusted=true
   [junit4]   2> 348886 INFO  (coreLoadExecutor-959-thread-1-processing-n:127.0.0.1:56954_solr) [n:127.0.0.1:56954_solr c:MissingSegmentRecoveryTest s:shard1 r:core_node2 x:MissingSegmentRecoveryTest_shard1_replica2] o.a.s.c.SolrCore solr.RecoveryStrategy.Builder
   [junit4]   2> 348886 INFO  (coreLoadExecutor-959-thread-1-processing-n:127.0.0.1:56954_solr) [n:127.0.0.1:56954_solr c:MissingSegmentRecoveryTest s:shard1 r:core_node2 x:MissingSegmentRecoveryTest_shard1_replica2] o.a.s.c.SolrCore [[MissingSegmentRecoveryTest_shard1_replica2] ] Opening new SolrCore at [C:\Users\jenkins\workspace\Lucene-Solr-6.x-Windows\solr\build\solr-core\test\J1\temp\solr.cloud.MissingSegmentRecoveryTest_6C6CDF7F09088FC0-001\tempDir-001\node2\MissingSegmentRecoveryTest_shard1_replica2], dataDir=[C:\Users\jenkins\workspace\Lucene-Solr-6.x-Windows\solr\build\solr-core\test\J1\temp\solr.cloud.MissingSegmentRecoveryTest_6C6CDF7F09088FC0-001\tempDir-001\node2\.\MissingSegmentRecoveryTest_shard1_replica2\data\]
   [junit4]   2> 348937 INFO  (zkCallback-355-thread-1-processing-n:127.0.0.1:56954_solr) [n:127.0.0.1:56954_solr    ] o.a.s.c.c.ZkStateReader A cluster state change: [WatchedEvent state:SyncConnected type:NodeDataChanged path:/collections/MissingSegmentRecoveryTest/state.json] for collection [MissingSegmentRecoveryTest] has occurred - updating... (live nodes size: [2])
   [junit4]   2> 348937 INFO  (zkCallback-344-thread-2-processing-n:127.0.0.1:56955_solr) [n:127.0.0.1:56955_solr    ] o.a.s.c.c.ZkStateReader A cluster state change: [WatchedEvent state:SyncConnected type:NodeDataChanged path:/collections/MissingSegmentRecoveryTest/state.json] for collection [MissingSegmentRecoveryTest] has occurred - updating... (live nodes size: [2])
   [junit4]   2> 349054 INFO  (coreLoadExecutor-959-thread-1-processing-n:127.0.0.1:56954_solr) [n:127.0.0.1:56954_solr c:MissingSegmentRecoveryTest s:shard1 r:core_node2 x:MissingSegmentRecoveryTest_shard1_replica2] o.a.s.u.UpdateHandler Using UpdateLog implementation: org.apache.solr.update.UpdateLog
   [junit4]   2> 349055 INFO  (coreLoadExecutor-959-thread-1-processing-n:127.0.0.1:56954_solr) [n:127.0.0.1:56954_solr c:MissingSegmentRecoveryTest s:shard1 r:core_node2 x:MissingSegmentRecoveryTest_shard1_replica2] o.a.s.u.UpdateLog Initializing UpdateLog: dataDir=null defaultSyncLevel=FLUSH numRecordsToKeep=100 maxNumLogsToKeep=10 numVersionBuckets=65536
   [junit4]   2> 349058 INFO  (coreLoadExecutor-959-thread-1-processing-n:127.0.0.1:56954_solr) [n:127.0.0.1:56954_solr c:MissingSegmentRecoveryTest s:shard1 r:core_node2 x:MissingSegmentRecoveryTest_shard1_replica2] o.a.s.u.CommitTracker Hard AutoCommit: disabled
   [junit4]   2> 349058 INFO  (coreLoadExecutor-959-thread-1-processing-n:127.0.0.1:56954_solr) [n:127.0.0.1:56954_solr c:MissingSegmentRecoveryTest s:shard1 r:core_node2 x:MissingSegmentRecoveryTest_shard1_replica2] o.a.s.u.CommitTracker Soft AutoCommit: disabled
   [junit4]   2> 349062 INFO  (coreLoadExecutor-959-thread-1-processing-n:127.0.0.1:56954_solr) [n:127.0.0.1:56954_solr c:MissingSegmentRecoveryTest s:shard1 r:core_node2 x:MissingSegmentRecoveryTest_shard1_replica2] o.a.s.c.SolrCore [MissingSegmentRecoveryTest_shard1_replica2]  CLOSING SolrCore org.apache.solr.core.SolrCore@5cf4e8cd
   [junit4]   2> 349064 INFO  (coreLoadExecutor-959-thread-1-processing-n:127.0.0.1:56954_solr) [n:127.0.0.1:56954_solr c:MissingSegmentRecoveryTest s:shard1 r:core_node2 x:MissingSegmentRecoveryTest_shard1_replica2] o.a.s.m.SolrMetricManager Closing metric reporters for: solr.core.MissingSegmentRecoveryTest.shard1.replica2
   [junit4]   2> 349071 INFO  (coreLoadExecutor-959-thread-1-processing-n:127.0.0.1:56954_solr) [n:127.0.0.1:56954_solr c:MissingSegmentRecoveryTest s:shard1 r:core_node2 x:MissingSegmentRecoveryTest_shard1_replica2] o.a.s.c.CoreContainer Found active leader, will attempt to create fresh core and recover.
   [junit4]   2> 349071 INFO  (coreLoadExecutor-959-thread-1-processing-n:127.0.0.1:56954_solr) [n:127.0.0.1:56954_solr c:MissingSegmentRecoveryTest s:shard1 r:core_node2 x:MissingSegmentRecoveryTest_shard1_replica2] o.a.s.c.SolrCore Updating index properties... index=index.20170420051028173
   [junit4]   2> 349075 INFO  (coreLoadExecutor-959-thread-1-processing-n:127.0.0.1:56954_solr) [n:127.0.0.1:56954_solr c:MissingSegmentRecoveryTest s:shard1 r:core_node2 x:MissingSegmentRecoveryTest_shard1_replica2] o.a.s.c.SolrCore solr.RecoveryStrategy.Builder
   [junit4]   2> 349075 INFO  (coreLoadExecutor-959-thread-1-processing-n:127.0.0.1:56954_solr) [n:127.0.0.1:56954_solr c:MissingSegmentRecoveryTest s:shard1 r:core_node2 x:MissingSegmentRecoveryTest_shard1_replica2] o.a.s.c.SolrCore [[MissingSegmentRecoveryTest_shard1_replica2] ] Opening new SolrCore at [C:\Users\jenkins\workspace\Lucene-Solr-6.x-Windows\solr\build\solr-core\test\J1\temp\solr.cloud.MissingSegmentRecoveryTest_6C6CDF7F09088FC0-001\tempDir-001\node2\MissingSegmentRecoveryTest_shard1_replica2], dataDir=[C:\Users\jenkins\workspace\Lucene-Solr-6.x-Windows\solr\build\solr-core\test\J1\temp\solr.cloud.MissingSegmentRecoveryTest_6C6CDF7F09088FC0-001\tempDir-001\node2\.\MissingSegmentRecoveryTest_shard1_replica2\data\]
   [junit4]   2> 349090 INFO  (OldIndexDirectoryCleanupThreadForCore-MissingSegmentRecoveryTest_shard1_replica2) [n:127.0.0.1:56954_solr c:MissingSegmentRecoveryTest s:shard1 r:core_node2 x:MissingSegmentRecoveryTest_shard1_replica2] o.a.s.c.DirectoryFactory Found 1 old index directories to clean-up under C:\Users\jenkins\workspace\Lucene-Solr-6.x-Windows\solr\build\solr-core\test\J1\temp\solr.cloud.MissingSegmentRecoveryTest_6C6CDF7F09088FC0-001\tempDir-001\node2\.\MissingSegmentRecoveryTest_shard1_replica2\data\ afterReload=false
   [junit4]   2> 349097 INFO  (OldIndexDirectoryCleanupThreadForCore-MissingSegmentRecoveryTest_shard1_replica2) [n:127.0.0.1:56954_solr c:MissingSegmentRecoveryTest s:shard1 r:core_node2 x:MissingSegmentRecoveryTest_shard1_replica2] o.a.s.c.DirectoryFactory Deleted old index directory: C:\Users\jenkins\workspace\Lucene-Solr-6.x-Windows\solr\build\solr-core\test\J1\temp\solr.cloud.MissingSegmentRecoveryTest_6C6CDF7F09088FC0-001\tempDir-001\node2\.\MissingSegmentRecoveryTest_shard1_replica2\data\index.20170420051028173
   [junit4]   2> 349100 INFO  (OldIndexDirectoryCleanupThreadForCore-MissingSegmentRecoveryTest_shard1_replica2) [n:127.0.0.1:56954_solr c:MissingSegmentRecoveryTest s:shard1 r:core_node2 x:MissingSegmentRecoveryTest_shard1_replica2] o.a.s.c.DirectoryFactory Found 1 old index directories to clean-up under C:\Users\jenkins\workspace\Lucene-Solr-6.x-Windows\solr\build\solr-core\test\J1\temp\solr.cloud.MissingSegmentRecoveryTest_6C6CDF7F09088FC0-001\tempDir-001\node2\.\MissingSegmentRecoveryTest_shard1_replica2\data\ afterReload=false
   [junit4]   2> 349135 INFO  (OldIndexDirectoryCleanupThreadForCore-MissingSegmentRecoveryTest_shard1_replica2) [n:127.0.0.1:56954_solr c:MissingSegmentRecoveryTest s:shard1 r:core_node2 x:MissingSegmentRecoveryTest_shard1_replica2] o.a.s.c.DirectoryFactory Deleted old index directory: C:\Users\jenkins\workspace\Lucene-Solr-6.x-Windows\solr\build\solr-core\test\J1\temp\solr.cloud.MissingSegmentRecoveryTest_6C6CDF7F09088FC0-001\tempDir-001\node2\.\MissingSegmentRecoveryTest_shard1_replica2\data\index
   [junit4]   2> 349279 INFO  (coreLoadExecutor-959-thread-1-processing-n:127.0.0.1:56954_solr) [n:127.0.0.1:56954_solr c:MissingSegmentRecoveryTest s:shard1 r:core_node2 x:MissingSegmentRecoveryTest_shard1_replica2] o.a.s.u.UpdateHandler Using UpdateLog implementation: org.apache.solr.update.UpdateLog
   [junit4]   2> 349279 INFO  (coreLoadExecutor-959-thread-1-processing-n:127.0.0.1:56954_solr) [n:127.0.0.1:56954_solr c:MissingSegmentRecoveryTest s:shard1 r:core_node2 x:MissingSegmentRecoveryTest_shard1_replica2] o.a.s.u.UpdateLog Initializing UpdateLog: dataDir=null defaultSyncLevel=FLUSH numRecordsToKeep=100 maxNumLogsToKeep=10 numVersionBuckets=65536
   [junit4]   2> 349281 INFO  (coreLoadExecutor-959-thread-1-processing-n:127.0.0.1:56954_solr) [n:127.0.0.1:56954_solr c:MissingSegmentRecoveryTest s:shard1 r:core_node2 x:MissingSegmentRecoveryTest_shard1_replica2] o.a.s.u.CommitTracker Hard AutoCommit: disabled
   [junit4]   2> 349281 INFO  (coreLoadExecutor-959-thread-1-processing-n:127.0.0.1:56954_solr) [n:127.0.0.1:56954_solr c:MissingSegmentRecoveryTest s:shard1 r:core_node2 x:MissingSegmentRecoveryTest_shard1_replica2] o.a.s.u.CommitTracker Soft AutoCommit: disabled
   [junit4]   2> 349287 INFO  (coreLoadExecutor-959-thread-1-processing-n:127.0.0.1:56954_solr) [n:127.0.0.1:56954_solr c:MissingSegmentRecoveryTest s:shard1 r:core_node2 x:MissingSegmentRecoveryTest_shard1_replica2] o.a.s.c.SolrCore [MissingSegmentRecoveryTest_shard1_replica2]  CLOSING SolrCore org.apache.solr.core.SolrCore@6d8e645c
   [junit4]   2> 349288 INFO  (coreLoadExecutor-959-thread-1-processing-n:127.0.0.1:56954_solr) [n:127.0.0.1:56954_solr c:MissingSegmentRecoveryTest s:shard1 r:core_node2 x:MissingSegmentRecoveryTest_shard1_replica2] o.a.s.m.SolrMetricManager Closing metric reporters for: solr.core.MissingSegmentRecoveryTest.shard1.replica2
   [junit4]   2> 349293 ERROR (coreContainerWorkExecutor-954-thread-1-processing-n:127.0.0.1:56954_solr) [n:127.0.0.1:56954_solr    ] o.a.s.c.CoreContainer Error waiting for SolrCore to be created
   [junit4]   2> java.util.concurrent.ExecutionException: org.apache.solr.common.SolrException: Unable to create core [MissingSegmentRecoveryTest_shard1_replica2]
   [junit4]   2> 	at java.util.concurrent.FutureTask.report(FutureTask.java:122)
   [junit4]   2> 	at java.util.concurrent.FutureTask.get(FutureTask.java:192)
   [junit4]   2> 	at org.apache.solr.core.CoreContainer.lambda$load$6(CoreContainer.java:582)
   [junit4]   2> 	at com.codahale.metrics.InstrumentedExecutorService$InstrumentedRunnable.run(InstrumentedExecutorService.java:176)
   [junit4]   2> 	at java.util.concurrent.Executors$RunnableAdapter.call(Executors.java:511)
   [junit4]   2> 	at java.util.concurrent.FutureTask.run(FutureTask.java:266)
   [junit4]   2> 	at org.apache.solr.common.util.ExecutorUtil$MDCAwareThreadPoolExecutor.lambda$execute$0(ExecutorUtil.java:229)
   [junit4]   2> 	at java.util.concurrent.ThreadPoolExecutor.runWorker(ThreadPoolExecutor.java:1142)
   [junit4]   2> 	at java.util.concurrent.ThreadPoolExecutor$Worker.run(ThreadPoolExecutor.java:617)
   [junit4]   2> 	at java.lang.Thread.run(Thread.java:745)
   [junit4]   2> Caused by: org.apache.solr.common.SolrException: Unable to create core [MissingSegmentRecoveryTest_shard1_replica2]
   [junit4]   2> 	at org.apache.solr.core.CoreContainer.create(CoreContainer.java:930)
   [junit4]   2> 	at org.apache.solr.core.CoreContainer.lambda$load$5(CoreContainer.java:554)
   [junit4]   2> 	at com.codahale.metrics.InstrumentedExecutorService$InstrumentedCallable.call(InstrumentedExecutorService.java:197)
   [junit4]   2> 	... 5 more
   [junit4]   2> Caused by: org.apache.solr.common.SolrException: Error opening new searcher
   [junit4]   2> 	at org.apache.solr.core.SolrCore.<init>(SolrCore.java:972)
   [junit4]   2> 	at org.apache.solr.core.SolrCore.<init>(SolrCore.java:829)
   [junit4]   2> 	at org.apache.solr.core.CoreContainer.processCoreCreateException(CoreContainer.java:989)
   [junit4]   2> 	at org.apache.solr.core.CoreContainer.create(CoreContainer.java:917)
   [junit4]   2> 	... 7 more
   [junit4]   2> 	Suppressed: org.apache.solr.common.SolrException: Error opening new searcher
   [junit4]   2> 		at org.apache.solr.core.SolrCore.<init>(SolrCore.java:972)
   [junit4]   2> 		at org.apache.solr.core.SolrCore.<init>(SolrCore.java:829)
   [junit4]   2> 		at org.apache.solr.core.CoreContainer.create(CoreContainer.java:915)
   [junit4]   2> 		... 7 more
   [junit4]   2> 	Caused by: org.apache.solr.common.SolrException: Error opening new searcher
   [junit4]   2> 		at org.apache.solr.core.SolrCore.openNewSearcher(SolrCore.java:2039)
   [junit4]   2> 		at org.apache.solr.core.SolrCore.getSearcher(SolrCore.java:2159)
   [junit4]   2> 		at org.apache.solr.core.SolrCore.initSearcher(SolrCore.java:1061)
   [junit4]   2> 		at org.apache.solr.core.SolrCore.<init>(SolrCore.java:944)
   [junit4]   2> 		... 9 more
   [junit4]   2> 	Caused by: org.apache.lucene.index.CorruptIndexException: Unexpected file read error while reading index. (resource=BufferedChecksumIndexInput(MMapIndexInput(path="C:\Users\jenkins\workspace\Lucene-Solr-6.x-Windows\solr\build\solr-core\test\J1\temp\solr.cloud.MissingSegmentRecoveryTest_6C6CDF7F09088FC0-001\tempDir-001\node2\MissingSegmentRecoveryTest_shard1_replica2\data\index\segments_2")))
   [junit4]   2> 		at org.apache.lucene.index.SegmentInfos.readCommit(SegmentInfos.java:290)
   [junit4]   2> 		at org.apache.lucene.index.IndexWriter.<init>(IndexWriter.java:928)
   [junit4]   2> 		at org.apache.solr.update.SolrIndexWriter.<init>(SolrIndexWriter.java:118)
   [junit4]   2> 		at org.apache.solr.update.SolrIndexWriter.create(SolrIndexWriter.java:93)
   [junit4]   2> 		at org.apache.solr.update.DefaultSolrCoreState.createMainIndexWriter(DefaultSolrCoreState.java:248)
   [junit4]   2> 		at org.apache.solr.update.DefaultSolrCoreState.getIndexWriter(DefaultSolrCoreState.java:122)
   [junit4]   2> 		at org.apache.solr.core.SolrCore.openNewSearcher(SolrCore.java:2000)
   [junit4]   2> 		... 12 more
   [junit4]   2> 	Caused by: java.io.EOFException: read past EOF: MMapIndexInput(path="C:\Users\jenkins\workspace\Lucene-Solr-6.x-Windows\solr\build\solr-core\test\J1\temp\solr.cloud.MissingSegmentRecoveryTest_6C6CDF7F09088FC0-001\tempDir-001\node2\MissingSegmentRecoveryTest_shard1_replica2\data\index\segments_2")
   [junit4]   2> 		at org.apache.lucene.store.ByteBufferIndexInput.readByte(ByteBufferIndexInput.java:75)
   [junit4]   2> 		at org.apache.lucene.store.BufferedChecksumIndexInput.readByte(BufferedChecksumIndexInput.java:41)
   [junit4]   2> 		at org.apache.lucene.store.DataInput.readInt(DataInput.java:101)
   [junit4]   2> 		at org.apache.lucene.index.SegmentInfos.readCommit(SegmentInfos.java:300)
   [junit4]   2> 		at org.apache.lucene.index.SegmentInfos.readCommit(SegmentInfos.java:288)
   [junit4]   2> 		... 18 more
   [junit4]   2> Caused by: org.apache.solr.common.SolrException: Error opening new searcher
   [junit4]   2> 	at org.apache.solr.core.SolrCore.openNewSearcher(SolrCore.java:2039)
   [junit4]   2> 	at org.apache.solr.core.SolrCore.getSearcher(SolrCore.java:2159)
   [junit4]   2> 	at org.apache.solr.core.SolrCore.initSearcher(SolrCore.java:1061)
   [junit4]   2> 	at org.apache.solr.core.SolrCore.<init>(SolrCore.java:944)
   [junit4]   2> 	... 10 more
   [junit4]   2> Caused by: org.apache.lucene.index.IndexNotFoundException: no segments* file found in LockValidatingDirectoryWrapper(MMapDirectory@C:\Users\jenkins\workspace\Lucene-Solr-6.x-Windows\solr\build\solr-core\test\J1\temp\solr.cloud.MissingSegmentRecoveryTest_6C6CDF7F09088FC0-001\tempDir-001\node2\MissingSegmentRecoveryTest_shard1_replica2\data\index.20170420051028173 lockFactory=org.apache.lucene.store.NativeFSLockFactory@2b9d12e6): files: [write.lock]
   [junit4]   2> 	at org.apache.lucene.index.IndexWriter.<init>(IndexWriter.java:923)
   [junit4]   2> 	at org.apache.solr.update.SolrIndexWriter.<init>(SolrIndexWriter.java:118)
   [junit4]   2> 	at org.apache.solr.update.SolrIndexWriter.create(SolrIndexWriter.java:93)
   [junit4]   2> 	at org.apache.solr.update.DefaultSolrCoreState.createMainIndexWriter(DefaultSolrCoreState.java:248)
   [junit4]   2> 	at org.apache.solr.update.DefaultSolrCoreState.getIndexWriter(DefaultSolrCoreState.java:122)
   [junit4]   2> 	at org.apache.solr.core.SolrCore.openNewSearcher(SolrCore.java:2000)
   [junit4]   2> 	... 13 more
   [junit4]   2> 439349 INFO  (qtp1534658402-2305) [n:127.0.0.1:56955_solr    ] o.a.s.h.a.CollectionsHandler Invoked Collection Action :delete with params name=MissingSegmentRecoveryTest&action=DELETE&wt=javabin&version=2 and sendToOCPQueue=true
   [junit4]   2> 439353 INFO  (OverseerThreadFactory-957-thread-1-processing-n:127.0.0.1:56955_solr) [n:127.0.0.1:56955_solr    ] o.a.s.c.OverseerCollectionMessageHandler Executing Collection Cmd : action=UNLOAD&deleteInstanceDir=true&deleteDataDir=true
   [junit4]   2> 439361 INFO  (qtp1534658402-2306) [n:127.0.0.1:56955_solr    ] o.a.s.m.SolrMetricManager Closing metric reporters for: solr.core.MissingSegmentRecoveryTest.shard1.replica1
   [junit4]   2> 439361 INFO  (qtp1534658402-2306) [n:127.0.0.1:56955_solr    ] o.a.s.c.SolrCore [MissingSegmentRecoveryTest_shard1_replica1]  CLOSING SolrCore org.apache.solr.core.SolrCore@9b9f972
   [junit4]   2> 439369 INFO  (qtp1534658402-2306) [n:127.0.0.1:56955_solr    ] o.a.s.m.SolrMetricManager Closing metric reporters for: solr.core.MissingSegmentRecoveryTest.shard1.replica1
   [junit4]   2> 439376 INFO  (qtp2103792370-2379) [n:127.0.0.1:56954_solr    ] o.a.s.s.HttpSolrCall [admin] webapp=null path=/admin/cores params={deleteInstanceDir=true&core=MissingSegmentRecoveryTest_shard1_replica2&qt=/admin/cores&deleteDataDir=true&action=UNLOAD&wt=javabin&version=2} status=0 QTime=19
   [junit4]   2> 439401 INFO  (qtp1534658402-2306) [n:127.0.0.1:56955_solr    ] o.a.s.s.HttpSolrCall [admin] webapp=null path=/admin/cores params={deleteInstanceDir=true&core=MissingSegmentRecoveryTest_shard1_replica1&qt=/admin/cores&deleteDataDir=true&action=UNLOAD&wt=javabin&version=2} status=0 QTime=45
   [junit4]   2> 439405 INFO  (zkCallback-355-thread-2-processing-n:127.0.0.1:56954_solr) [n:127.0.0.1:56954_solr    ] o.a.s.c.c.ZkStateReader A cluster state change: [WatchedEvent state:SyncConnected type:NodeDataChanged path:/collections/MissingSegmentRecoveryTest/state.json] for collection [MissingSegmentRecoveryTest] has occurred - updating... (live nodes size: [2])
   [junit4]   2> 439512 INFO  (zkCallback-355-thread-2-processing-n:127.0.0.1:56954_solr) [n:127.0.0.1:56954_solr    ] o.a.s.c.c.ZkStateReader A cluster state change: [WatchedEvent state:SyncConnected type:NodeDeleted path:/collections/MissingSegmentRecoveryTest/state.json] for collection [MissingSegmentRecoveryTest] has occurred - updating... (live nodes size: [2])
   [junit4]   2> 440109 INFO  (qtp1534658402-2305) [n:127.0.0.1:56955_solr    ] o.a.s.s.HttpSolrCall [admin] webapp=null path=/admin/collections params={name=MissingSegmentRecoveryTest&action=DELETE&wt=javabin&version=2} status=0 QTime=760
   [junit4]   2> 440110 INFO  (TEST-MissingSegmentRecoveryTest.testLeaderRecovery-seed#[6C6CDF7F09088FC0]) [    ] o.a.s.SolrTestCaseJ4 ###Ending testLeaderRecovery
   [junit4]   2> NOTE: reproduce with: ant test  -Dtestcase=MissingSegmentRecoveryTest -Dtests.method=testLeaderRecovery -Dtests.seed=6C6CDF7F09088FC0 -Dtests.slow=true -Dtests.locale=es-CR -Dtests.timezone=Africa/Lubumbashi -Dtests.asserts=true -Dtests.file.encoding=UTF-8
   [junit4] FAILURE 95.1s J1 | MissingSegmentRecoveryTest.testLeaderRecovery <<<
   [junit4]    > Throwable #1: java.lang.AssertionError: Expected a collection with one shard and two replicas
   [junit4]    > null
   [junit4]    > Last available state: DocCollection(MissingSegmentRecoveryTest//collections/MissingSegmentRecoveryTest/state.json/7)={
   [junit4]    >   "replicationFactor":"2",
   [junit4]    >   "shards":{"shard1":{
   [junit4]    >       "range":"80000000-7fffffff",
   [junit4]    >       "state":"active",
   [junit4]    >       "replicas":{
   [junit4]    >         "core_node1":{
   [junit4]    >           "core":"MissingSegmentRecoveryTest_shard1_replica1",
   [junit4]    >           "base_url":"http://127.0.0.1:56955/solr",
   [junit4]    >           "node_name":"127.0.0.1:56955_solr",
   [junit4]    >           "state":"active",
   [junit4]    >           "leader":"true"},
   [junit4]    >         "core_node2":{
   [junit4]    >           "core":"MissingSegmentRecoveryTest_shard1_replica2",
   [junit4]    >           "base_url":"http://127.0.0.1:56954/solr",
   [junit4]    >           "node_name":"127.0.0.1:56954_solr",
   [junit4]    >           "state":"down"}}}},
   [junit4]    >   "router":{"name":"compositeId"},
   [junit4]    >   "maxShardsPerNode":"1",
   [junit4]    >   "autoAddReplicas":"false"}
   [junit4]    > 	at __randomizedtesting.SeedInfo.seed([6C6CDF7F09088FC0:3C39477C502939DD]:0)
   [junit4]    > 	at org.apache.solr.cloud.SolrCloudTestCase.waitForState(SolrCloudTestCase.java:265)
   [junit4]    > 	at org.apache.solr.cloud.MissingSegmentRecoveryTest.testLeaderRecovery(MissingSegmentRecoveryTest.java:105)
   [junit4]    > 	at java.lang.Thread.run(Thread.java:745)
   [junit4]   2> 440113 WARN  (NIOServerCxn.Factory:0.0.0.0/0.0.0.0:0) [    ] o.a.z.s.NIOServerCnxn caught end of stream exception
   [junit4]   2> EndOfStreamException: Unable to read additional data from client sessionid 0x15b8956dfae0008, likely client has closed socket
   [junit4]   2> 	at org.apache.zookeeper.server.NIOServerCnxn.doIO(NIOServerCnxn.java:228)
   [junit4]   2> 	at org.apache.zookeeper.server.NIOServerCnxnFactory.run(NIOServerCnxnFactory.java:208)
   [junit4]   2> 	at java.lang.Thread.run(Thread.java:745)
   [junit4]   2> 440116 INFO  (jetty-closer-333-thread-2) [    ] o.e.j.s.AbstractConnector Stopped ServerConnector@1fc51811{HTTP/1.1,[http/1.1]}{127.0.0.1:0}
   [junit4]   2> 440116 INFO  (jetty-closer-333-thread-1) [    ] o.e.j.s.AbstractConnector Stopped ServerConnector@6a0c60cd{HTTP/1.1,[http/1.1]}{127.0.0.1:56954}
   [junit4]   2> 440117 INFO  (jetty-closer-333-thread-2) [    ] o.a.s.c.CoreContainer Shutting down CoreContainer instance=421684471
   [junit4]   2> 440117 INFO  (jetty-closer-333-thread-1) [    ] o.a.s.c.CoreContainer Shutting down CoreContainer instance=872195874
   [junit4]   2> 440122 INFO  (jetty-closer-333-thread-2) [    ] o.a.s.c.Overseer Overseer (id=97822823131512838-127.0.0.1:56955_solr-n_0000000001) closing
   [junit4]   2> 440122 INFO  (OverseerStateUpdate-97822823131512838-127.0.0.1:56955_solr-n_0000000001) [n:127.0.0.1:56955_solr    ] o.a.s.c.Overseer Overseer Loop exiting : 127.0.0.1:56955_solr
   [junit4]   2> 440125 INFO  (jetty-closer-333-thread-1) [    ] o.a.s.m.SolrMetricManager Closing metric reporters for: solr.node
   [junit4]   2> 440125 INFO  (zkCallback-344-thread-3-processing-n:127.0.0.1:56955_solr) [n:127.0.0.1:56955_solr    ] o.a.s.c.c.ZkStateReader Updated live nodes from ZooKeeper... (2) -> (1)
   [junit4]   2> 440125 INFO  (jetty-closer-333-thread-1) [    ] o.e.j.s.h.ContextHandler Stopped o.e.j.s.ServletContextHandler@3147a36d{/solr,null,UNAVAILABLE}
   [junit4]   2> 440126 WARN  (zkCallback-344-thread-3-processing-n:127.0.0.1:56955_solr) [n:127.0.0.1:56955_solr    ] o.a.s.c.c.ZkStateReader ZooKeeper watch triggered, but Solr cannot talk to ZK: [KeeperErrorCode = Session expired for /live_nodes]
   [junit4]   2> 440126 WARN  (NIOServerCxn.Factory:0.0.0.0/0.0.0.0:0) [    ] o.a.z.s.NIOServerCnxn caught end of stream exception
   [junit4]   2> EndOfStreamException: Unable to read additional data from client sessionid 0x15b8956dfae0006, likely client has closed socket
   [junit4]   2> 	at org.apache.zookeeper.server.NIOServerCnxn.doIO(NIOServerCnxn.java:228)
   [junit4]   2> 	at org.apache.zookeeper.server.NIOServerCnxnFactory.run(NIOServerCnxnFactory.java:208)
   [junit4]   2> 	at java.lang.Thread.run(Thread.java:745)
   [junit4]   2> 440127 INFO  (jetty-closer-333-thread-2) [    ] o.a.s.m.SolrMetricManager Closing metric reporters for: solr.node
   [junit4]   2> 440128 INFO  (jetty-closer-333-thread-2) [    ] o.e.j.s.h.ContextHandler Stopped o.e.j.s.ServletContextHandler@3b256911{/solr,null,UNAVAILABLE}
   [junit4]   2> 440129 INFO  (SUITE-MissingSegmentRecoveryTest-seed#[6C6CDF7F09088FC0]-worker) [    ] o.a.s.c.ZkTestServer connecting to 127.0.0.1:56950 56950
   [junit4]   2> 440131 INFO  (Thread-526) [    ] o.a.s.c.ZkTestServer connecting to 127.0.0.1:56950 56950
   [junit4]   2> 440132 WARN  (Thread-526) [    ] o.a.s.c.ZkTestServer Watch limit violations: 
   [junit4]   2> Maximum concurrent create/delete watches above limit:
   [junit4]   2> 
   [junit4]   2> 	4	/solr/aliases.json
   [junit4]   2> 	4	/solr/clusterprops.json
   [junit4]   2> 	3	/solr/security.json
   [junit4]   2> 	2	/solr/configs/conf
   [junit4]   2> 
   [junit4]   2> Maximum concurrent data watches above limit:
   [junit4]   2> 
   [junit4]   2> 	4	/solr/clusterstate.json
   [junit4]   2> 	4	/solr/collections/MissingSegmentRecoveryTest/state.json
   [junit4]   2> 
   [junit4]   2> Maximum concurrent children watches above limit:
   [junit4]   2> 
   [junit4]   2> 	4	/solr/collections
   [junit4]   2> 	3	/solr/live_nodes
   [junit4]   2> 	2	/solr/overseer/queue
   [junit4]   2> 	2	/solr/overseer/collection-queue-work
   [junit4]   2> 
   [junit4]   2> 440132 INFO  (SUITE-MissingSegmentRecoveryTest-seed#[6C6CDF7F09088FC0]-worker) [    ] o.a.s.SolrTestCaseJ4 ###deleteCore
   [junit4]   2> NOTE: leaving temporary files on disk at: C:\Users\jenkins\workspace\Lucene-Solr-6.x-Windows\solr\build\solr-core\test\J1\temp\solr.cloud.MissingSegmentRecoveryTest_6C6CDF7F09088FC0-001
   [junit4]   2> Apr 20, 2017 3:11:59 AM com.carrotsearch.randomizedtesting.ThreadLeakControl checkThreadLeaks
   [junit4]   2> WARNING: Will linger awaiting termination of 4 leaked thread(s).
   [junit4]   2> NOTE: test params are: codec=Asserting(Lucene62): {_version_=PostingsFormat(name=Direct), id=PostingsFormat(name=LuceneVarGapDocFreqInterval)}, docValues:{}, maxPointsInLeafNode=1101, maxMBSortInHeap=5.485460826165801, sim=RandomSimilarity(queryNorm=true,coord=crazy): {}, locale=es-CR, timezone=Africa/Lubumbashi
   [junit4]   2> NOTE: Windows 10 10.0 amd64/Oracle Corporation 1.8.0_121 (64-bit)/cpus=3,threads=1,free=207478720,total=344457216
   [junit4]   2> NOTE: All tests run in this JVM: [TestOmitPositions, TestCollapseQParserPlugin, OverseerCollectionConfigSetProcessorTest, TestLMDirichletSimilarityFactory, TestSolr4Spatial, TestTrackingShardHandlerFactory, ReturnFieldsTest, TestManagedResourceStorage, OverseerRolesTest, TestSerializedLuceneMatchVersion, CleanupOldIndexTest, DocValuesMissingTest, FullSolrCloudDistribCmdsTest, HdfsRestartWhileUpdatingTest, TestFieldCacheWithThreads, OutOfBoxZkACLAndCredentialsProvidersTest, TestPathTrie, DistributedFacetPivotWhiteBoxTest, TestFieldSortValues, ZkSolrClientTest, TestRandomFaceting, TestScoreJoinQPScore, TestFieldCollectionResource, TestCrossCoreJoin, TestSolrQueryResponse, TestCloudRecovery, DistribCursorPagingTest, LeaderInitiatedRecoveryOnShardRestartTest, FileBasedSpellCheckerTest, TestQueryTypes, CurrencyFieldOpenExchangeTest, SolrIndexMetricsTest, TestPHPSerializedResponseWriter, LeaderElectionContextKeyTest, ScriptEngineTest, MissingSegmentRecoveryTest]
   [junit4] Completed [67/704 (1!)] on J1 in 96.60s, 1 test, 1 failure <<< FAILURES!

[...truncated 45464 lines...]


Mime
View raw message