lucene-dev mailing list archives

Site index · List index
Message view « Date » · « Thread »
Top « Date » · « Thread »
From Policeman Jenkins Server <jenk...@thetaphi.de>
Subject [JENKINS] Lucene-Solr-master-Linux (64bit/jdk1.8.0_121) - Build # 19498 - Unstable!
Date Thu, 27 Apr 2017 19:39:56 GMT
Build: https://jenkins.thetaphi.de/job/Lucene-Solr-master-Linux/19498/
Java: 64bit/jdk1.8.0_121 -XX:-UseCompressedOops -XX:+UseConcMarkSweepGC

1 tests failed.
FAILED:  org.apache.solr.handler.admin.StatsReloadRaceTest.testParallelReloadAndStats

Error Message:
Key SEARCHER.searcher.indexVersion not found in registry solr.core.collection1

Stack Trace:
java.lang.AssertionError: Key SEARCHER.searcher.indexVersion not found in registry solr.core.collection1
	at __randomizedtesting.SeedInfo.seed([2110CF39E198C13E:EE8EAA006E69A961]:0)
	at org.junit.Assert.fail(Assert.java:93)
	at org.junit.Assert.assertTrue(Assert.java:43)
	at org.apache.solr.handler.admin.StatsReloadRaceTest.requestMetrics(StatsReloadRaceTest.java:143)
	at org.apache.solr.handler.admin.StatsReloadRaceTest.testParallelReloadAndStats(StatsReloadRaceTest.java:77)
	at sun.reflect.NativeMethodAccessorImpl.invoke0(Native Method)
	at sun.reflect.NativeMethodAccessorImpl.invoke(NativeMethodAccessorImpl.java:62)
	at sun.reflect.DelegatingMethodAccessorImpl.invoke(DelegatingMethodAccessorImpl.java:43)
	at java.lang.reflect.Method.invoke(Method.java:498)
	at com.carrotsearch.randomizedtesting.RandomizedRunner.invoke(RandomizedRunner.java:1713)
	at com.carrotsearch.randomizedtesting.RandomizedRunner$8.evaluate(RandomizedRunner.java:907)
	at com.carrotsearch.randomizedtesting.RandomizedRunner$9.evaluate(RandomizedRunner.java:943)
	at com.carrotsearch.randomizedtesting.RandomizedRunner$10.evaluate(RandomizedRunner.java:957)
	at com.carrotsearch.randomizedtesting.rules.SystemPropertiesRestoreRule$1.evaluate(SystemPropertiesRestoreRule.java:57)
	at org.apache.lucene.util.TestRuleSetupTeardownChained$1.evaluate(TestRuleSetupTeardownChained.java:49)
	at org.apache.lucene.util.AbstractBeforeAfterRule$1.evaluate(AbstractBeforeAfterRule.java:45)
	at org.apache.lucene.util.TestRuleThreadAndTestName$1.evaluate(TestRuleThreadAndTestName.java:48)
	at org.apache.lucene.util.TestRuleIgnoreAfterMaxFailures$1.evaluate(TestRuleIgnoreAfterMaxFailures.java:64)
	at org.apache.lucene.util.TestRuleMarkFailure$1.evaluate(TestRuleMarkFailure.java:47)
	at com.carrotsearch.randomizedtesting.rules.StatementAdapter.evaluate(StatementAdapter.java:36)
	at com.carrotsearch.randomizedtesting.ThreadLeakControl$StatementRunner.run(ThreadLeakControl.java:368)
	at com.carrotsearch.randomizedtesting.ThreadLeakControl.forkTimeoutingTask(ThreadLeakControl.java:817)
	at com.carrotsearch.randomizedtesting.ThreadLeakControl$3.evaluate(ThreadLeakControl.java:468)
	at com.carrotsearch.randomizedtesting.RandomizedRunner.runSingleTest(RandomizedRunner.java:916)
	at com.carrotsearch.randomizedtesting.RandomizedRunner$5.evaluate(RandomizedRunner.java:802)
	at com.carrotsearch.randomizedtesting.RandomizedRunner$6.evaluate(RandomizedRunner.java:852)
	at com.carrotsearch.randomizedtesting.RandomizedRunner$7.evaluate(RandomizedRunner.java:863)
	at com.carrotsearch.randomizedtesting.rules.StatementAdapter.evaluate(StatementAdapter.java:36)
	at com.carrotsearch.randomizedtesting.rules.SystemPropertiesRestoreRule$1.evaluate(SystemPropertiesRestoreRule.java:57)
	at org.apache.lucene.util.AbstractBeforeAfterRule$1.evaluate(AbstractBeforeAfterRule.java:45)
	at com.carrotsearch.randomizedtesting.rules.StatementAdapter.evaluate(StatementAdapter.java:36)
	at org.apache.lucene.util.TestRuleStoreClassName$1.evaluate(TestRuleStoreClassName.java:41)
	at com.carrotsearch.randomizedtesting.rules.NoShadowingOrOverridesOnMethodsRule$1.evaluate(NoShadowingOrOverridesOnMethodsRule.java:40)
	at com.carrotsearch.randomizedtesting.rules.NoShadowingOrOverridesOnMethodsRule$1.evaluate(NoShadowingOrOverridesOnMethodsRule.java:40)
	at com.carrotsearch.randomizedtesting.rules.StatementAdapter.evaluate(StatementAdapter.java:36)
	at com.carrotsearch.randomizedtesting.rules.StatementAdapter.evaluate(StatementAdapter.java:36)
	at com.carrotsearch.randomizedtesting.rules.StatementAdapter.evaluate(StatementAdapter.java:36)
	at org.apache.lucene.util.TestRuleAssertionsRequired$1.evaluate(TestRuleAssertionsRequired.java:53)
	at org.apache.lucene.util.TestRuleMarkFailure$1.evaluate(TestRuleMarkFailure.java:47)
	at org.apache.lucene.util.TestRuleIgnoreAfterMaxFailures$1.evaluate(TestRuleIgnoreAfterMaxFailures.java:64)
	at org.apache.lucene.util.TestRuleIgnoreTestSuites$1.evaluate(TestRuleIgnoreTestSuites.java:54)
	at com.carrotsearch.randomizedtesting.rules.StatementAdapter.evaluate(StatementAdapter.java:36)
	at com.carrotsearch.randomizedtesting.ThreadLeakControl$StatementRunner.run(ThreadLeakControl.java:368)
	at java.lang.Thread.run(Thread.java:745)




Build Log:
[...truncated 12817 lines...]
   [junit4] Suite: org.apache.solr.handler.admin.StatsReloadRaceTest
   [junit4]   2> Creating dataDir: /home/jenkins/workspace/Lucene-Solr-master-Linux/solr/build/solr-core/test/J2/temp/solr.handler.admin.StatsReloadRaceTest_2110CF39E198C13E-001/init-core-data-001
   [junit4]   2> 1603975 WARN  (SUITE-StatsReloadRaceTest-seed#[2110CF39E198C13E]-worker) [    ] o.a.s.SolrTestCaseJ4 startTrackingSearchers: numOpens=3 numCloses=3
   [junit4]   2> 1603975 INFO  (SUITE-StatsReloadRaceTest-seed#[2110CF39E198C13E]-worker) [    ] o.a.s.SolrTestCaseJ4 Using TrieFields
   [junit4]   2> 1603976 INFO  (SUITE-StatsReloadRaceTest-seed#[2110CF39E198C13E]-worker) [    ] o.a.s.SolrTestCaseJ4 Randomized ssl (true) and clientAuth (true) via: @org.apache.solr.util.RandomizeSSL(reason=, value=NaN, ssl=NaN, clientAuth=NaN)
   [junit4]   2> 1603977 INFO  (SUITE-StatsReloadRaceTest-seed#[2110CF39E198C13E]-worker) [    ] o.a.s.SolrTestCaseJ4 ####initCore
   [junit4]   2> 1603977 INFO  (SUITE-StatsReloadRaceTest-seed#[2110CF39E198C13E]-worker) [    ] o.a.s.c.SolrResourceLoader [null] Added 2 libs to classloader, from paths: [/home/jenkins/workspace/Lucene-Solr-master-Linux/solr/core/src/test-files/solr/collection1/lib, /home/jenkins/workspace/Lucene-Solr-master-Linux/solr/core/src/test-files/solr/collection1/lib/classes]
   [junit4]   2> 1603998 INFO  (SUITE-StatsReloadRaceTest-seed#[2110CF39E198C13E]-worker) [    ] o.a.s.c.SolrConfig Using Lucene MatchVersion: 7.0.0
   [junit4]   2> 1604028 INFO  (SUITE-StatsReloadRaceTest-seed#[2110CF39E198C13E]-worker) [    ] o.a.s.s.IndexSchema [null] Schema name=test
   [junit4]   2> 1604109 WARN  (SUITE-StatsReloadRaceTest-seed#[2110CF39E198C13E]-worker) [    ] o.a.s.s.IndexSchema [null] default search field in schema is text. WARNING: Deprecated, please use 'df' on request instead.
   [junit4]   2> 1604111 INFO  (SUITE-StatsReloadRaceTest-seed#[2110CF39E198C13E]-worker) [    ] o.a.s.s.IndexSchema Loaded schema test/1.0 with uniqueid field id
   [junit4]   2> 1604132 INFO  (SUITE-StatsReloadRaceTest-seed#[2110CF39E198C13E]-worker) [    ] o.a.s.m.r.SolrJmxReporter JMX monitoring for 'solr.node' (registry 'solr.node') enabled at server: com.sun.jmx.mbeanserver.JmxMBeanServer@5a4750ee
   [junit4]   2> 1604135 INFO  (SUITE-StatsReloadRaceTest-seed#[2110CF39E198C13E]-worker) [    ] o.a.s.m.r.SolrJmxReporter JMX monitoring for 'solr.jvm' (registry 'solr.jvm') enabled at server: com.sun.jmx.mbeanserver.JmxMBeanServer@5a4750ee
   [junit4]   2> 1604135 INFO  (SUITE-StatsReloadRaceTest-seed#[2110CF39E198C13E]-worker) [    ] o.a.s.m.r.SolrJmxReporter JMX monitoring for 'solr.jetty' (registry 'solr.jetty') enabled at server: com.sun.jmx.mbeanserver.JmxMBeanServer@5a4750ee
   [junit4]   2> 1604137 INFO  (coreLoadExecutor-9255-thread-1) [    x:collection1] o.a.s.c.SolrResourceLoader [null] Added 2 libs to classloader, from paths: [/home/jenkins/workspace/Lucene-Solr-master-Linux/solr/core/src/test-files/solr/collection1/lib, /home/jenkins/workspace/Lucene-Solr-master-Linux/solr/core/src/test-files/solr/collection1/lib/classes]
   [junit4]   2> 1604168 INFO  (coreLoadExecutor-9255-thread-1) [    x:collection1] o.a.s.c.SolrConfig Using Lucene MatchVersion: 7.0.0
   [junit4]   2> 1604188 INFO  (coreLoadExecutor-9255-thread-1) [    x:collection1] o.a.s.s.IndexSchema [collection1] Schema name=test
   [junit4]   2> 1604277 WARN  (coreLoadExecutor-9255-thread-1) [    x:collection1] o.a.s.s.IndexSchema [collection1] default search field in schema is text. WARNING: Deprecated, please use 'df' on request instead.
   [junit4]   2> 1604280 INFO  (coreLoadExecutor-9255-thread-1) [    x:collection1] o.a.s.s.IndexSchema Loaded schema test/1.0 with uniqueid field id
   [junit4]   2> 1604305 INFO  (coreLoadExecutor-9255-thread-1) [    x:collection1] o.a.s.c.CoreContainer Creating SolrCore 'collection1' using configuration from instancedir /home/jenkins/workspace/Lucene-Solr-master-Linux/solr/core/src/test-files/solr/collection1, trusted=true
   [junit4]   2> 1604305 INFO  (coreLoadExecutor-9255-thread-1) [    x:collection1] o.a.s.m.r.SolrJmxReporter JMX monitoring for 'solr.core.collection1' (registry 'solr.core.collection1') enabled at server: com.sun.jmx.mbeanserver.JmxMBeanServer@5a4750ee
   [junit4]   2> 1604305 INFO  (coreLoadExecutor-9255-thread-1) [    x:collection1] o.a.s.c.SolrCore solr.RecoveryStrategy.Builder
   [junit4]   2> 1604305 INFO  (coreLoadExecutor-9255-thread-1) [    x:collection1] o.a.s.c.SolrCore [[collection1] ] Opening new SolrCore at [/home/jenkins/workspace/Lucene-Solr-master-Linux/solr/core/src/test-files/solr/collection1], dataDir=[/home/jenkins/workspace/Lucene-Solr-master-Linux/solr/build/solr-core/test/J2/temp/solr.handler.admin.StatsReloadRaceTest_2110CF39E198C13E-001/init-core-data-001/]
   [junit4]   2> 1604306 INFO  (coreLoadExecutor-9255-thread-1) [    x:collection1] o.a.s.u.RandomMergePolicy RandomMergePolicy wrapping class org.apache.lucene.index.TieredMergePolicy: [TieredMergePolicy: maxMergeAtOnce=48, maxMergeAtOnceExplicit=41, maxMergedSegmentMB=96.28125, floorSegmentMB=1.560546875, forceMergeDeletesPctAllowed=25.30310798828708, segmentsPerTier=10.0, maxCFSSegmentSizeMB=8.796093022207999E12, noCFSRatio=0.27392253520676957
   [junit4]   2> 1604343 INFO  (coreLoadExecutor-9255-thread-1) [    x:collection1] o.a.s.u.UpdateHandler Using UpdateLog implementation: org.apache.solr.update.UpdateLog
   [junit4]   2> 1604343 INFO  (coreLoadExecutor-9255-thread-1) [    x:collection1] o.a.s.u.UpdateLog Initializing UpdateLog: dataDir= defaultSyncLevel=FLUSH numRecordsToKeep=100 maxNumLogsToKeep=10 numVersionBuckets=65536
   [junit4]   2> 1604344 INFO  (coreLoadExecutor-9255-thread-1) [    x:collection1] o.a.s.u.CommitTracker Hard AutoCommit: disabled
   [junit4]   2> 1604344 INFO  (coreLoadExecutor-9255-thread-1) [    x:collection1] o.a.s.u.CommitTracker Soft AutoCommit: disabled
   [junit4]   2> 1604345 INFO  (coreLoadExecutor-9255-thread-1) [    x:collection1] o.a.s.u.RandomMergePolicy RandomMergePolicy wrapping class org.apache.lucene.index.LogByteSizeMergePolicy: [LogByteSizeMergePolicy: minMergeSize=1677721, mergeFactor=28, maxMergeSize=2147483648, maxMergeSizeForForcedMerge=9223372036854775807, calibrateSizeByDeletes=true, maxMergeDocs=2147483647, maxCFSSegmentSizeMB=1.453125, noCFSRatio=1.0]
   [junit4]   2> 1604345 INFO  (coreLoadExecutor-9255-thread-1) [    x:collection1] o.a.s.s.SolrIndexSearcher Opening [Searcher@640f09e2[collection1] main]
   [junit4]   2> 1604346 INFO  (coreLoadExecutor-9255-thread-1) [    x:collection1] o.a.s.h.c.SpellCheckComponent Initializing spell checkers
   [junit4]   2> 1604367 INFO  (coreLoadExecutor-9255-thread-1) [    x:collection1] o.a.s.s.DirectSolrSpellChecker init: {name=direct,classname=DirectSolrSpellChecker,field=lowerfilt,minQueryLength=3}
   [junit4]   2> 1604514 INFO  (coreLoadExecutor-9255-thread-1) [    x:collection1] o.a.s.h.ReplicationHandler Commits will be reserved for  10000
   [junit4]   2> 1604514 INFO  (searcherExecutor-9256-thread-1-processing-x:collection1) [    x:collection1] o.a.s.h.c.SpellCheckComponent Loading spell index for spellchecker: default
   [junit4]   2> 1604515 INFO  (coreLoadExecutor-9255-thread-1) [    x:collection1] o.a.s.u.UpdateLog Could not find max version in index or recent updates, using new clock 1565860527149678592
   [junit4]   2> 1604515 INFO  (searcherExecutor-9256-thread-1-processing-x:collection1) [    x:collection1] o.a.s.h.c.SpellCheckComponent Loading spell index for spellchecker: direct
   [junit4]   2> 1604515 INFO  (searcherExecutor-9256-thread-1-processing-x:collection1) [    x:collection1] o.a.s.h.c.SpellCheckComponent Loading spell index for spellchecker: wordbreak
   [junit4]   2> 1604515 INFO  (searcherExecutor-9256-thread-1-processing-x:collection1) [    x:collection1] o.a.s.h.c.SpellCheckComponent Loading spell index for spellchecker: multipleFields
   [junit4]   2> 1604515 INFO  (searcherExecutor-9256-thread-1-processing-x:collection1) [    x:collection1] o.a.s.h.c.SpellCheckComponent Loading spell index for spellchecker: jarowinkler
   [junit4]   2> 1604515 INFO  (searcherExecutor-9256-thread-1-processing-x:collection1) [    x:collection1] o.a.s.h.c.SpellCheckComponent Loading spell index for spellchecker: external
   [junit4]   2> 1604516 INFO  (searcherExecutor-9256-thread-1-processing-x:collection1) [    x:collection1] o.a.s.h.c.SpellCheckComponent Loading spell index for spellchecker: freq
   [junit4]   2> 1604516 INFO  (searcherExecutor-9256-thread-1-processing-x:collection1) [    x:collection1] o.a.s.h.c.SpellCheckComponent Loading spell index for spellchecker: fqcn
   [junit4]   2> 1604516 INFO  (searcherExecutor-9256-thread-1-processing-x:collection1) [    x:collection1] o.a.s.h.c.SpellCheckComponent Loading spell index for spellchecker: perDict
   [junit4]   2> 1604517 INFO  (searcherExecutor-9256-thread-1-processing-x:collection1) [    x:collection1] o.a.s.c.SolrCore [collection1] Registered new searcher Searcher@640f09e2[collection1] main{ExitableDirectoryReader(UninvertingDirectoryReader())}
   [junit4]   2> 1604518 INFO  (SUITE-StatsReloadRaceTest-seed#[2110CF39E198C13E]-worker) [    ] o.a.s.SolrTestCaseJ4 ####initCore end
   [junit4]   2> 1604520 INFO  (SUITE-StatsReloadRaceTest-seed#[2110CF39E198C13E]-worker) [    ] o.a.s.u.p.LogUpdateProcessorFactory [collection1]  webapp=null path=null params={}{add=[0 (1565860527152824320), 1 (1565860527153872896), 2 (1565860527153872897), 3 (1565860527153872898), 4 (1565860527153872899), 5 (1565860527154921472), 6 (1565860527154921473), 7 (1565860527154921474), 8 (1565860527154921475), 9 (1565860527154921476), ... (42 adds)]} 0 2
   [junit4]   2> 1604522 INFO  (SUITE-StatsReloadRaceTest-seed#[2110CF39E198C13E]-worker) [    ] o.a.s.u.DirectUpdateHandler2 start commit{,optimize=false,openSearcher=true,waitSearcher=true,expungeDeletes=false,softCommit=false,prepareCommit=false}
   [junit4]   2> 1604522 INFO  (SUITE-StatsReloadRaceTest-seed#[2110CF39E198C13E]-worker) [    ] o.a.s.u.SolrIndexWriter Calling setCommitData with IW:org.apache.solr.update.SolrIndexWriter@5b7ed894 commitCommandVersion:0
   [junit4]   2> 1604528 INFO  (SUITE-StatsReloadRaceTest-seed#[2110CF39E198C13E]-worker) [    ] o.a.s.s.SolrIndexSearcher Opening [Searcher@9959d51[collection1] main]
   [junit4]   2> 1604529 INFO  (SUITE-StatsReloadRaceTest-seed#[2110CF39E198C13E]-worker) [    ] o.a.s.u.DirectUpdateHandler2 end_commit_flush
   [junit4]   2> 1604530 INFO  (searcherExecutor-9256-thread-1) [    ] o.a.s.c.SolrCore [collection1] Registered new searcher Searcher@9959d51[collection1] main{ExitableDirectoryReader(UninvertingDirectoryReader(Uninverting(_0(7.0.0):c42)))}
   [junit4]   2> 1604531 INFO  (SUITE-StatsReloadRaceTest-seed#[2110CF39E198C13E]-worker) [    ] o.a.s.u.p.LogUpdateProcessorFactory [collection1]  webapp=null path=null params={}{commit=} 0 8
   [junit4]   2> 1604533 INFO  (TEST-StatsReloadRaceTest.testParallelReloadAndStats-seed#[2110CF39E198C13E]) [    ] o.a.s.SolrTestCaseJ4 ###Starting testParallelReloadAndStats
   [junit4]   2> 1604534 ERROR (parallelCoreAdminExecutor-9254-thread-1-processing-1 RELOAD) [    ] o.a.s.c.CorePropertiesLocator Couldn't load core descriptor from /home/jenkins/workspace/Lucene-Solr-master-Linux/solr/core/src/test-files/solr/collection1/core.properties:java.nio.file.NoSuchFileException: /home/jenkins/workspace/Lucene-Solr-master-Linux/solr/core/src/test-files/solr/collection1/core.properties
   [junit4]   2> 1604534 INFO  (parallelCoreAdminExecutor-9254-thread-1-processing-1 RELOAD) [    ] o.a.s.c.SolrResourceLoader [null] Added 2 libs to classloader, from paths: [/home/jenkins/workspace/Lucene-Solr-master-Linux/solr/core/src/test-files/solr/collection1/lib, /home/jenkins/workspace/Lucene-Solr-master-Linux/solr/core/src/test-files/solr/collection1/lib/classes]
   [junit4]   2> 1604535 INFO  (TEST-StatsReloadRaceTest.testParallelReloadAndStats-seed#[2110CF39E198C13E]) [    ] o.a.s.h.a.CoreAdminOperation Checking request status for : 1
   [junit4]   2> 1604536 INFO  (TEST-StatsReloadRaceTest.testParallelReloadAndStats-seed#[2110CF39E198C13E]) [    ] o.a.s.h.a.CoreAdminOperation Checking request status for : 1
   [junit4]   2> 1604537 INFO  (TEST-StatsReloadRaceTest.testParallelReloadAndStats-seed#[2110CF39E198C13E]) [    ] o.a.s.h.a.CoreAdminOperation Checking request status for : 1
   [junit4]   2> 1604537 INFO  (TEST-StatsReloadRaceTest.testParallelReloadAndStats-seed#[2110CF39E198C13E]) [    ] o.a.s.h.a.CoreAdminOperation Checking request status for : 1
   [junit4]   2> 1604538 INFO  (TEST-StatsReloadRaceTest.testParallelReloadAndStats-seed#[2110CF39E198C13E]) [    ] o.a.s.h.a.CoreAdminOperation Checking request status for : 1
   [junit4]   2> 1604538 INFO  (TEST-StatsReloadRaceTest.testParallelReloadAndStats-seed#[2110CF39E198C13E]) [    ] o.a.s.h.a.CoreAdminOperation Checking request status for : 1
   [junit4]   2> 1604539 INFO  (TEST-StatsReloadRaceTest.testParallelReloadAndStats-seed#[2110CF39E198C13E]) [    ] o.a.s.h.a.CoreAdminOperation Checking request status for : 1
   [junit4]   2> 1604540 INFO  (TEST-StatsReloadRaceTest.testParallelReloadAndStats-seed#[2110CF39E198C13E]) [    ] o.a.s.h.a.CoreAdminOperation Checking request status for : 1
   [junit4]   2> 1604540 INFO  (TEST-StatsReloadRaceTest.testParallelReloadAndStats-seed#[2110CF39E198C13E]) [    ] o.a.s.h.a.CoreAdminOperation Checking request status for : 1
   [junit4]   2> 1604541 INFO  (TEST-StatsReloadRaceTest.testParallelReloadAndStats-seed#[2110CF39E198C13E]) [    ] o.a.s.h.a.CoreAdminOperation Checking request status for : 1
   [junit4]   2> 1604541 INFO  (TEST-StatsReloadRaceTest.testParallelReloadAndStats-seed#[2110CF39E198C13E]) [    ] o.a.s.h.a.CoreAdminOperation Checking request status for : 1
   [junit4]   2> 1604542 INFO  (TEST-StatsReloadRaceTest.testParallelReloadAndStats-seed#[2110CF39E198C13E]) [    ] o.a.s.h.a.CoreAdminOperation Checking request status for : 1
   [junit4]   2> 1604542 INFO  (TEST-StatsReloadRaceTest.testParallelReloadAndStats-seed#[2110CF39E198C13E]) [    ] o.a.s.h.a.CoreAdminOperation Checking request status for : 1
   [junit4]   2> 1604543 INFO  (TEST-StatsReloadRaceTest.testParallelReloadAndStats-seed#[2110CF39E198C13E]) [    ] o.a.s.h.a.CoreAdminOperation Checking request status for : 1
   [junit4]   2> 1604543 INFO  (TEST-StatsReloadRaceTest.testParallelReloadAndStats-seed#[2110CF39E198C13E]) [    ] o.a.s.h.a.CoreAdminOperation Checking request status for : 1
   [junit4]   2> 1604543 INFO  (TEST-StatsReloadRaceTest.testParallelReloadAndStats-seed#[2110CF39E198C13E]) [    ] o.a.s.h.a.CoreAdminOperation Checking request status for : 1
   [junit4]   2> 1604544 INFO  (TEST-StatsReloadRaceTest.testParallelReloadAndStats-seed#[2110CF39E198C13E]) [    ] o.a.s.h.a.CoreAdminOperation Checking request status for : 1
   [junit4]   2> 1604544 INFO  (TEST-StatsReloadRaceTest.testParallelReloadAndStats-seed#[2110CF39E198C13E]) [    ] o.a.s.h.a.CoreAdminOperation Checking request status for : 1
   [junit4]   2> 1604545 INFO  (TEST-StatsReloadRaceTest.testParallelReloadAndStats-seed#[2110CF39E198C13E]) [    ] o.a.s.h.a.CoreAdminOperation Checking request status for : 1
   [junit4]   2> 1604545 INFO  (TEST-StatsReloadRaceTest.testParallelReloadAndStats-seed#[2110CF39E198C13E]) [    ] o.a.s.h.a.CoreAdminOperation Checking request status for : 1
   [junit4]   2> 1604545 INFO  (TEST-StatsReloadRaceTest.testParallelReloadAndStats-seed#[2110CF39E198C13E]) [    ] o.a.s.h.a.CoreAdminOperation Checking request status for : 1
   [junit4]   2> 1604545 INFO  (TEST-StatsReloadRaceTest.testParallelReloadAndStats-seed#[2110CF39E198C13E]) [    ] o.a.s.h.a.CoreAdminOperation Checking request status for : 1
   [junit4]   2> 1604546 INFO  (TEST-StatsReloadRaceTest.testParallelReloadAndStats-seed#[2110CF39E198C13E]) [    ] o.a.s.h.a.CoreAdminOperation Checking request status for : 1
   [junit4]   2> 1604547 INFO  (TEST-StatsReloadRaceTest.testParallelReloadAndStats-seed#[2110CF39E198C13E]) [    ] o.a.s.h.a.CoreAdminOperation Checking request status for : 1
   [junit4]   2> 1604548 INFO  (TEST-StatsReloadRaceTest.testParallelReloadAndStats-seed#[2110CF39E198C13E]) [    ] o.a.s.h.a.CoreAdminOperation Checking request status for : 1
   [junit4]   2> 1604549 INFO  (TEST-StatsReloadRaceTest.testParallelReloadAndStats-seed#[2110CF39E198C13E]) [    ] o.a.s.h.a.CoreAdminOperation Checking request status for : 1
   [junit4]   2> 1604549 INFO  (TEST-StatsReloadRaceTest.testParallelReloadAndStats-seed#[2110CF39E198C13E]) [    ] o.a.s.h.a.CoreAdminOperation Checking request status for : 1
   [junit4]   2> 1604550 INFO  (TEST-StatsReloadRaceTest.testParallelReloadAndStats-seed#[2110CF39E198C13E]) [    ] o.a.s.h.a.CoreAdminOperation Checking request status for : 1
   [junit4]   2> 1604550 INFO  (TEST-StatsReloadRaceTest.testParallelReloadAndStats-seed#[2110CF39E198C13E]) [    ] o.a.s.h.a.CoreAdminOperation Checking request status for : 1
   [junit4]   2> 1604550 INFO  (TEST-StatsReloadRaceTest.testParallelReloadAndStats-seed#[2110CF39E198C13E]) [    ] o.a.s.h.a.CoreAdminOperation Checking request status for : 1
   [junit4]   2> 1604550 INFO  (TEST-StatsReloadRaceTest.testParallelReloadAndStats-seed#[2110CF39E198C13E]) [    ] o.a.s.h.a.CoreAdminOperation Checking request status for : 1
   [junit4]   2> 1604550 INFO  (TEST-StatsReloadRaceTest.testParallelReloadAndStats-seed#[2110CF39E198C13E]) [    ] o.a.s.h.a.CoreAdminOperation Checking request status for : 1
   [junit4]   2> 1604551 INFO  (TEST-StatsReloadRaceTest.testParallelReloadAndStats-seed#[2110CF39E198C13E]) [    ] o.a.s.h.a.CoreAdminOperation Checking request status for : 1
   [junit4]   2> 1604551 INFO  (TEST-StatsReloadRaceTest.testParallelReloadAndStats-seed#[2110CF39E198C13E]) [    ] o.a.s.h.a.CoreAdminOperation Checking request status for : 1
   [junit4]   2> 1604551 INFO  (TEST-StatsReloadRaceTest.testParallelReloadAndStats-seed#[2110CF39E198C13E]) [    ] o.a.s.h.a.CoreAdminOperation Checking request status for : 1
   [junit4]   2> 1604552 INFO  (TEST-StatsReloadRaceTest.testParallelReloadAndStats-seed#[2110CF39E198C13E]) [    ] o.a.s.h.a.CoreAdminOperation Checking request status for : 1
   [junit4]   2> 1604552 INFO  (TEST-StatsReloadRaceTest.testParallelReloadAndStats-seed#[2110CF39E198C13E]) [    ] o.a.s.h.a.CoreAdminOperation Checking request status for : 1
   [junit4]   2> 1604552 INFO  (TEST-StatsReloadRaceTest.testParallelReloadAndStats-seed#[2110CF39E198C13E]) [    ] o.a.s.h.a.CoreAdminOperation Checking request status for : 1
   [junit4]   2> 1604552 INFO  (TEST-StatsReloadRaceTest.testParallelReloadAndStats-seed#[2110CF39E198C13E]) [    ] o.a.s.h.a.CoreAdminOperation Checking request status for : 1
   [junit4]   2> 1604552 INFO  (TEST-StatsReloadRaceTest.testParallelReloadAndStats-seed#[2110CF39E198C13E]) [    ] o.a.s.h.a.CoreAdminOperation Checking request status for : 1
   [junit4]   2> 1604553 INFO  (TEST-StatsReloadRaceTest.testParallelReloadAndStats-seed#[2110CF39E198C13E]) [    ] o.a.s.h.a.CoreAdminOperation Checking request status for : 1
   [junit4]   2> 1604553 INFO  (TEST-StatsReloadRaceTest.testParallelReloadAndStats-seed#[2110CF39E198C13E]) [    ] o.a.s.h.a.CoreAdminOperation Checking request status for : 1
   [junit4]   2> 1604554 INFO  (TEST-StatsReloadRaceTest.testParallelReloadAndStats-seed#[2110CF39E198C13E]) [    ] o.a.s.h.a.CoreAdminOperation Checking request status for : 1
   [junit4]   2> 1604554 INFO  (TEST-StatsReloadRaceTest.testParallelReloadAndStats-seed#[2110CF39E198C13E]) [    ] o.a.s.h.a.CoreAdminOperation Checking request status for : 1
   [junit4]   2> 1604555 INFO  (TEST-StatsReloadRaceTest.testParallelReloadAndStats-seed#[2110CF39E198C13E]) [    ] o.a.s.h.a.CoreAdminOperation Checking request status for : 1
   [junit4]   2> 1604555 INFO  (TEST-StatsReloadRaceTest.testParallelReloadAndStats-seed#[2110CF39E198C13E]) [    ] o.a.s.h.a.CoreAdminOperation Checking request status for : 1
   [junit4]   2> 1604555 INFO  (TEST-StatsReloadRaceTest.testParallelReloadAndStats-seed#[2110CF39E198C13E]) [    ] o.a.s.h.a.CoreAdminOperation Checking request status for : 1
   [junit4]   2> 1604555 INFO  (TEST-StatsReloadRaceTest.testParallelReloadAndStats-seed#[2110CF39E198C13E]) [    ] o.a.s.h.a.CoreAdminOperation Checking request status for : 1
   [junit4]   2> 1604556 INFO  (TEST-StatsReloadRaceTest.testParallelReloadAndStats-seed#[2110CF39E198C13E]) [    ] o.a.s.h.a.CoreAdminOperation Checking request status for : 1
   [junit4]   2> 1604557 INFO  (TEST-StatsReloadRaceTest.testParallelReloadAndStats-seed#[2110CF39E198C13E]) [    ] o.a.s.h.a.CoreAdminOperation Checking request status for : 1
   [junit4]   2> 1604557 INFO  (TEST-StatsReloadRaceTest.testParallelReloadAndStats-seed#[2110CF39E198C13E]) [    ] o.a.s.h.a.CoreAdminOperation Checking request status for : 1
   [junit4]   2> 1604558 INFO  (TEST-StatsReloadRaceTest.testParallelReloadAndStats-seed#[2110CF39E198C13E]) [    ] o.a.s.h.a.CoreAdminOperation Checking request status for : 1
   [junit4]   2> 1604558 INFO  (TEST-StatsReloadRaceTest.testParallelReloadAndStats-seed#[2110CF39E198C13E]) [    ] o.a.s.h.a.CoreAdminOperation Checking request status for : 1
   [junit4]   2> 1604559 INFO  (TEST-StatsReloadRaceTest.testParallelReloadAndStats-seed#[2110CF39E198C13E]) [    ] o.a.s.h.a.CoreAdminOperation Checking request status for : 1
   [junit4]   2> 1604560 INFO  (TEST-StatsReloadRaceTest.testParallelReloadAndStats-seed#[2110CF39E198C13E]) [    ] o.a.s.h.a.CoreAdminOperation Checking request status for : 1
   [junit4]   2> 1604561 INFO  (TEST-StatsReloadRaceTest.testParallelReloadAndStats-seed#[2110CF39E198C13E]) [    ] o.a.s.h.a.CoreAdminOperation Checking request status for : 1
   [junit4]   2> 1604561 INFO  (TEST-StatsReloadRaceTest.testParallelReloadAndStats-seed#[2110CF39E198C13E]) [    ] o.a.s.h.a.CoreAdminOperation Checking request status for : 1
   [junit4]   2> 1604562 INFO  (TEST-StatsReloadRaceTest.testParallelReloadAndStats-seed#[2110CF39E198C13E]) [    ] o.a.s.h.a.CoreAdminOperation Checking request status for : 1
   [junit4]   2> 1604562 INFO  (TEST-StatsReloadRaceTest.testParallelReloadAndStats-seed#[2110CF39E198C13E]) [    ] o.a.s.h.a.CoreAdminOperation Checking request status for : 1
   [junit4]   2> 1604562 INFO  (TEST-StatsReloadRaceTest.testParallelReloadAndStats-seed#[2110CF39E198C13E]) [    ] o.a.s.h.a.CoreAdminOperation Checking request status for : 1
   [junit4]   2> 1604563 INFO  (TEST-StatsReloadRaceTest.testParallelReloadAndStats-seed#[2110CF39E198C13E]) [    ] o.a.s.h.a.CoreAdminOperation Checking request status for : 1
   [junit4]   2> 1604564 INFO  (TEST-StatsReloadRaceTest.testParallelReloadAndStats-seed#[2110CF39E198C13E]) [    ] o.a.s.h.a.CoreAdminOperation Checking request status for : 1
   [junit4]   2> 1604564 INFO  (TEST-StatsReloadRaceTest.testParallelReloadAndStats-seed#[2110CF39E198C13E]) [    ] o.a.s.h.a.CoreAdminOperation Checking request status for : 1
   [junit4]   2> 1604564 INFO  (TEST-StatsReloadRaceTest.testParallelReloadAndStats-seed#[2110CF39E198C13E]) [    ] o.a.s.h.a.CoreAdminOperation Checking request status for : 1
   [junit4]   2> 1604565 INFO  (TEST-StatsReloadRaceTest.testParallelReloadAndStats-seed#[2110CF39E198C13E]) [    ] o.a.s.h.a.CoreAdminOperation Checking request status for : 1
   [junit4]   2> 1604566 INFO  (TEST-StatsReloadRaceTest.testParallelReloadAndStats-seed#[2110CF39E198C13E]) [    ] o.a.s.h.a.CoreAdminOperation Checking request status for : 1
   [junit4]   2> 1604566 INFO  (parallelCoreAdminExecutor-9254-thread-1-processing-1 RELOAD) [    ] o.a.s.c.SolrConfig Using Lucene MatchVersion: 7.0.0
   [junit4]   2> 1604566 INFO  (TEST-StatsReloadRaceTest.testParallelReloadAndStats-seed#[2110CF39E198C13E]) [    ] o.a.s.h.a.CoreAdminOperation Checking request status for : 1
   [junit4]   2> 1604566 INFO  (TEST-StatsReloadRaceTest.testParallelReloadAndStats-seed#[2110CF39E198C13E]) [    ] o.a.s.h.a.CoreAdminOperation Checking request status for : 1
   [junit4]   2> 1604567 INFO  (TEST-StatsReloadRaceTest.testParallelReloadAndStats-seed#[2110CF39E198C13E]) [    ] o.a.s.h.a.CoreAdminOperation Checking request status for : 1
   [junit4]   2> 1604568 INFO  (TEST-StatsReloadRaceTest.testParallelReloadAndStats-seed#[2110CF39E198C13E]) [    ] o.a.s.h.a.CoreAdminOperation Checking request status for : 1
   [junit4]   2> 1604568 INFO  (TEST-StatsReloadRaceTest.testParallelReloadAndStats-seed#[2110CF39E198C13E]) [    ] o.a.s.h.a.CoreAdminOperation Checking request status for : 1
   [junit4]   2> 1604569 INFO  (TEST-StatsReloadRaceTest.testParallelReloadAndStats-seed#[2110CF39E198C13E]) [    ] o.a.s.h.a.CoreAdminOperation Checking request status for : 1
   [junit4]   2> 1604569 INFO  (TEST-StatsReloadRaceTest.testParallelReloadAndStats-seed#[2110CF39E198C13E]) [    ] o.a.s.h.a.CoreAdminOperation Checking request status for : 1
   [junit4]   2> 1604570 INFO  (TEST-StatsReloadRaceTest.testParallelReloadAndStats-seed#[2110CF39E198C13E]) [    ] o.a.s.h.a.CoreAdminOperation Checking request status for : 1
   [junit4]   2> 1604570 INFO  (TEST-StatsReloadRaceTest.testParallelReloadAndStats-seed#[2110CF39E198C13E]) [    ] o.a.s.h.a.CoreAdminOperation Checking request status for : 1
   [junit4]   2> 1604571 INFO  (TEST-StatsReloadRaceTest.testParallelReloadAndStats-seed#[2110CF39E198C13E]) [    ] o.a.s.h.a.CoreAdminOperation Checking request status for : 1
   [junit4]   2> 1604572 INFO  (TEST-StatsReloadRaceTest.testParallelReloadAndStats-seed#[2110CF39E198C13E]) [    ] o.a.s.h.a.CoreAdminOperation Checking request status for : 1
   [junit4]   2> 1604572 INFO  (TEST-StatsReloadRaceTest.testParallelReloadAndStats-seed#[2110CF39E198C13E]) [    ] o.a.s.h.a.CoreAdminOperation Checking request status for : 1
   [junit4]   2> 1604572 INFO  (TEST-StatsReloadRaceTest.testParallelReloadAndStats-seed#[2110CF39E198C13E]) [    ] o.a.s.h.a.CoreAdminOperation Checking request status for : 1
   [junit4]   2> 1604573 INFO  (TEST-StatsReloadRaceTest.testParallelReloadAndStats-seed#[2110CF39E198C13E]) [    ] o.a.s.h.a.CoreAdminOperation Checking request status for : 1
   [junit4]   2> 1604573 INFO  (TEST-StatsReloadRaceTest.testParallelReloadAndStats-seed#[2110CF39E198C13E]) [    ] o.a.s.h.a.CoreAdminOperation Checking request status for : 1
   [junit4]   2> 1604574 INFO  (TEST-StatsReloadRaceTest.testParallelReloadAndStats-seed#[2110CF39E198C13E]) [    ] o.a.s.h.a.CoreAdminOperation Checking request status for : 1
   [junit4]   2> 1604574 INFO  (TEST-StatsReloadRaceTest.testParallelReloadAndStats-seed#[2110CF39E198C13E]) [    ] o.a.s.h.a.CoreAdminOperation Checking request status for : 1
   [junit4]   2> 1604574 INFO  (TEST-StatsReloadRaceTest.testParallelReloadAndStats-seed#[2110CF39E198C13E]) [    ] o.a.s.h.a.CoreAdminOperation Checking request status for : 1
   [junit4]   2> 1604574 INFO  (TEST-StatsReloadRaceTest.testParallelReloadAndStats-seed#[2110CF39E198C13E]) [    ] o.a.s.h.a.CoreAdminOperation Checking request status for : 1
   [junit4]   2> 1604574 INFO  (TEST-StatsReloadRaceTest.testParallelReloadAndStats-seed#[2110CF39E198C13E]) [    ] o.a.s.h.a.CoreAdminOperation Checking request status for : 1
   [junit4]   2> 1604575 INFO  (TEST-StatsReloadRaceTest.testParallelReloadAndStats-seed#[2110CF39E198C13E]) [    ] o.a.s.h.a.CoreAdminOperation Checking request status for : 1
   [junit4]   2> 1604575 INFO  (TEST-StatsReloadRaceTest.testParallelReloadAndStats-seed#[2110CF39E198C13E]) [    ] o.a.s.h.a.CoreAdminOperation Checking request status for : 1
   [junit4]   2> 1604576 INFO  (TEST-StatsReloadRaceTest.testParallelReloadAndStats-seed#[2110CF39E198C13E]) [    ] o.a.s.h.a.CoreAdminOperation Checking request status for : 1
   [junit4]   2> 1604576 INFO  (TEST-StatsReloadRaceTest.testParallelReloadAndStats-seed#[2110CF39E198C13E]) [    ] o.a.s.h.a.CoreAdminOperation Checking request status for : 1
   [junit4]   2> 1604576 INFO  (TEST-StatsReloadRaceTest.testParallelReloadAndStats-seed#[2110CF39E198C13E]) [    ] o.a.s.h.a.CoreAdminOperation Checking request status for : 1
   [junit4]   2> 1604577 INFO  (TEST-StatsReloadRaceTest.testParallelReloadAndStats-seed#[2110CF39E198C13E]) [    ] o.a.s.h.a.CoreAdminOperation Checking request status for : 1
   [junit4]   2> 1604577 INFO  (TEST-StatsReloadRaceTest.testParallelReloadAndStats-seed#[2110CF39E198C13E]) [    ] o.a.s.h.a.CoreAdminOperation Checking request status for : 1
   [junit4]   2> 1604577 INFO  (TEST-StatsReloadRaceTest.testParallelReloadAndStats-seed#[2110CF39E198C13E]) [    ] o.a.s.h.a.CoreAdminOperation Checking request status for : 1
   [junit4]   2> 1604577 INFO  (TEST-StatsReloadRaceTest.testParallelReloadAndStats-seed#[2110CF39E198C13E]) [    ] o.a.s.h.a.CoreAdminOperation Checking request status for : 1
   [junit4]   2> 1604578 INFO  (TEST-StatsReloadRaceTest.testParallelReloadAndStats-seed#[2110CF39E198C13E]) [    ] o.a.s.h.a.CoreAdminOperation Checking request status for : 1
   [junit4]   2> 1604578 INFO  (TEST-StatsReloadRaceTest.testParallelReloadAndStats-seed#[2110CF39E198C13E]) [    ] o.a.s.h.a.CoreAdminOperation Checking request status for : 1
   [junit4]   2> 1604579 INFO  (TEST-StatsReloadRaceTest.testParallelReloadAndStats-seed#[2110CF39E198C13E]) [    ] o.a.s.h.a.CoreAdminOperation Checking request status for : 1
   [junit4]   2> 1604579 INFO  (TEST-StatsReloadRaceTest.testParallelReloadAndStats-seed#[2110CF39E198C13E]) [    ] o.a.s.h.a.CoreAdminOperation Checking request status for : 1
   [junit4]   2> 1604579 INFO  (TEST-StatsReloadRaceTest.testParallelReloadAndStats-seed#[2110CF39E198C13E]) [    ] o.a.s.h.a.CoreAdminOperation Checking request status for : 1
   [junit4]   2> 1604579 INFO  (TEST-StatsReloadRaceTest.testParallelReloadAndStats-seed#[2110CF39E198C13E]) [    ] o.a.s.h.a.CoreAdminOperation Checking request status for : 1
   [junit4]   2> 1604579 INFO  (TEST-StatsReloadRaceTest.testParallelReloadAndStats-seed#[2110CF39E198C13E]) [    ] o.a.s.h.a.CoreAdminOperation Checking request status for : 1
   [junit4]   2> 1604580 INFO  (TEST-StatsReloadRaceTest.testParallelReloadAndStats-seed#[2110CF39E198C13E]) [    ] o.a.s.h.a.CoreAdminOperation Checking request status for : 1
   [junit4]   2> 1604580 INFO  (TEST-StatsReloadRaceTest.testParallelReloadAndStats-seed#[2110CF39E198C13E]) [    ] o.a.s.h.a.CoreAdminOperation Checking request status for : 1
   [junit4]   2> 1604580 INFO  (TEST-StatsReloadRaceTest.testParallelReloadAndStats-seed#[2110CF39E198C13E]) [    ] o.a.s.h.a.CoreAdminOperation Checking request status for : 1
   [junit4]   2> 1604580 INFO  (TEST-StatsReloadRaceTest.testParallelReloadAndStats-seed#[2110CF39E198C13E]) [    ] o.a.s.h.a.CoreAdminOperation Checking request status for : 1
   [junit4]   2> 1604581 INFO  (TEST-StatsReloadRaceTest.testParallelReloadAndStats-seed#[2110CF39E198C13E]) [    ] o.a.s.h.a.CoreAdminOperation Checking request status for : 1
   [junit4]   2> 1604581 INFO  (TEST-StatsReloadRaceTest.testParallelReloadAndStats-seed#[2110CF39E198C13E]) [    ] o.a.s.h.a.CoreAdminOperation Checking request status for : 1
   [junit4]   2> 1604581 INFO  (TEST-StatsReloadRaceTest.testParallelReloadAndStats-seed#[2110CF39E198C13E]) [    ] o.a.s.h.a.CoreAdminOperation Checking request status for : 1
   [junit4]   2> 1604581 INFO  (TEST-StatsReloadRaceTest.testParallelReloadAndStats-seed#[2110CF39E198C13E]) [    ] o.a.s.h.a.CoreAdminOperation Checking request status for : 1
   [junit4]   2> 1604582 INFO  (TEST-StatsReloadRaceTest.testParallelReloadAndStats-seed#[2110CF39E198C13E]) [    ] o.a.s.h.a.CoreAdminOperation Checking request status for : 1
   [junit4]   2> 1604583 INFO  (TEST-StatsReloadRaceTest.testParallelReloadAndStats-seed#[2110CF39E198C13E]) [    ] o.a.s.h.a.CoreAdminOperation Checking request status for : 1
   [junit4]   2> 1604583 INFO  (TEST-StatsReloadRaceTest.testParallelReloadAndStats-seed#[2110CF39E198C13E]) [    ] o.a.s.h.a.CoreAdminOperation Checking request status for : 1
   [junit4]   2> 1604583 INFO  (TEST-StatsReloadRaceTest.testParallelReloadAndStats-seed#[2110CF39E198C13E]) [    ] o.a.s.h.a.CoreAdminOperation Checking request status for : 1
   [junit4]   2> 1604583 INFO  (TEST-StatsReloadRaceTest.testParallelReloadAndStats-seed#[2110CF39E198C13E]) [    ] o.a.s.h.a.CoreAdminOperation Checking request status for : 1
   [junit4]   2> 1604584 INFO  (TEST-StatsReloadRaceTest.testParallelReloadAndStats-seed#[2110CF39E198C13E]) [    ] o.a.s.h.a.CoreAdminOperation Checking request status for : 1
   [junit4]   2> 1604584 INFO  (TEST-StatsReloadRaceTest.testParallelReloadAndStats-seed#[2110CF39E198C13E]) [    ] o.a.s.h.a.CoreAdminOperation Checking request status for : 1
   [junit4]   2> 1604585 INFO  (TEST-StatsReloadRaceTest.testParallelReloadAndStats-seed#[2110CF39E198C13E]) [    ] o.a.s.h.a.CoreAdminOperation Checking request status for : 1
   [junit4]   2> 1604585 INFO  (TEST-StatsReloadRaceTest.testParallelReloadAndStats-seed#[2110CF39E198C13E]) [    ] o.a.s.h.a.CoreAdminOperation Checking request status for : 1
   [junit4]   2> 1604585 INFO  (TEST-StatsReloadRaceTest.testParallelReloadAndStats-seed#[2110CF39E198C13E]) [    ] o.a.s.h.a.CoreAdminOperation Checking request status for : 1
   [junit4]   2> 1604585 INFO  (TEST-StatsReloadRaceTest.testParallelReloadAndStats-seed#[2110CF39E198C13E]) [    ] o.a.s.h.a.CoreAdminOperation Checking request status for : 1
   [junit4]   2> 1604586 INFO  (TEST-StatsReloadRaceTest.testParallelReloadAndStats-seed#[2110CF39E198C13E]) [    ] o.a.s.h.a.CoreAdminOperation Checking request status for : 1
   [junit4]   2> 1604586 INFO  (TEST-StatsReloadRaceTest.testParallelReloadAndStats-seed#[2110CF39E198C13E]) [    ] o.a.s.h.a.CoreAdminOperation Checking request status for : 1
   [junit4]   2> 1604586 INFO  (parallelCoreAdminExecutor-9254-thread-1-processing-1 RELOAD) [    ] o.a.s.s.IndexSchema [collection1] Schema name=test
   [junit4]   2> 1604586 INFO  (TEST-StatsReloadRaceTest.testParallelReloadAndStats-seed#[2110CF39E198C13E]) [    ] o.a.s.h.a.CoreAdminOperation Checking request status for : 1
   [junit4]   2> 1604587 INFO  (TEST-StatsReloadRaceTest.testParallelReloadAndStats-seed#[2110CF39E198C13E]) [    ] o.a.s.h.a.CoreAdminOperation Checking request status for : 1
   [junit4]   2> 1604587 INFO  (TEST-StatsReloadRaceTest.testParallelReloadAndStats-seed#[2110CF39E198C13E]) [    ] o.a.s.h.a.CoreAdminOperation Checking request status for : 1
   [junit4]   2> 1604587 INFO  (TEST-StatsReloadRaceTest.testParallelReloadAndStats-seed#[2110CF39E198C13E]) [    ] o.a.s.h.a.CoreAdminOperation Checking request status for : 1
   [junit4]   2> 1604587 INFO  (TEST-StatsReloadRaceTest.testParallelReloadAndStats-seed#[2110CF39E198C13E]) [    ] o.a.s.h.a.CoreAdminOperation Checking request status for : 1
   [junit4]   2> 1604588 INFO  (TEST-StatsReloadRaceTest.testParallelReloadAndStats-seed#[2110CF39E198C13E]) [    ] o.a.s.h.a.CoreAdminOperation Checking request status for : 1
   [junit4]   2> 1604588 INFO  (TEST-StatsReloadRaceTest.testParallelReloadAndStats-seed#[2110CF39E198C13E]) [    ] o.a.s.h.a.CoreAdminOperation Checking request status for : 1
   [junit4]   2> 1604588 INFO  (TEST-StatsReloadRaceTest.testParallelReloadAndStats-seed#[2110CF39E198C13E]) [    ] o.a.s.h.a.CoreAdminOperation Checking request status for : 1
   [junit4]   2> 1604588 INFO  (TEST-StatsReloadRaceTest.testParallelReloadAndStats-seed#[2110CF39E198C13E]) [    ] o.a.s.h.a.CoreAdminOperation Checking request status for : 1
   [junit4]   2> 1604588 INFO  (TEST-StatsReloadRaceTest.testParallelReloadAndStats-seed#[2110CF39E198C13E]) [    ] o.a.s.h.a.CoreAdminOperation Checking request status for : 1
   [junit4]   2> 1604588 INFO  (TEST-StatsReloadRaceTest.testParallelReloadAndStats-seed#[2110CF39E198C13E]) [    ] o.a.s.h.a.CoreAdminOperation Checking request status for : 1
   [junit4]   2> 1604588 INFO  (TEST-StatsReloadRaceTest.testParallelReloadAndStats-seed#[2110CF39E198C13E]) [    ] o.a.s.h.a.CoreAdminOperation Checking request status for : 1
   [junit4]   2> 1604589 INFO  (TEST-StatsReloadRaceTest.testParallelReloadAndStats-seed#[2110CF39E198C13E]) [    ] o.a.s.h.a.CoreAdminOperation Checking request status for : 1
   [junit4]   2> 1604589 INFO  (TEST-StatsReloadRaceTest.testParallelReloadAndStats-seed#[2110CF39E198C13E]) [    ] o.a.s.h.a.CoreAdminOperation Checking request status for : 1
   [junit4]   2> 1604590 INFO  (TEST-StatsReloadRaceTest.testParallelReloadAndStats-seed#[2110CF39E198C13E]) [    ] o.a.s.h.a.CoreAdminOperation Checking request status for : 1
   [junit4]   2> 1604590 INFO  (TEST-StatsReloadRaceTest.testParallelReloadAndStats-seed#[2110CF39E198C13E]) [    ] o.a.s.h.a.CoreAdminOperation Checking request status for : 1
   [junit4]   2> 1604591 INFO  (TEST-StatsReloadRaceTest.testParallelReloadAndStats-seed#[2110CF39E198C13E]) [    ] o.a.s.h.a.CoreAdminOperation Checking request status for : 1
   [junit4]   2> 1604591 INFO  (TEST-StatsReloadRaceTest.testParallelReloadAndStats-seed#[2110CF39E198C13E]) [    ] o.a.s.h.a.CoreAdminOperation Checking request status for : 1
   [junit4]   2> 1604591 INFO  (TEST-StatsReloadRaceTest.testParallelReloadAndStats-seed#[2110CF39E198C13E]) [    ] o.a.s.h.a.CoreAdminOperation Checking request status for : 1
   [junit4]   2> 1604591 INFO  (TEST-StatsReloadRaceTest.testParallelReloadAndStats-seed#[2110CF39E198C13E]) [    ] o.a.s.h.a.CoreAdminOperation Checking request status for : 1
   [junit4]   2> 1604591 INFO  (TEST-StatsReloadRaceTest.testParallelReloadAndStats-seed#[2110CF39E198C13E]) [    ] o.a.s.h.a.CoreAdminOperation Checking request status for : 1
   [junit4]   2> 1604592 INFO  (TEST-StatsReloadRaceTest.testParallelReloadAndStats-seed#[2110CF39E198C13E]) [    ] o.a.s.h.a.CoreAdminOperation Checking request status for : 1
   [junit4]   2> 1604592 INFO  (TEST-StatsReloadRaceTest.testParallelReloadAndStats-seed#[2110CF39E198C13E]) [    ] o.a.s.h.a.CoreAdminOperation Checking request status for : 1
   [junit4]   2> 1604592 INFO  (TEST-StatsReloadRaceTest.testParallelReloadAndStats-seed#[2110CF39E198C13E]) [    ] o.a.s.h.a.CoreAdminOperation Checking request status for : 1
   [junit4]   2> 1604598 INFO  (TEST-StatsReloadRaceTest.testParallelReloadAndStats-seed#[2110CF39E198C13E]) [    ] o.a.s.h.a.CoreAdminOperation Checking request status for : 1
   [junit4]   2> 1604598 INFO  (TEST-StatsReloadRaceTest.testParallelReloadAndStats-seed#[2110CF39E198C13E]) [    ] o.a.s.h.a.CoreAdminOperation Checking request status for : 1
   [junit4]   2> 1604599 INFO  (TEST-StatsReloadRaceTest.testParallelReloadAndStats-seed#[2110CF39E198C13E]) [    ] o.a.s.h.a.CoreAdminOperation Checking request status for : 1
   [junit4]   2> 1604599 INFO  (TEST-StatsReloadRaceTest.testParallelReloadAndStats-seed#[2110CF39E198C13E]) [    ] o.a.s.h.a.CoreAdminOperation Checking request status for : 1
   [junit4]   2> 1604600 INFO  (TEST-StatsReloadRaceTest.testParallelReloadAndStats-seed#[2110CF39E198C13E]) [    ] o.a.s.h.a.CoreAdminOperation Checking request status for : 1
   [junit4]   2> 1604600 INFO  (TEST-StatsReloadRaceTest.testParallelReloadAndStats-seed#[2110CF39E198C13E]) [    ] o.a.s.h.a.CoreAdminOperation Checking request status for : 1
   [junit4]   2> 1604600 INFO  (TEST-StatsReloadRaceTest.testParallelReloadAndStats-seed#[2110CF39E198C13E]) [    ] o.a.s.h.a.CoreAdminOperation Checking request status for : 1
   [junit4]   2> 1604600 INFO  (TEST-StatsReloadRaceTest.testParallelReloadAndStats-seed#[2110CF39E198C13E]) [    ] o.a.s.h.a.CoreAdminOperation Checking request status for : 1
   [junit4]   2> 1604601 INFO  (TEST-StatsReloadRaceTest.testParallelReloadAndStats-seed#[2110CF39E198C13E]) [    ] o.a.s.h.a.CoreAdminOperation Checking request status for : 1
   [junit4]   2> 1604601 INFO  (TEST-StatsReloadRaceTest.testParallelReloadAndStats-seed#[2110CF39E198C13E]) [    ] o.a.s.h.a.CoreAdminOperation Checking request status for : 1
   [junit4]   2> 1604601 INFO  (TEST-StatsReloadRaceTest.testParallelReloadAndStats-seed#[2110CF39E198C13E]) [    ] o.a.s.h.a.CoreAdminOperation Checking request status for : 1
   [junit4]   2> 1604601 INFO  (TEST-StatsReloadRaceTest.testParallelReloadAndStats-seed#[2110CF39E198C13E]) [    ] o.a.s.h.a.CoreAdminOperation Checking request status for : 1
   [junit4]   2> 1604602 INFO  (TEST-StatsReloadRaceTest.testParallelReloadAndStats-seed#[2110CF39E198C13E]) [    ] o.a.s.h.a.CoreAdminOperation Checking request status for : 1
   [junit4]   2> 1604602 INFO  (TEST-StatsReloadRaceTest.testParallelReloadAndStats-seed#[2110CF39E198C13E]) [    ] o.a.s.h.a.CoreAdminOperation Checking request status for : 1
   [junit4]   2> 1604603 INFO  (TEST-StatsReloadRaceTest.testParallelReloadAndStats-seed#[2110CF39E198C13E]) [    ] o.a.s.h.a.CoreAdminOperation Checking request status for : 1
   [junit4]   2> 1604603 INFO  (TEST-StatsReloadRaceTest.testParallelReloadAndStats-seed#[2110CF39E198C13E]) [    ] o.a.s.h.a.CoreAdminOperation Checking request status for : 1
   [junit4]   2> 1604603 INFO  (TEST-StatsReloadRaceTest.testParallelReloadAndStats-seed#[2110CF39E198C13E]) [    ] o.a.s.h.a.CoreAdminOperation Checking request status for : 1
   [junit4]   2> 1604604 INFO  (TEST-StatsReloadRaceTest.testParallelReloadAndStats-seed#[2110CF39E198C13E]) [    ] o.a.s.h.a.CoreAdminOperation Checking request status for : 1
   [junit4]   2> 1604604 INFO  (TEST-StatsReloadRaceTest.testParallelReloadAndStats-seed#[2110CF39E198C13E]) [    ] o.a.s.h.a.CoreAdminOperation Checking request status for : 1
   [junit4]   2> 1604605 INFO  (TEST-StatsReloadRaceTest.testParallelReloadAndStats-seed#[2110CF39E198C13E]) [    ] o.a.s.h.a.CoreAdminOperation Checking request status for : 1
   [junit4]   2> 1604606 INFO  (TEST-StatsReloadRaceTest.testParallelReloadAndStats-seed#[2110CF39E198C13E]) [    ] o.a.s.h.a.CoreAdminOperation Checking request status for : 1
   [junit4]   2> 1604607 INFO  (TEST-StatsReloadRaceTest.testParallelReloadAndStats-seed#[2110CF39E198C13E]) [    ] o.a.s.h.a.CoreAdminOperation Checking request status for : 1
   [junit4]   2> 1604608 INFO  (TEST-StatsReloadRaceTest.testParallelReloadAndStats-seed#[2110CF39E198C13E]) [    ] o.a.s.h.a.CoreAdminOperation Checking request status for : 1
   [junit4]   2> 1604608 INFO  (TEST-StatsReloadRaceTest.testParallelReloadAndStats-seed#[2110CF39E198C13E]) [    ] o.a.s.h.a.CoreAdminOperation Checking request status for : 1
   [junit4]   2> 1604609 INFO  (TEST-StatsReloadRaceTest.testParallelReloadAndStats-seed#[2110CF39E198C13E]) [    ] o.a.s.h.a.CoreAdminOperation Checking request status for : 1
   [junit4]   2> 1604609 INFO  (TEST-StatsReloadRaceTest.testParallelReloadAndStats-seed#[2110CF39E198C13E]) [    ] o.a.s.h.a.CoreAdminOperation Checking request status for : 1
   [junit4]   2> 1604609 INFO  (TEST-StatsReloadRaceTest.testParallelReloadAndStats-seed#[2110CF39E198C13E]) [    ] o.a.s.h.a.CoreAdminOperation Checking request status for : 1
   [junit4]   2> 1604610 INFO  (TEST-StatsReloadRaceTest.testParallelReloadAndStats-seed#[2110CF39E198C13E]) [    ] o.a.s.h.a.CoreAdminOperation Checking request status for : 1
   [junit4]   2> 1604610 INFO  (TEST-StatsReloadRaceTest.testParallelReloadAndStats-seed#[2110CF39E198C13E]) [    ] o.a.s.h.a.CoreAdminOperation Checking request status for : 1
   [junit4]   2> 1604610 INFO  (TEST-StatsReloadRaceTest.testParallelReloadAndStats-seed#[2110CF39E198C13E]) [    ] o.a.s.h.a.CoreAdminOperation Checking request status for : 1
   [junit4]   2> 1604610 INFO  (TEST-StatsReloadRaceTest.testParallelReloadAndStats-seed#[2110CF39E198C13E]) [    ] o.a.s.h.a.CoreAdminOperation Checking request status for : 1
   [junit4]   2> 1604611 INFO  (TEST-StatsReloadRaceTest.testParallelReloadAndStats-seed#[2110CF39E198C13E]) [    ] o.a.s.h.a.CoreAdminOperation Checking request status for : 1
   [junit4]   2> 1604611 INFO  (TEST-StatsReloadRaceTest.testParallelReloadAndStats-seed#[2110CF39E198C13E]) [    ] o.a.s.h.a.CoreAdminOperation Checking request status for : 1
   [junit4]   2> 1604612 INFO  (TEST-StatsReloadRaceTest.testParallelReloadAndStats-seed#[2110CF39E198C13E]) [    ] o.a.s.h.a.CoreAdminOperation Checking request status for : 1
   [junit4]   2> 1604612 INFO  (TEST-StatsReloadRaceTest.testParallelReloadAndStats-seed#[2110CF39E198C13E]) [    ] o.a.s.h.a.CoreAdminOperation Checking request status for : 1
   [junit4]   2> 1604612 INFO  (TEST-StatsReloadRaceTest.testParallelReloadAndStats-seed#[2110CF39E198C13E]) [    ] o.a.s.h.a.CoreAdminOperation Checking request status for : 1
   [junit4]   2> 1604613 INFO  (TEST-StatsReloadRaceTest.testParallelReloadAndStats-seed#[2110CF39E198C13E]) [    ] o.a.s.h.a.CoreAdminOperation Checking request status for : 1
   [junit4]   2> 1604613 INFO  (TEST-StatsReloadRaceTest.testParallelReloadAndStats-seed#[2110CF39E198C13E]) [    ] o.a.s.h.a.CoreAdminOperation Checking request status for : 1
   [junit4]   2> 1604613 INFO  (TEST-StatsReloadRaceTest.testParallelReloadAndStats-seed#[2110CF39E198C13E]) [    ] o.a.s.h.a.CoreAdminOperation Checking request status for : 1
   [junit4]   2> 1604613 INFO  (TEST-StatsReloadRaceTest.testParallelReloadAndStats-seed#[2110CF39E198C13E]) [    ] o.a.s.h.a.CoreAdminOperation Checking request status for : 1
   [junit4]   2> 1604613 INFO  (TEST-StatsReloadRaceTest.testParallelReloadAndStats-seed#[2110CF39E198C13E]) [    ] o.a.s.h.a.CoreAdminOperation Checking request status for : 1
   [junit4]   2> 1604614 INFO  (TEST-StatsReloadRaceTest.testParallelReloadAndStats-seed#[2110CF39E198C13E]) [    ] o.a.s.h.a.CoreAdminOperation Checking request status for : 1
   [junit4]   2> 1604614 INFO  (TEST-StatsReloadRaceTest.testParallelReloadAndStats-seed#[2110CF39E198C13E]) [    ] o.a.s.h.a.CoreAdminOperation Checking request status for : 1
   [junit4]   2> 1604615 INFO  (TEST-StatsReloadRaceTest.testParallelReloadAndStats-seed#[2110CF39E198C13E]) [    ] o.a.s.h.a.CoreAdminOperation Checking request status for : 1
   [junit4]   2> 1604615 INFO  (TEST-StatsReloadRaceTest.testParallelReloadAndStats-seed#[2110CF39E198C13E]) [    ] o.a.s.h.a.CoreAdminOperation Checking request status for : 1
   [junit4]   2> 1604615 INFO  (TEST-StatsReloadRaceTest.testParallelReloadAndStats-seed#[2110CF39E198C13E]) [    ] o.a.s.h.a.CoreAdminOperation Checking request status for : 1
   [junit4]   2> 1604616 INFO  (TEST-StatsReloadRaceTest.testParallelReloadAndStats-seed#[2110CF39E198C13E]) [    ] o.a.s.h.a.CoreAdminOperation Checking request status for : 1
   [junit4]   2> 1604616 INFO  (TEST-StatsReloadRaceTest.testParallelReloadAndStats-seed#[2110CF39E198C13E]) [    ] o.a.s.h.a.CoreAdminOperation Checking request status for : 1
   [junit4]   2> 1604616 INFO  (TEST-StatsReloadRaceTest.testParallelReloadAndStats-seed#[2110CF39E198C13E]) [    ] o.a.s.h.a.CoreAdminOperation Checking request status for : 1
   [junit4]   2> 1604617 INFO  (TEST-StatsReloadRaceTest.testParallelReloadAndStats-seed#[2110CF39E198C13E]) [    ] o.a.s.h.a.CoreAdminOperation Checking request status for : 1
   [junit4]   2> 1604617 INFO  (TEST-StatsReloadRaceTest.testParallelReloadAndStats-seed#[2110CF39E198C13E]) [    ] o.a.s.h.a.CoreAdminOperation Checking request status for : 1
   [junit4]   2> 1604617 INFO  (TEST-StatsReloadRaceTest.testParallelReloadAndStats-seed#[2110CF39E198C13E]) [    ] o.a.s.h.a.CoreAdminOperation Checking request status for : 1
   [junit4]   2> 1604617 INFO  (TEST-StatsReloadRaceTest.testParallelReloadAndStats-seed#[2110CF39E198C13E]) [    ] o.a.s.h.a.CoreAdminOperation Checking request status for : 1
   [junit4]   2> 1604617 INFO  (TEST-StatsReloadRaceTest.testParallelReloadAndStats-seed#[2110CF39E198C13E]) [    ] o.a.s.h.a.CoreAdminOperation Checking request status for : 1
   [junit4]   2> 1604618 INFO  (TEST-StatsReloadRaceTest.testParallelReloadAndStats-seed#[2110CF39E198C13E]) [    ] o.a.s.h.a.CoreAdminOperation Checking request status for : 1
   [junit4]   2> 1604618 INFO  (TEST-StatsReloadRaceTest.testParallelReloadAndStats-seed#[2110CF39E198C13E]) [    ] o.a.s.h.a.CoreAdminOperation Checking request status for : 1
   [junit4]   2> 1604618 INFO  (TEST-StatsReloadRaceTest.testParallelReloadAndStats-seed#[2110CF39E198C13E]) [    ] o.a.s.h.a.CoreAdminOperation Checking request status for : 1
   [junit4]   2> 1604619 INFO  (TEST-StatsReloadRaceTest.testParallelReloadAndStats-seed#[2110CF39E198C13E]) [    ] o.a.s.h.a.CoreAdminOperation Checking request status for : 1
   [junit4]   2> 1604620 INFO  (TEST-StatsReloadRaceTest.testParallelReloadAndStats-seed#[2110CF39E198C13E]) [    ] o.a.s.h.a.CoreAdminOperation Checking request status for : 1
   [junit4]   2> 1604620 INFO  (TEST-StatsReloadRaceTest.testParallelReloadAndStats-seed#[2110CF39E198C13E]) [    ] o.a.s.h.a.CoreAdminOperation Checking request status for : 1
   [junit4]   2> 1604620 INFO  (TEST-StatsReloadRaceTest.testParallelReloadAndStats-seed#[2110CF39E198C13E]) [    ] o.a.s.h.a.CoreAdminOperation Checking request status for : 1
   [junit4]   2> 1604620 INFO  (TEST-StatsReloadRaceTest.testParallelReloadAndStats-seed#[2110CF39E198C13E]) [    ] o.a.s.h.a.CoreAdminOperation Checking request status for : 1
   [junit4]   2> 1604621 INFO  (TEST-StatsReloadRaceTest.testParallelReloadAndStats-seed#[2110CF39E198C13E]) [    ] o.a.s.h.a.CoreAdminOperation Checking request status for : 1
   [junit4]   2> 1604621 INFO  (TEST-StatsReloadRaceTest.testParallelReloadAndStats-seed#[2110CF39E198C13E]) [    ] o.a.s.h.a.CoreAdminOperation Checking request status for : 1
   [junit4]   2> 1604621 INFO  (TEST-StatsReloadRaceTest.testParallelReloadAndStats-seed#[2110CF39E198C13E]) [    ] o.a.s.h.a.CoreAdminOperation Checking request status for : 1
   [junit4]   2> 1604622 INFO  (TEST-StatsReloadRaceTest.testParallelReloadAndStats-seed#[2110CF39E198C13E]) [    ] o.a.s.h.a.CoreAdminOperation Checking request status for : 1
   [junit4]   2> 1604622 INFO  (TEST-StatsReloadRaceTest.testParallelReloadAndStats-seed#[2110CF39E198C13E]) [    ] o.a.s.h.a.CoreAdminOperation Checking request status for : 1
   [junit4]   2> 1604623 INFO  (TEST-StatsReloadRaceTest.testParallelReloadAndStats-seed#[2110CF39E198C13E]) [    ] o.a.s.h.a.CoreAdminOperation Checking request status for : 1
   [junit4]   2> 1604623 INFO  (TEST-StatsReloadRaceTest.testParallelReloadAndStats-seed#[2110CF39E198C13E]) [    ] o.a.s.h.a.CoreAdminOperation Checking request status for : 1
   [junit4]   2> 1604623 INFO  (TEST-StatsReloadRaceTest.testParallelReloadAndStats-seed#[2110CF39E198C13E]) [    ] o.a.s.h.a.CoreAdminOperation Checking request status for : 1
   [junit4]   2> 1604624 INFO  (TEST-StatsReloadRaceTest.testParallelReloadAndStats-seed#[2110CF39E198C13E]) [    ] o.a.s.h.a.CoreAdminOperation Checking request status for : 1
   [junit4]   2> 1604624 INFO  (TEST-StatsReloadRaceTest.testParallelReloadAndStats-seed#[2110CF39E198C13E]) [    ] o.a.s.h.a.CoreAdminOperation Checking request status for : 1
   [junit4]   2> 1604624 INFO  (TEST-StatsReloadRaceTest.testParallelReloadAndStats-seed#[2110CF39E198C13E]) [    ] o.a.s.h.a.CoreAdminOperation Checking request status for : 1
   [junit4]   2> 1604625 INFO  (TEST-StatsReloadRaceTest.testParallelReloadAndStats-seed#[2110CF39E198C13E]) [    ] o.a.s.h.a.CoreAdminOperation Checking request status for : 1
   [junit4]   2> 1604625 INFO  (TEST-StatsReloadRaceTest.testParallelReloadAndStats-seed#[2110CF39E198C13E]) [    ] o.a.s.h.a.CoreAdminOperation Checking request status for : 1
   [junit4]   2> 1604625 INFO  (TEST-StatsReloadRaceTest.testParallelReloadAndStats-seed#[2110CF39E198C13E]) [    ] o.a.s.h.a.CoreAdminOperation Checking request status for : 1
   [junit4]   2> 1604626 INFO  (TEST-StatsReloadRaceTest.testParallelReloadAndStats-seed#[2110CF39E198C13E]) [    ] o.a.s.h.a.CoreAdminOperation Checking request status for : 1
   [junit4]   2> 1604626 INFO  (TEST-StatsReloadRaceTest.testParallelReloadAndStats-seed#[2110CF39E198C13E]) [    ] o.a.s.h.a.CoreAdminOperation Checking request status for : 1
   [junit4]   2> 1604626 INFO  (TEST-StatsReloadRaceTest.testParallelReloadAndStats-seed#[2110CF39E198C13E]) [    ] o.a.s.h.a.CoreAdminOperation Checking request status for : 1
   [junit4]   2> 1604627 INFO  (TEST-StatsReloadRaceTest.testParallelReloadAndStats-seed#[2110CF39E198C13E]) [    ] o.a.s.h.a.CoreAdminOperation Checking request status for : 1
   [junit4]   2> 1604627 INFO  (TEST-StatsReloadRaceTest.testParallelReloadAndStats-seed#[2110CF39E198C13E]) [    ] o.a.s.h.a.CoreAdminOperation Checking request status for : 1
   [junit4]   2> 1604627 INFO  (TEST-StatsReloadRaceTest.testParallelReloadAndStats-seed#[2110CF39E198C13E]) [    ] o.a.s.h.a.CoreAdminOperation Checking request status for : 1
   [junit4]   2> 1604627 INFO  (TEST-StatsReloadRaceTest.testParallelReloadAndStats-seed#[2110CF39E198C13E]) [    ] o.a.s.h.a.CoreAdminOperation Checking request status for : 1
   [junit4]   2> 1604628 INFO  (TEST-StatsReloadRaceTest.testParallelReloadAndStats-seed#[2110CF39E198C13E]) [    ] o.a.s.h.a.CoreAdminOperation Checking request status for : 1
   [junit4]   2> 1604628 INFO  (TEST-StatsReloadRaceTest.testParallelReloadAndStats-seed#[2110CF39E198C13E]) [    ] o.a.s.h.a.CoreAdminOperation Checking request status for : 1
   [junit4]   2> 1604628 INFO  (TEST-StatsReloadRaceTest.testParallelReloadAndStats-seed#[2110CF39E198C13E]) [    ] o.a.s.h.a.CoreAdminOperation Checking request status for : 1
   [junit4]   2> 1604628 INFO  (TEST-StatsReloadRaceTest.testParallelReloadAndStats-seed#[2110CF39E198C13E]) [    ] o.a.s.h.a.CoreAdminOperation Checking request status for : 1
   [junit4]   2> 1604629 INFO  (TEST-StatsReloadRaceTest.testParallelReloadAndStats-seed#[2110CF39E198C13E]) [    ] o.a.s.h.a.CoreAdminOperation Checking request status for : 1
   [junit4]   2> 1604629 INFO  (TEST-StatsReloadRaceTest.testParallelReloadAndStats-seed#[2110CF39E198C13E]) [    ] o.a.s.h.a.CoreAdminOperation Checking request status for : 1
   [junit4]   2> 1604629 INFO  (TEST-StatsReloadRaceTest.testParallelReloadAndStats-seed#[2110CF39E198C13E]) [    ] o.a.s.h.a.CoreAdminOperation Checking request status for : 1
   [junit4]   2> 1604629 INFO  (TEST-StatsReloadRaceTest.testParallelReloadAndStats-seed#[2110CF39E198C13E]) [    ] o.a.s.h.a.CoreAdminOperation Checking request status for : 1
   [junit4]   2> 1604630 INFO  (TEST-StatsReloadRaceTest.testParallelReloadAndStats-seed#[2110CF39E198C13E]) [    ] o.a.s.h.a.CoreAdminOperation Checking request status for : 1
   [junit4]   2> 1604630 INFO  (TEST-StatsReloadRaceTest.testParallelReloadAndStats-seed#[2110CF39E198C13E]) [    ] o.a.s.h.a.CoreAdminOperation Checking request status for : 1
   [junit4]   2> 1604630 INFO  (TEST-StatsReloadRaceTest.testParallelReloadAndStats-seed#[2110CF39E198C13E]) [    ] o.a.s.h.a.CoreAdminOperation Checking request status for : 1
   [junit4]   2> 1604630 INFO  (TEST-StatsReloadRaceTest.testParallelReloadAndStats-seed#[2110CF39E198C13E]) [    ] o.a.s.h.a.CoreAdminOperation Checking request status for : 1
   [junit4]   2> 1604630 INFO  (TEST-StatsReloadRaceTest.testParallelReloadAndStats-seed#[2110CF39E198C13E]) [    ] o.a.s.h.a.CoreAdminOperation Checking request status for : 1
   [junit4]   2> 1604630 INFO  (TEST-StatsReloadRaceTest.testParallelReloadAndStats-seed#[2110CF39E198C13E]) [    ] o.a.s.h.a.CoreAdminOperation Checking request status for : 1
   [junit4]   2> 1604631 INFO  (TEST-StatsReloadRaceTest.testParallelReloadAndStats-seed#[2110CF39E198C13E]) [    ] o.a.s.h.a.CoreAdminOperation Checking request status for : 1
   [junit4]   2> 1604632 INFO  (TEST-StatsReloadRaceTest.testParallelReloadAndStats-seed#[2110CF39E198C13E]) [    ] o.a.s.h.a.CoreAdminOperation Checking request status for : 1
   [junit4]   2> 1604632 INFO  (TEST-StatsReloadRaceTest.testParallelReloadAndStats-seed#[2110CF39E198C13E]) [    ] o.a.s.h.a.CoreAdminOperation Checking request status for : 1
   [junit4]   2> 1604632 INFO  (TEST-StatsReloadRaceTest.testParallelReloadAndStats-seed#[2110CF39E198C13E]) [    ] o.a.s.h.a.CoreAdminOperation Checking request status for : 1
   [junit4]   2> 1604633 INFO  (TEST-StatsReloadRaceTest.testParallelReloadAndStats-seed#[2110CF39E198C13E]) [    ] o.a.s.h.a.CoreAdminOperation Checking request status for : 1
   [junit4]   2> 1604633 INFO  (TEST-StatsReloadRaceTest.testParallelReloadAndStats-seed#[2110CF39E198C13E]) [    ] o.a.s.h.a.CoreAdminOperation Checking request status for : 1
   [junit4]   2> 1604633 INFO  (TEST-StatsReloadRaceTest.testParallelReloadAndStats-seed#[2110CF39E198C13E]) [    ] o.a.s.h.a.CoreAdminOperation Checking request status for : 1
   [junit4]   2> 1604633 INFO  (TEST-StatsReloadRaceTest.testParallelReloadAndStats-seed#[2110CF39E198C13E]) [    ] o.a.s.h.a.CoreAdminOperation Checking request status for : 1
   [junit4]   2> 1604633 INFO  (TEST-StatsReloadRaceTest.testParallelReloadAndStats-seed#[2110CF39E198C13E]) [    ] o.a.s.h.a.CoreAdminOperation Checking request status for : 1
   [junit4]   2> 1604634 INFO  (TEST-StatsReloadRaceTest.testParallelReloadAndStats-seed#[2110CF39E198C13E]) [    ] o.a.s.h.a.CoreAdminOperation Checking request status for : 1
   [junit4]   2> 1604634 INFO  (TEST-StatsReloadRaceTest.testParallelReloadAndStats-seed#[2110CF39E198C13E]) [    ] o.a.s.h.a.CoreAdminOperation Checking request status for : 1
   [junit4]   2> 1604634 INFO  (TEST-StatsReloadRaceTest.testParallelReloadAndStats-seed#[2110CF39E198C13E]) [    ] o.a.s.h.a.CoreAdminOperation Checking request status for : 1
   [junit4]   2> 1604634 INFO  (TEST-StatsReloadRaceTest.testParallelReloadAndStats-seed#[2110CF39E198C13E]) [    ] o.a.s.h.a.CoreAdminOperation Checking request status for : 1
   [junit4]   2> 1604635 INFO  (TEST-StatsReloadRaceTest.testParallelReloadAndStats-seed#[2110CF39E198C13E]) [    ] o.a.s.h.a.CoreAdminOperation Checking request status for : 1
   [junit4]   2> 1604635 INFO  (TEST-StatsReloadRaceTest.testParallelReloadAndStats-seed#[2110CF39E198C13E]) [    ] o.a.s.h.a.CoreAdminOperation Checking request status for : 1
   [junit4]   2> 1604635 INFO  (TEST-StatsReloadRaceTest.testParallelReloadAndStats-seed#[2110CF39E198C13E]) [    ] o.a.s.h.a.CoreAdminOperation Checking request status for : 1
   [junit4]   2> 1604636 INFO  (TEST-StatsReloadRaceTest.testParallelReloadAndStats-seed#[2110CF39E198C13E]) [    ] o.a.s.h.a.CoreAdminOperation Checking request status for : 1
   [junit4]   2> 1604636 INFO  (TEST-StatsReloadRaceTest.testParallelReloadAndStats-seed#[2110CF39E198C13E]) [    ] o.a.s.h.a.CoreAdminOperation Checking request status for : 1
   [junit4]   2> 1604636 INFO  (TEST-StatsReloadRaceTest.testParallelReloadAndStats-seed#[2110CF39E198C13E]) [    ] o.a.s.h.a.CoreAdminOperation Checking request status for : 1
   [junit4]   2> 1604636 INFO  (TEST-StatsReloadRaceTest.testParallelReloadAndStats-seed#[2110CF39E198C13E]) [    ] o.a.s.h.a.CoreAdminOperation Checking request status for : 1
   [junit4]   2> 1604637 INFO  (TEST-StatsReloadRaceTest.testParallelReloadAndStats-seed#[2110CF39E198C13E]) [    ] o.a.s.h.a.CoreAdminOperation Checking request status for : 1
   [junit4]   2> 1604637 INFO  (TEST-StatsReloadRaceTest.testParallelReloadAndStats-seed#[2110CF39E198C13E]) [    ] o.a.s.h.a.CoreAdminOperation Checking request status for : 1
   [junit4]   2> 1604637 INFO  (TEST-StatsReloadRaceTest.testParallelReloadAndStats-seed#[2110CF39E198C13E]) [    ] o.a.s.h.a.CoreAdminOperation Checking request status for : 1
   [junit4]   2> 1604637 INFO  (TEST-StatsReloadRaceTest.testParallelReloadAndStats-seed#[2110CF39E198C13E]) [    ] o.a.s.h.a.CoreAdminOperation Checking request status for : 1
   [junit4]   2> 1604638 INFO  (TEST-StatsReloadRaceTest.testParallelReloadAndStats-seed#[2110CF39E198C13E]) [    ] o.a.s.h.a.CoreAdminOperation Checking request status for : 1
   [junit4]   2> 1604638 INFO  (TEST-StatsReloadRaceTest.testParallelReloadAndStats-seed#[2110CF39E198C13E]) [    ] o.a.s.h.a.CoreAdminOperation Checking request status for : 1
   [junit4]   2> 1604638 INFO  (TEST-StatsReloadRaceTest.testParallelReloadAndStats-seed#[2110CF39E198C13E]) [    ] o.a.s.h.a.CoreAdminOperation Checking request status for : 1
   [junit4]   2> 1604639 INFO  (TEST-StatsReloadRaceTest.testParallelReloadAndStats-seed#[2110CF39E198C13E]) [    ] o.a.s.h.a.CoreAdminOperation Checking request status for : 1
   [junit4]   2> 1604648 INFO  (TEST-StatsReloadRaceTest.testParallelReloadAndStats-seed#[2110CF39E198C13E]) [    ] o.a.s.h.a.CoreAdminOperation Checking request status for : 1
   [junit4]   2> 1604648 INFO  (TEST-StatsReloadRaceTest.testParallelReloadAndStats-seed#[2110CF39E198C13E]) [    ] o.a.s.h.a.CoreAdminOperation Checking request status for : 1
   [junit4]   2> 1604648 INFO  (TEST-StatsReloadRaceTest.testParallelReloadAndStats-seed#[2110CF39E198C13E]) [    ] o.a.s.h.a.CoreAdminOperation Checking request status for : 1
   [junit4]   2> 1604648 INFO  (TEST-StatsReloadRaceTest.testParallelReloadAndStats-seed#[2110CF39E198C13E]) [    ] o.a.s.h.a.CoreAdminOperation Checking request status for : 1
   [junit4]   2> 1604649 INFO  (TEST-StatsReloadRaceTest.testParallelReloadAndStats-seed#[2110CF39E198C13E]) [    ] o.a.s.h.a.CoreAdminOperation Checking request status for : 1
   [junit4]   2> 1604649 INFO  (TEST-StatsReloadRaceTest.testParallelReloadAndStats-seed#[2110CF39E198C13E]) [    ] o.a.s.h.a.CoreAdminOperation Checking request status for : 1
   [junit4]   2> 1604649 INFO  (TEST-StatsReloadRaceTest.testParallelReloadAndStats-seed#[2110CF39E198C13E]) [    ] o.a.s.h.a.CoreAdminOperation Checking request status for : 1
   [junit4]   2> 1604649 INFO  (TEST-StatsReloadRaceTest.testParallelReloadAndStats-seed#[2110CF39E198C13E]) [    ] o.a.s.h.a.CoreAdminOperation Checking request status for : 1
   [junit4]   2> 1604649 INFO  (TEST-StatsReloadRaceTest.testParallelReloadAndStats-seed#[2110CF39E198C13E]) [    ] o.a.s.h.a.CoreAdminOperation Checking request status for : 1
   [junit4]   2> 1604649 INFO  (TEST-StatsReloadRaceTest.testParallelReloadAndStats-seed#[2110CF39E198C13E]) [    ] o.a.s.h.a.CoreAdminOperation Checking request status for : 1
   [junit4]   2> 1604650 INFO  (TEST-StatsReloadRaceTest.testParallelReloadAndStats-seed#[2110CF39E198C13E]) [    ] o.a.s.h.a.CoreAdminOperation Checking request status for : 1
   [junit4]   2> 1604650 INFO  (TEST-StatsReloadRaceTest.testParallelReloadAndStats-seed#[2110CF39E198C13E]) [    ] o.a.s.h.a.CoreAdminOperation Checking request status for : 1
   [junit4]   2> 1604650 INFO  (TEST-StatsReloadRaceTest.testParallelReloadAndStats-seed#[2110CF39E198C13E]) [    ] o.a.s.h.a.CoreAdminOperation Checking request status for : 1
   [junit4]   2> 1604650 INFO  (TEST-StatsReloadRaceTest.testParallelReloadAndStats-seed#[2110CF39E198C13E]) [    ] o.a.s.h.a.CoreAdminOperation Checking request status for : 1
   [junit4]   2> 1604651 INFO  (TEST-StatsReloadRaceTest.testParallelReloadAndStats-seed#[2110CF39E198C13E]) [    ] o.a.s.h.a.CoreAdminOperation Checking request status for : 1
   [junit4]   2> 1604651 INFO  (TEST-StatsReloadRaceTest.testParallelReloadAndStats-seed#[2110CF39E198C13E]) [    ] o.a.s.h.a.CoreAdminOperation Checking request status for : 1
   [junit4]   2> 1604651 INFO  (TEST-StatsReloadRaceTest.testParallelReloadAndStats-seed#[2110CF39E198C13E]) [    ] o.a.s.h.a.CoreAdminOperation Checking request status for : 1
   [junit4]   2> 1604651 INFO  (TEST-StatsReloadRaceTest.testParallelReloadAndStats-seed#[2110CF39E198C13E]) [    ] o.a.s.h.a.CoreAdminOperation Checking request status for : 1
   [junit4]   2> 1604651 INFO  (TEST-StatsReloadRaceTest.testParallelReloadAndStats-seed#[2110CF39E198C13E]) [    ] o.a.s.h.a.CoreAdminOperation Checking request status for : 1
   [junit4]   2> 1604652 INFO  (TEST-StatsReloadRaceTest.testParallelReloadAndStats-seed#[2110CF39E198C13E]) [    ] o.a.s.h.a.CoreAdminOperation Checking request status for : 1
   [junit4]   2> 1604652 INFO  (TEST-StatsReloadRaceTest.testParallelReloadAndStats-seed#[2110CF39E198C13E]) [    ] o.a.s.h.a.CoreAdminOperation Checking request status for : 1
   [junit4]   2> 1604652 INFO  (TEST-StatsReloadRaceTest.testParallelReloadAndStats-seed#[2110CF39E198C13E]) [    ] o.a.s.h.a.CoreAdminOperation Checking request status for : 1
   [junit4]   2> 1604652 INFO  (TEST-StatsReloadRaceTest.testParallelReloadAndStats-seed#[2110CF39E198C13E]) [    ] o.a.s.h.a.CoreAdminOperation Checking request status for : 1
   [junit4]   2> 1604652 INFO  (TEST-StatsReloadRaceTest.testParallelReloadAndStats-seed#[2110CF39E198C13E]) [    ] o.a.s.h.a.CoreAdminOperation Checking request status for : 1
   [junit4]   2> 1604653 INFO  (TEST-StatsReloadRaceTest.testParallelReloadAndStats-seed#[2110CF39E198C13E]) [    ] o.a.s.h.a.CoreAdminOperation Checking request status for : 1
   [junit4]   2> 1604653 INFO  (TEST-StatsReloadRaceTest.testParallelReloadAndStats-seed#[2110CF39E198C13E]) [    ] o.a.s.h.a.CoreAdminOperation Checking request status for : 1
   [junit4]   2> 1604653 INFO  (TEST-StatsReloadRaceTest.testParallelReloadAndStats-seed#[2110CF39E198C13E]) [    ] o.a.s.h.a.CoreAdminOperation Checking request status for : 1
   [junit4]   2> 1604653 INFO  (TEST-StatsReloadRaceTest.testParallelReloadAndStats-seed#[2110CF39E198C13E]) [    ] o.a.s.h.a.CoreAdminOperation Checking request status for : 1
   [junit4]   2> 1604653 INFO  (TEST-StatsReloadRaceTest.testParallelReloadAndStats-seed#[2110CF39E198C13E]) [    ] o.a.s.h.a.CoreAdminOperation Checking request status for : 1
   [junit4]   2> 1604654 INFO  (TEST-StatsReloadRaceTest.testParallelReloadAndStats-seed#[2110CF39E198C13E]) [    ] o.a.s.h.a.CoreAdminOperation Checking request status for : 1
   [junit4]   2> 1604654 INFO  (TEST-StatsReloadRaceTest.testParallelReloadAndStats-seed#[2110CF39E198C13E]) [    ] o.a.s.h.a.CoreAdminOperation Checking request status for : 1
   [junit4]   2> 1604654 INFO  (TEST-StatsReloadRaceTest.testParallelReloadAndStats-seed#[2110CF39E198C13E]) [    ] o.a.s.h.a.CoreAdminOperation Checking request status for : 1
   [junit4]   2> 1604654 INFO  (TEST-StatsReloadRaceTest.testParallelReloadAndStats-seed#[2110CF39E198C13E]) [    ] o.a.s.h.a.CoreAdminOperation Checking request status for : 1
   [junit4]   2> 1604654 INFO  (TEST-StatsReloadRaceTest.testParallelReloadAndStats-seed#[2110CF39E198C13E]) [    ] o.a.s.h.a.CoreAdminOperation Checking request status for : 1
   [junit4]   2> 1604654 INFO  (TEST-StatsReloadRaceTest.testParallelReloadAndStats-seed#[2110CF39E198C13E]) [    ] o.a.s.h.a.CoreAdminOperation Checking request status for : 1
   [junit4]   2> 1604655 INFO  (TEST-StatsReloadRaceTest.testParallelReloadAndStats-seed#[2110CF39E198C13E]) [    ] o.a.s.h.a.CoreAdminOperation Checking request status for : 1
   [junit4]   2> 1604656 INFO  (TEST-StatsReloadRaceTest.testParallelReloadAndStats-seed#[2110CF39E198C13E]) [    ] o.a.s.h.a.CoreAdminOperation Checking request status for : 1
   [junit4]   2> 1604656 INFO  (TEST-StatsReloadRaceTest.testParallelReloadAndStats-seed#[2110CF39E198C13E]) [    ] o.a.s.h.a.CoreAdminOperation Checking request status for : 1
   [junit4]   2> 1604656 INFO  (TEST-StatsReloadRaceTest.testParallelReloadAndStats-seed#[2110CF39E198C13E]) [    ] o.a.s.h.a.CoreAdminOperation Checking request status for : 1
   [junit4]   2> 1604656 INFO  (TEST-StatsReloadRaceTest.testParallelReloadAndStats-seed#[2110CF39E198C13E]) [    ] o.a.s.h.a.CoreAdminOperation Checking request status for : 1
   [junit4]   2> 1604656 INFO  (TEST-StatsReloadRaceTest.testParallelReloadAndStats-seed#[2110CF39E198C13E]) [    ] o.a.s.h.a.CoreAdminOperation Checking request status for : 1
   [junit4]   2> 1604657 INFO  (TEST-StatsReloadRaceTest.testParallelReloadAndStats-seed#[2110CF39E198C13E]) [    ] o.a.s.h.a.CoreAdminOperation Checking request status for : 1
   [junit4]   2> 1604657 INFO  (TEST-StatsReloadRaceTest.testParallelReloadAndStats-seed#[2110CF39E198C13E]) [    ] o.a.s.h.a.CoreAdminOperation Checking request status for : 1
   [junit4]   2> 1604657 INFO  (TEST-StatsReloadRaceTest.testParallelReloadAndStats-seed#[2110CF39E198C13E]) [    ] o.a.s.h.a.CoreAdminOperation Checking request status for : 1
   [junit4]   2> 1604658 INFO  (TEST-StatsReloadRaceTest.testParallelReloadAndStats-seed#[2110CF39E198C13E]) [    ] o.a.s.h.a.CoreAdminOperation Checking request status for : 1
   [junit4]   2> 1604658 INFO  (TEST-StatsReloadRaceTest.testParallelReloadAndStats-seed#[2110CF39E198C13E]) [    ] o.a.s.h.a.CoreAdminOperation Checking request status for : 1
   [junit4]   2> 1604658 INFO  (TEST-StatsReloadRaceTest.testParallelReloadAndStats-seed#[2110CF39E198C13E]) [    ] o.a.s.h.a.CoreAdminOperation Checking request status for : 1
   [junit4]   2> 1604659 INFO  (TEST-StatsReloadRaceTest.testParallelReloadAndStats-seed#[2110CF39E198C13E]) [    ] o.a.s.h.a.CoreAdminOperation Checking request status for : 1
   [junit4]   2> 1604659 INFO  (TEST-StatsReloadRaceTest.testParallelReloadAndStats-seed#[2110CF39E198C13E]) [    ] o.a.s.h.a.CoreAdminOperation Checking request status for : 1
   [junit4]   2> 1604660 INFO  (TEST-StatsReloadRaceTest.testParallelReloadAndStats-seed#[2110CF39E198C13E]) [    ] o.a.s.h.a.CoreAdminOperation Checking request status for : 1
   [junit4]   2> 1604660 INFO  (TEST-StatsReloadRaceTest.testParallelReloadAndStats-seed#[2110CF39E198C13E]) [    ] o.a.s.h.a.CoreAdminOperation Checking request status for : 1
   [junit4]   2> 1604660 INFO  (TEST-StatsReloadRaceTest.testParallelReloadAndStats-seed#[2110CF39E198C13E]) [    ] o.a.s.h.a.CoreAdminOperation Checking request status for : 1
   [junit4]   2> 1604660 INFO  (TEST-StatsReloadRaceTest.testParallelReloadAndStats-seed#[2110CF39E198C13E]) [    ] o.a.s.h.a.CoreAdminOperation Checking request status for : 1
   [junit4]   2> 1604660 INFO  (TEST-StatsReloadRaceTest.testParallelReloadAndStats-seed#[2110CF39E198C13E]) [    ] o.a.s.h.a.CoreAdminOperation Checking request status for : 1
   [junit4]   2> 1604661 INFO  (TEST-StatsReloadRaceTest.testParallelReloadAndStats-seed#[2110CF39E198C13E]) [    ] o.a.s.h.a.CoreAdminOperation Checking request status for : 1
   [junit4]   2> 1604661 INFO  (TEST-StatsReloadRaceTest.testParallelReloadAndStats-seed#[2110CF39E198C13E]) [    ] o.a.s.h.a.CoreAdminOperation Checking request status for : 1
   [junit4]   2> 1604661 INFO  (TEST-StatsReloadRaceTest.testParallelReloadAndStats-seed#[2110CF39E198C13E]) [    ] o.a.s.h.a.CoreAdminOperation Checking request status for : 1
   [junit4]   2> 1604661 INFO  (TEST-StatsReloadRaceTest.testParallelReloadAndStats-seed#[2110CF39E198C13E]) [    ] o.a.s.h.a.CoreAdminOperation Checking request status for : 1
   [junit4]   2> 1604662 INFO  (TEST-StatsReloadRaceTest.testParallelReloadAndStats-seed#[2110CF39E198C13E]) [    ] o.a.s.h.a.CoreAdminOperation Checking request status for : 1
   [junit4]   2> 1604662 INFO  (TEST-StatsReloadRaceTest.testParallelReloadAndStats-seed#[2110CF39E198C13E]) [    ] o.a.s.h.a.CoreAdminOperation Checking request status for : 1
   [junit4]   2> 1604662 INFO  (TEST-StatsReloadRaceTest.testParallelReloadAndStats-seed#[2110CF39E198C13E]) [    ] o.a.s.h.a.CoreAdminOperation Checking request status for : 1
   [junit4]   2> 1604662 INFO  (TEST-StatsReloadRaceTest.testParallelReloadAndStats-seed#[2110CF39E198C13E]) [    ] o.a.s.h.a.CoreAdminOperation Checking request status for : 1
   [junit4]   2> 1604662 INFO  (TEST-StatsReloadRaceTest.testParallelReloadAndStats-seed#[2110CF39E198C13E]) [    ] o.a.s.h.a.CoreAdminOperation Checking request status for : 1
   [junit4]   2> 1604663 INFO  (TEST-StatsReloadRaceTest.testParallelReloadAndStats-seed#[2110CF39E198C13E]) [    ] o.a.s.h.a.CoreAdminOperation Checking request status for : 1
   [junit4]   2> 1604663 INFO  (TEST-StatsReloadRaceTest.testParallelReloadAndStats-seed#[2110CF39E198C13E]) [    ] o.a.s.h.a.CoreAdminOperation Checking request status for : 1
   [junit4]   2> 1604663 INFO  (TEST-StatsReloadRaceTest.testParallelReloadAndStats-seed#[2110CF39E198C13E]) [    ] o.a.s.h.a.CoreAdminOperation Checking request status for : 1
   [junit4]   2> 1604663 INFO  (TEST-StatsReloadRaceTest.testParallelReloadAndStats-seed#[2110CF39E198C13E]) [    ] o.a.s.h.a.CoreAdminOperation Checking request status for : 1
   [junit4]   2> 1604663 INFO  (TEST-StatsReloadRaceTest.testParallelReloadAndStats-seed#[2110CF39E198C13E]) [    ] o.a.s.h.a.CoreAdminOperation Checking request status for : 1
   [junit4]   2> 1604664 INFO  (TEST-StatsReloadRaceTest.testParallelReloadAndStats-seed#[2110CF39E198C13E]) [    ] o.a.s.h.a.CoreAdminOperation Checking request status for : 1
   [junit4]   2> 1604664 INFO  (TEST-StatsReloadRaceTest.testParallelReloadAndStats-seed#[2110CF39E198C13E]) [    ] o.a.s.h.a.CoreAdminOperation Checking request status for : 1
   [junit4]   2> 1604664 INFO  (TEST-StatsReloadRaceTest.testParallelReloadAndStats-seed#[2110CF39E198C13E]) [    ] o.a.s.h.a.CoreAdminOperation Checking request status for : 1
   [junit4]   2> 1604664 INFO  (TEST-StatsReloadRaceTest.testParallelReloadAndStats-seed#[2110CF39E198C13E]) [    ] o.a.s.h.a.CoreAdminOperation Checking request status for : 1
   [junit4]   2> 1604664 INFO  (TEST-StatsReloadRaceTest.testParallelReloadAndStats-seed#[2110CF39E198C13E]) [    ] o.a.s.h.a.CoreAdminOperation Checking request status for : 1
   [junit4]   2> 1604665 INFO  (TEST-StatsReloadRaceTest.testParallelReloadAndStats-seed#[2110CF39E198C13E]) [    ] o.a.s.h.a.CoreAdminOperation Checking request status for : 1
   [junit4]   2> 1604665 INFO  (TEST-StatsReloadRaceTest.testParallelReloadAndStats-seed#[2110CF39E198C13E]) [    ] o.a.s.h.a.CoreAdminOperation Checking request status for : 1
   [junit4]   2> 1604665 INFO  (TEST-StatsReloadRaceTest.testParallelReloadAndStats-seed#[2110CF39E198C13E]) [    ] o.a.s.h.a.CoreAdminOperation Checking request status for : 1
   [junit4]   2> 1604665 INFO  (TEST-StatsReloadRaceTest.testParallelReloadAndStats-seed#[2110CF39E198C13E]) [    ] o.a.s.h.a.CoreAdminOperation Checking request status for : 1
   [junit4]   2> 1604665 INFO  (TEST-StatsReloadRaceTest.testParallelReloadAndStats-seed#[2110CF39E198C13E]) [    ] o.a.s.h.a.CoreAdminOperation Checking request status for : 1
   [junit4]   2> 1604666 INFO  (TEST-StatsReloadRaceTest.testParallelReloadAndStats-seed#[2110CF39E198C13E]) [    ] o.a.s.h.a.CoreAdminOperation Checking request status for : 1
   [junit4]   2> 1604666 INFO  (TEST-StatsReloadRaceTest.testParallelReloadAndStats-seed#[2110CF39E198C13E]) [    ] o.a.s.h.a.CoreAdminOperation Checking request status for : 1
   [junit4]   2> 1604666 INFO  (TEST-StatsReloadRaceTest.testParallelReloadAndStats-seed#[2110CF39E198C13E]) [    ] o.a.s.h.a.CoreAdminOperation Checking request status for : 1
   [junit4]   2> 1604667 INFO  (TEST-StatsReloadRaceTest.testParallelReloadAndStats-seed#[2110CF39E198C13E]) [    ] o.a.s.h.a.CoreAdminOperation Checking request status for : 1
   [junit4]   2> 1604667 INFO  (TEST-StatsReloadRaceTest.testParallelReloadAndStats-seed#[2110CF39E198C13E]) [    ] o.a.s.h.a.CoreAdminOperation Checking request status for : 1
   [junit4]   2> 1604667 INFO  (TEST-StatsReloadRaceTest.testParallelReloadAndStats-seed#[2110CF39E198C13E]) [    ] o.a.s.h.a.CoreAdminOperation Checking request status for : 1
   [junit4]   2> 1604668 INFO  (TEST-StatsReloadRaceTest.testParallelReloadAndStats-seed#[2110CF39E198C13E]) [    ] o.a.s.h.a.CoreAdminOperation Checking request status for : 1
   [junit4]   2> 1604668 INFO  (TEST-StatsReloadRaceTest.testParallelReloadAndStats-seed#[2110CF39E198C13E]) [    ] o.a.s.h.a.CoreAdminOperation Checking request status for : 1
   [junit4]   2> 1604668 INFO  (TEST-StatsReloadRaceTest.testParallelReloadAndStats-seed#[2110CF39E198C13E]) [    ] o.a.s.h.a.CoreAdminOperation Checking request status for : 1
   [junit4]   2> 1604669 INFO  (TEST-StatsReloadRaceTest.testParallelReloadAndStats-seed#[2110CF39E198C13E]) [    ] o.a.s.h.a.CoreAdminOperation Checking request status for : 1
   [junit4]   2> 1604669 INFO  (TEST-StatsReloadRaceTest.testParallelReloadAndStats-seed#[2110CF39E198C13E]) [    ] o.a.s.h.a.CoreAdminOperation Checking request status for : 1
   [junit4]   2> 1604669 INFO  (TEST-StatsReloadRaceTest.testParallelReloadAndStats-seed#[2110CF39E198C13E]) [    ] o.a.s.h.a.CoreAdminOperation Checking request status for : 1
   [junit4]   2> 1604670 INFO  (TEST-StatsReloadRaceTest.testParallelReloadAndStats-seed#[2110CF39E198C13E]) [    ] o.a.s.h.a.CoreAdminOperation Checking request status for : 1
   [junit4]   2> 1604670 INFO  (TEST-StatsReloadRaceTest.testParallelReloadAndStats-seed#[2110CF39E198C13E]) [    ] o.a.s.h.a.CoreAdminOperation Checking request status for : 1
   [junit4]   2> 1604670 INFO  (TEST-StatsReloadRaceTest.testParallelReloadAndStats-seed#[2110CF39E198C13E]) [    ] o.a.s.h.a.CoreAdminOperation Checking request status for : 1
   [junit4]   2> 1604670 INFO  (TEST-StatsReloadRaceTest.testParallelReloadAndStats-seed#[2110CF39E198C13E]) [    ] o.a.s.h.a.CoreAdminOperation Checking request status for : 1
   [junit4]   2> 1604671 INFO  (TEST-StatsReloadRaceTest.testParallelReloadAndStats-seed#[2110CF39E198C13E]) [    ] o.a.s.h.a.CoreAdminOperation Checking request status for : 1
   [junit4]   2> 1604671 INFO  (TEST-StatsReloadRaceTest.testParallelReloadAndStats-seed#[2110CF39E198C13E]) [    ] o.a.s.h.a.CoreAdminOperation Checking request status for : 1
   [junit4]   2> 1604671 INFO  (TEST-StatsReloadRaceTest.testParallelReloadAndStats-seed#[2110CF39E198C13E]) [    ] o.a.s.h.a.CoreAdminOperation Checking request status for : 1
   [junit4]   2> 1604672 INFO  (TEST-StatsReloadRaceTest.testParallelReloadAndStats-seed#[2110CF39E198C13E]) [    ] o.a.s.h.a.CoreAdminOperation Checking request status for : 1
   [junit4]   2> 1604672 INFO  (TEST-StatsReloadRaceTest.testParallelReloadAndStats-seed#[2110CF39E198C13E]) [    ] o.a.s.h.a.CoreAdminOperation Checking request status for : 1
   [junit4]   2> 1604672 INFO  (TEST-StatsReloadRaceTest.testParallelReloadAndStats-seed#[2110CF39E198C13E]) [    ] o.a.s.h.a.CoreAdminOperation Checking request status for : 1
   [junit4]   2> 1604672 INFO  (TEST-StatsReloadRaceTest.testParallelReloadAndStats-seed#[2110CF39E198C13E]) [    ] o.a.s.h.a.CoreAdminOperation Checking request status for : 1
   [junit4]   2> 1604672 INFO  (TEST-StatsReloadRaceTest.testParallelReloadAndStats-seed#[2110CF39E198C13E]) [    ] o.a.s.h.a.CoreAdminOperation Checking request status for : 1
   [junit4]   2> 1604672 INFO  (TEST-StatsReloadRaceTest.testParallelReloadAndStats-seed#[2110CF39E198C13E]) [    ] o.a.s.h.a.CoreAdminOperation Checking request status for : 1
   [junit4]   2> 1604673 INFO  (TEST-StatsReloadRaceTest.testParallelReloadAndStats-seed#[2110CF39E198C13E]) [    ] o.a.s.h.a.CoreAdminOperation Checking request status for : 1
   [junit4]   2> 1604673 INFO  (TEST-StatsReloadRaceTest.testParallelReloadAndStats-seed#[2110CF39E198C13E]) [    ] o.a.s.h.a.CoreAdminOperation Checking request status for : 1
   [junit4]   2> 1604673 INFO  (TEST-StatsReloadRaceTest.testParallelReloadAndStats-seed#[2110CF39E198C13E]) [    ] o.a.s.h.a.CoreAdminOperation Checking request status for : 1
   [junit4]   2> 1604674 INFO  (TEST-StatsReloadRaceTest.testParallelReloadAndStats-seed#[2110CF39E198C13E]) [    ] o.a.s.h.a.CoreAdminOperation Checking request status for : 1
   [junit4]   2> 1604674 INFO  (TEST-StatsReloadRaceTest.testParallelReloadAndStats-seed#[2110CF39E198C13E]) [    ] o.a.s.h.a.CoreAdminOperation Checking request status for : 1
   [junit4]   2> 1604674 INFO  (TEST-StatsReloadRaceTest.testParallelReloadAndStats-seed#[2110CF39E198C13E]) [    ] o.a.s.h.a.CoreAdminOperation Checking request status for : 1
   [junit4]   2> 1604674 INFO  (TEST-StatsReloadRaceTest.testParallelReloadAndStats-seed#[2110CF39E198C13E]) [    ] o.a.s.h.a.CoreAdminOperation Checking request status for : 1
   [junit4]   2> 1604674 INFO  (TEST-StatsReloadRaceTest.testParallelReloadAndStats-seed#[2110CF39E198C13E]) [    ] o.a.s.h.a.CoreAdminOperation Checking request status for : 1
   [junit4]   2> 1604675 INFO  (TEST-StatsReloadRaceTest.testParallelReloadAndStats-seed#[2110CF39E198C13E]) [    ] o.a.s.h.a.CoreAdminOperation Checking request status for : 1
   [junit4]   2> 1604675 INFO  (TEST-StatsReloadRaceTest.testParallelReloadAndStats-seed#[2110CF39E198C13E]) [    ] o.a.s.h.a.CoreAdminOperation Checking request status for : 1
   [junit4]   2> 1604675 INFO  (TEST-StatsReloadRaceTest.testParallelReloadAndStats-seed#[2110CF39E198C13E]) [    ] o.a.s.h.a.CoreAdminOperation Checking request status for : 1
   [junit4]   2> 1604675 INFO  (TEST-StatsReloadRaceTest.testParallelReloadAndStats-seed#[2110CF39E198C13E]) [    ] o.a.s.h.a.CoreAdminOperation Checking request status for : 1
   [junit4]   2> 1604675 INFO  (TEST-StatsReloadRaceTest.testParallelReloadAndStats-seed#[2110CF39E198C13E]) [    ] o.a.s.h.a.CoreAdminOperation Checking request status for : 1
   [junit4]   2> 1604675 INFO  (TEST-StatsReloadRaceTest.testParallelReloadAndStats-seed#[2110CF39E198C13E]) [    ] o.a.s.h.a.CoreAdminOperation Checking request status for : 1
   [junit4]   2> 1604675 INFO  (TEST-StatsReloadRaceTest.testParallelReloadAndStats-seed#[2110CF39E198C13E]) [    ] o.a.s.h.a.CoreAdminOperation Checking request status for : 1
   [junit4]   2> 1604675 INFO  (TEST-StatsReloadRaceTest.testParallelReloadAndStats-seed#[2110CF39E198C13E]) [    ] o.a.s.h.a.CoreAdminOperation Checking request status for : 1
   [junit4]   2> 1604675 INFO  (TEST-StatsReloadRaceTest.testParallelReloadAndStats-seed#[2110CF39E198C13E]) [    ] o.a.s.h.a.CoreAdminOperation Checking request status for : 1
   [junit4]   2> 1604675 INFO  (TEST-StatsReloadRaceTest.testParallelReloadAndStats-seed#[2110CF39E198C13E]) [    ] o.a.s.h.a.CoreAdminOperation Checking request status for : 1
   [junit4]   2> 1604676 INFO  (TEST-StatsReloadRaceTest.testParallelReloadAndStats-seed#[2110CF39E198C13E]) [    ] o.a.s.h.a.CoreAdminOperation Checking request status for : 1
   [junit4]   2> 1604676 INFO  (TEST-StatsReloadRaceTest.testParallelReloadAndStats-seed#[2110CF39E198C13E]) [    ] o.a.s.h.a.CoreAdminOperation Checking request status for : 1
   [junit4]   2> 1604676 INFO  (TEST-StatsReloadRaceTest.testParallelReloadAndStats-seed#[2110CF39E198C13E]) [    ] o.a.s.h.a.CoreAdminOperation Checking request status for : 1
   [junit4]   2> 1604677 INFO  (TEST-StatsReloadRaceTest.testParallelReloadAndStats-seed#[2110CF39E198C13E]) [    ] o.a.s.h.a.CoreAdminOperation Checking request status for : 1
   [junit4]   2> 1604677 INFO  (TEST-StatsReloadRaceTest.testParallelReloadAndStats-seed#[2110CF39E198C13E]) [    ] o.a.s.h.a.CoreAdminOperation Checking request status for : 1
   [junit4]   2> 1604677 INFO  (TEST-StatsReloadRaceTest.testParallelReloadAndStats-seed#[2110CF39E198C13E]) [    ] o.a.s.h.a.CoreAdminOperation Checking request status for : 1
   [junit4]   2> 1604677 INFO  (TEST-StatsReloadRaceTest.testParallelReloadAndStats-seed#[2110CF39E198C13E]) [    ] o.a.s.h.a.CoreAdminOperation Checking request status for : 1
   [junit4]   2> 1604677 INFO  (TEST-StatsReloadRaceTest.testParallelReloadAndStats-seed#[2110CF39E198C13E]) [    ] o.a.s.h.a.CoreAdminOperation Checking request status for : 1
   [junit4]   2> 1604678 INFO  (TEST-StatsReloadRaceTest.testParallelReloadAndStats-seed#[2110CF39E198C13E]) [    ] o.a.s.h.a.CoreAdminOperation Checking request status for : 1
   [junit4]   2> 1604678 INFO  (TEST-StatsReloadRaceTest.testParallelReloadAndStats-seed#[2110CF39E198C13E]) [    ] o.a.s.h.a.CoreAdminOperation Checking request status for : 1
   [junit4]   2> 1604678 INFO  (TEST-StatsReloadRaceTest.testParallelReloadAndStats-seed#[2110CF39E198C13E]) [    ] o.a.s.h.a.CoreAdminOperation Checking request status for : 1
   [junit4]   2> 1604679 INFO  (TEST-StatsReloadRaceTest.testParallelReloadAndStats-seed#[2110CF39E198C13E]) [    ] o.a.s.h.a.CoreAdminOperation Checking request status for : 1
   [junit4]   2> 1604679 INFO  (TEST-StatsReloadRaceTest.testParallelReloadAndStats-seed#[2110CF39E198C13E]) [    ] o.a.s.h.a.CoreAdminOperation Checking request status for : 1
   [junit4]   2> 1604679 INFO  (TEST-StatsReloadRaceTest.testParallelReloadAndStats-seed#[2110CF39E198C13E]) [    ] o.a.s.h.a.CoreAdminOperation Checking request status for : 1
   [junit4]   2> 1604680 INFO  (TEST-StatsReloadRaceTest.testParallelReloadAndStats-seed#[2110CF39E198C13E]) [    ] o.a.s.h.a.CoreAdminOperation Checking request status for : 1
   [junit4]   2> 1604680 INFO  (TEST-StatsReloadRaceTest.testParallelReloadAndStats-seed#[2110CF39E198C13E]) [    ] o.a.s.h.a.CoreAdminOperation Checking request status for : 1
   [junit4]   2> 1604680 INFO  (TEST-StatsReloadRaceTest.testParallelReloadAndStats-seed#[2110CF39E198C13E]) [    ] o.a.s.h.a.CoreAdminOperation Checking request status for : 1
   [junit4]   2> 1604681 INFO  (TEST-StatsReloadRaceTest.testParallelReloadAndStats-seed#[2110CF39E198C13E]) [    ] o.a.s.h.a.CoreAdminOperation Checking request status for : 1
   [junit4]   2> 1604681 INFO  (TEST-StatsReloadRaceTest.testParallelReloadAndStats-seed#[2110CF39E198C13E]) [    ] o.a.s.h.a.CoreAdminOperation Checking request status for : 1
   [junit4]   2> 1604681 INFO  (TEST-StatsReloadRaceTest.testParallelReloadAndStats-seed#[2110CF39E198C13E]) [    ] o.a.s.h.a.CoreAdminOperation Checking request status for : 1
   [junit4]   2> 1604682 INFO  (TEST-StatsReloadRaceTest.testParallelRelo

[...truncated too long message...]

s for : 4
   [junit4]   2> 1605510 INFO  (TEST-StatsReloadRaceTest.testParallelReloadAndStats-seed#[2110CF39E198C13E]) [    ] o.a.s.c.SolrCore [collection1]  CLOSING SolrCore org.apache.solr.core.SolrCore@2e193f82
   [junit4]   2> 1605510 INFO  (TEST-StatsReloadRaceTest.testParallelReloadAndStats-seed#[2110CF39E198C13E]) [    ] o.a.s.m.SolrMetricManager Closing metric reporters for registry=solr.core.collection1, tag=773406594
   [junit4]   2> 1605512 INFO  (TEST-StatsReloadRaceTest.testParallelReloadAndStats-seed#[2110CF39E198C13E]) [    ] o.a.s.h.a.CoreAdminOperation Checking request status for : 4
   [junit4]   2> 1605512 INFO  (searcherExecutor-9273-thread-1-processing-x:collection1 4 RELOAD) [    x:collection1] o.a.s.c.SolrCore [collection1] Registered new searcher Searcher@2626ccfe[collection1] main{ExitableDirectoryReader(UninvertingDirectoryReader(Uninverting(_0(7.0.0):c42)))}
   [junit4]   2> 1610519 INFO  (TEST-StatsReloadRaceTest.testParallelReloadAndStats-seed#[2110CF39E198C13E]) [    ] o.a.s.SolrTestCaseJ4 ###Ending testParallelReloadAndStats
   [junit4]   2> NOTE: reproduce with: ant test  -Dtestcase=StatsReloadRaceTest -Dtests.method=testParallelReloadAndStats -Dtests.seed=2110CF39E198C13E -Dtests.multiplier=3 -Dtests.slow=true -Dtests.locale=en-SG -Dtests.timezone=Portugal -Dtests.asserts=true -Dtests.file.encoding=ISO-8859-1
   [junit4] FAILURE 5.99s J2 | StatsReloadRaceTest.testParallelReloadAndStats <<<
   [junit4]    > Throwable #1: java.lang.AssertionError: Key SEARCHER.searcher.indexVersion not found in registry solr.core.collection1
   [junit4]    > 	at __randomizedtesting.SeedInfo.seed([2110CF39E198C13E:EE8EAA006E69A961]:0)
   [junit4]    > 	at org.apache.solr.handler.admin.StatsReloadRaceTest.requestMetrics(StatsReloadRaceTest.java:143)
   [junit4]    > 	at org.apache.solr.handler.admin.StatsReloadRaceTest.testParallelReloadAndStats(StatsReloadRaceTest.java:77)
   [junit4]    > 	at java.lang.Thread.run(Thread.java:745)
   [junit4]   2> 1610520 INFO  (SUITE-StatsReloadRaceTest-seed#[2110CF39E198C13E]-worker) [    ] o.a.s.SolrTestCaseJ4 ###deleteCore
   [junit4]   2> 1610520 INFO  (SUITE-StatsReloadRaceTest-seed#[2110CF39E198C13E]-worker) [    ] o.a.s.c.CoreContainer Shutting down CoreContainer instance=1177008470
   [junit4]   2> 1610521 INFO  (SUITE-StatsReloadRaceTest-seed#[2110CF39E198C13E]-worker) [    ] o.a.s.m.SolrMetricManager Closing metric reporters for registry=solr.node, tag=null
   [junit4]   2> 1610521 INFO  (SUITE-StatsReloadRaceTest-seed#[2110CF39E198C13E]-worker) [    ] o.a.s.m.SolrMetricManager Closing metric reporters for registry=solr.jvm, tag=null
   [junit4]   2> 1610522 INFO  (SUITE-StatsReloadRaceTest-seed#[2110CF39E198C13E]-worker) [    ] o.a.s.m.SolrMetricManager Closing metric reporters for registry=solr.jetty, tag=null
   [junit4]   2> 1610522 INFO  (SUITE-StatsReloadRaceTest-seed#[2110CF39E198C13E]-worker) [    ] o.a.s.c.TransientSolrCoreCacheDefault Allocating transient cache for 2147483647 transient cores
   [junit4]   2> 1610523 INFO  (coreCloseExecutor-9277-thread-1) [    x:collection1] o.a.s.c.SolrCore [collection1]  CLOSING SolrCore org.apache.solr.core.SolrCore@6530abfb
   [junit4]   2> 1610524 INFO  (coreCloseExecutor-9277-thread-1) [    x:collection1] o.a.s.m.SolrMetricManager Closing metric reporters for registry=solr.core.collection1, tag=1697688571
   [junit4]   2> NOTE: leaving temporary files on disk at: /home/jenkins/workspace/Lucene-Solr-master-Linux/solr/build/solr-core/test/J2/temp/solr.handler.admin.StatsReloadRaceTest_2110CF39E198C13E-001
   [junit4]   2> NOTE: test params are: codec=Asserting(Lucene70): {name_s=PostingsFormat(name=Memory), range_facet_l_dv=PostingsFormat(name=MockRandom), multiDefault=Lucene50(blocksize=128), intDefault=PostingsFormat(name=LuceneVarGapDocFreqInterval), id=PostingsFormat(name=MockRandom), range_facet_i_dv=PostingsFormat(name=LuceneVarGapDocFreqInterval), range_facet_l=PostingsFormat(name=LuceneVarGapDocFreqInterval), timestamp=PostingsFormat(name=LuceneVarGapDocFreqInterval)}, docValues:{range_facet_l_dv=DocValuesFormat(name=Asserting), _version_=DocValuesFormat(name=Lucene70), range_facet_i_dv=DocValuesFormat(name=Lucene70), intDvoDefault=DocValuesFormat(name=Memory), timestamp=DocValuesFormat(name=Lucene70)}, maxPointsInLeafNode=677, maxMBSortInHeap=5.986091065996228, sim=RandomSimilarity(queryNorm=true): {}, locale=en-SG, timezone=Portugal
   [junit4]   2> NOTE: Linux 4.4.0-72-generic amd64/Oracle Corporation 1.8.0_121 (64-bit)/cpus=12,threads=1,free=260108064,total=518979584
   [junit4]   2> NOTE: All tests run in this JVM: [TestReqParamsAPI, SpatialHeatmapFacetsTest, MigrateRouteKeyTest, SimpleMLTQParserTest, TestSolrQueryResponse, TestSystemCollAutoCreate, TestSchemaVersionResource, TestMergePolicyConfig, TestDefaultStatsCache, TestSolrCloudWithKerberosAlt, RemoteQueryErrorTest, TestExtendedDismaxParser, TestFieldCache, SolrIndexConfigTest, LeaderFailureAfterFreshStartTest, FieldAnalysisRequestHandlerTest, TestSort, ExternalFileFieldSortTest, BadIndexSchemaTest, SolrPluginUtilsTest, AutoCommitTest, DebugComponentTest, TestStressUserVersions, TestPKIAuthenticationPlugin, RecoveryZkTest, OpenExchangeRatesOrgProviderTest, ActionThrottleTest, TestBinaryField, TestBinaryResponseWriter, TestSimpleQParserPlugin, TestDynamicFieldCollectionResource, StatsComponentTest, BasicAuthStandaloneTest, RestartWhileUpdatingTest, TestPHPSerializedResponseWriter, AnalyticsMergeStrategyTest, TestCollationField, TestFileDictionaryLookup, HLLUtilTest, TestScoreJoinQPScore, TestIBSimilarityFactory, TestDistributedMissingSort, TestExactStatsCache, CurrencyFieldXmlFileTest, SaslZkACLProviderTest, TestSchemalessBufferedUpdates, TestImplicitCoreProperties, TestEmbeddedSolrServerSchemaAPI, DistributedQueryComponentOptimizationTest, ChangedSchemaMergeTest, TestLMDirichletSimilarityFactory, BJQParserTest, TestSolrDeletionPolicy1, HdfsRestartWhileUpdatingTest, TestPushWriter, SolrCoreCheckLockOnStartupTest, TestManagedResourceStorage, TestComplexPhraseLeadingWildcard, AsyncCallRequestStatusResponseTest, RequestHandlersTest, SolrTestCaseJ4Test, OverseerModifyCollectionTest, PluginInfoTest, HardAutoCommitTest, TestSolrCoreSnapshots, TestSolrCoreParser, SpellCheckCollatorWithCollapseTest, CircularListTest, HdfsDirectoryTest, TestCSVResponseWriter, TestSubQueryTransformerCrossCore, ClassificationUpdateProcessorTest, CdcrReplicationDistributedZkTest, TestMiniSolrCloudCluster, TestMinMaxOnMultiValuedField, EchoParamsTest, TestSolrCLIRunExample, TestRebalanceLeaders, TestSQLHandlerNonCloud, DistributedVersionInfoTest, DistributedFacetPivotLargeTest, TestSolrQueryParser, ConcurrentDeleteAndCreateCollectionTest, CdcrVersionReplicationTest, TestFieldResource, OverseerTaskQueueTest, BinaryUpdateRequestHandlerTest, TestReversedWildcardFilterFactory, DirectUpdateHandlerOptimizeTest, HdfsChaosMonkeyNothingIsSafeTest, TestDocSet, ExplicitHLLTest, TestGroupingSearch, ClusterStateTest, TestOnReconnectListenerSupport, TolerantUpdateProcessorTest, CdcrUpdateLogTest, SharedFSAutoReplicaFailoverUtilsTest, TestCorePropertiesReload, RulesTest, TestHdfsUpdateLog, SolrCloudExampleTest, TestWriterPerf, TestTolerantSearch, IgnoreCommitOptimizeUpdateProcessorFactoryTest, HighlighterConfigTest, TestIndexingPerformance, InfixSuggestersTest, SuggesterWFSTTest, CachingDirectoryFactoryTest, UnloadDistributedZkTest, CoreAdminHandlerTest, FullSolrCloudDistribCmdsTest, TestReplicationHandler, ZkCLITest, TestDistributedSearch, TestReload, TestRangeQuery, SpellCheckComponentTest, TestFunctionQuery, BasicFunctionalityTest, DirectUpdateHandlerTest, TestBadConfig, TestIndexSearcher, HighlighterTest, ShowFileRequestHandlerTest, SolrIndexSplitterTest, SimplePostToolTest, TestCoreDiscovery, SignatureUpdateProcessorFactoryTest, SpellCheckCollatorTest, SolrRequestParserTest, SuggesterTSTTest, SuggesterTest, TestCSVLoader, NoCacheHeaderTest, WordBreakSolrSpellCheckerTest, SchemaVersionSpecificBehaviorTest, TestUpdate, FieldMutatingUpdateProcessorTest, TestAtomicUpdateErrorCases, TestWordDelimiterFilterFactory, StatelessScriptUpdateProcessorFactoryTest, TestRemoteStreaming, DocValuesMultiTest, SolrInfoBeanTest, XsltUpdateRequestHandlerTest, CacheHeaderTest, TestSurroundQueryParser, LukeRequestHandlerTest, TestQueryUtils, StandardRequestHandlerTest, TestQueryTypes, PrimitiveFieldTypeTest, TermsComponentTest, DocumentBuilderTest, MoreLikeThisHandlerTest, IndexSchemaRuntimeFieldTest, ReturnFieldsTest, MBeansHandlerTest, PingRequestHandlerTest, TestLFUCache, TestSystemIdResolver, PrimUtilsTest, TestSuggestSpellingConverter, DateFieldTest, RAMDirectoryFactoryTest, TestLRUCache, TestUtils, TestDocumentBuilder, ZkNodePropsTest, SliceStateTest, SystemInfoHandlerTest, UUIDFieldTest, TestCrossCoreJoin, TestHighlightDedupGrouping, TestEmbeddedSolrServerConstructors, TestJettySolrRunner, ConnectionReuseTest, BaseCdcrDistributedZkTest, CdcrBootstrapTest, CollectionsAPISolrJTest, DeleteStatusTest, DistribJoinFromCollectionTest, HttpPartitionTest, TestAuthenticationFramework, TestCloudPseudoReturnFields, TestCollectionAPI, TestConfigSetsAPIExclusivity, TestConfigSetsAPIZkFailure, TestCryptoKeys, TestDeleteCollectionOnDownNodes, TestDistribDocBasedVersion, TestExclusionRuleCollectionAccess, TestHdfsCloudBackupRestore, TestLeaderElectionWithEmptyReplica, TestLocalFSCloudBackupRestore, TestReplicaProperties, TestRequestForwarding, TestRequestStatusCollectionAPI, TestShortCircuitedRequests, TestStressInPlaceUpdates, TestStressLiveNodes, TestTolerantUpdateProcessorRandomCloud, TriLevelCompositeIdRoutingTest, TestInfoStreamLogging, TestNRTOpen, TestSolrConfigHandler, TestConfigReload, TestSolrConfigHandlerCloud, V2ApiIntegrationTest, CoreAdminCreateDiscoverTest, CoreAdminRequestStatusTest, MetricsHandlerTest, SecurityConfHandlerTest, SegmentsInfoRequestHandlerTest, StatsReloadRaceTest]
   [junit4] Completed [573/703 (1!)] on J2 in 6.57s, 1 test, 1 failure <<< FAILURES!

[...truncated 43764 lines...]

Mime
View raw message