lucene-dev mailing list archives

Site index · List index
Message view « Date » · « Thread »
Top « Date » · « Thread »
From Policeman Jenkins Server <jenk...@thetaphi.de>
Subject [JENKINS] Lucene-Solr-6.x-Linux (32bit/jdk1.8.0_131) - Build # 3647 - Still Unstable!
Date Sat, 03 Jun 2017 00:31:11 GMT
Build: https://jenkins.thetaphi.de/job/Lucene-Solr-6.x-Linux/3647/
Java: 32bit/jdk1.8.0_131 -server -XX:+UseG1GC

1 tests failed.
FAILED:  org.apache.solr.util.TestMaxTokenLenTokenizer.testSingleFieldSameAnalyzers

Error Message:
Exception during query

Stack Trace:
java.lang.RuntimeException: Exception during query
	at __randomizedtesting.SeedInfo.seed([ED11F8EA6375C040:87C3C7853B96108F]:0)
	at org.apache.solr.SolrTestCaseJ4.assertQ(SolrTestCaseJ4.java:895)
	at org.apache.solr.util.TestMaxTokenLenTokenizer.testSingleFieldSameAnalyzers(TestMaxTokenLenTokenizer.java:104)
	at sun.reflect.NativeMethodAccessorImpl.invoke0(Native Method)
	at sun.reflect.NativeMethodAccessorImpl.invoke(NativeMethodAccessorImpl.java:62)
	at sun.reflect.DelegatingMethodAccessorImpl.invoke(DelegatingMethodAccessorImpl.java:43)
	at java.lang.reflect.Method.invoke(Method.java:498)
	at com.carrotsearch.randomizedtesting.RandomizedRunner.invoke(RandomizedRunner.java:1713)
	at com.carrotsearch.randomizedtesting.RandomizedRunner$8.evaluate(RandomizedRunner.java:907)
	at com.carrotsearch.randomizedtesting.RandomizedRunner$9.evaluate(RandomizedRunner.java:943)
	at com.carrotsearch.randomizedtesting.RandomizedRunner$10.evaluate(RandomizedRunner.java:957)
	at com.carrotsearch.randomizedtesting.rules.SystemPropertiesRestoreRule$1.evaluate(SystemPropertiesRestoreRule.java:57)
	at org.apache.lucene.util.TestRuleSetupTeardownChained$1.evaluate(TestRuleSetupTeardownChained.java:49)
	at org.apache.lucene.util.AbstractBeforeAfterRule$1.evaluate(AbstractBeforeAfterRule.java:45)
	at org.apache.lucene.util.TestRuleThreadAndTestName$1.evaluate(TestRuleThreadAndTestName.java:48)
	at org.apache.lucene.util.TestRuleIgnoreAfterMaxFailures$1.evaluate(TestRuleIgnoreAfterMaxFailures.java:64)
	at org.apache.lucene.util.TestRuleMarkFailure$1.evaluate(TestRuleMarkFailure.java:47)
	at com.carrotsearch.randomizedtesting.rules.StatementAdapter.evaluate(StatementAdapter.java:36)
	at com.carrotsearch.randomizedtesting.ThreadLeakControl$StatementRunner.run(ThreadLeakControl.java:368)
	at com.carrotsearch.randomizedtesting.ThreadLeakControl.forkTimeoutingTask(ThreadLeakControl.java:817)
	at com.carrotsearch.randomizedtesting.ThreadLeakControl$3.evaluate(ThreadLeakControl.java:468)
	at com.carrotsearch.randomizedtesting.RandomizedRunner.runSingleTest(RandomizedRunner.java:916)
	at com.carrotsearch.randomizedtesting.RandomizedRunner$5.evaluate(RandomizedRunner.java:802)
	at com.carrotsearch.randomizedtesting.RandomizedRunner$6.evaluate(RandomizedRunner.java:852)
	at com.carrotsearch.randomizedtesting.RandomizedRunner$7.evaluate(RandomizedRunner.java:863)
	at com.carrotsearch.randomizedtesting.rules.StatementAdapter.evaluate(StatementAdapter.java:36)
	at com.carrotsearch.randomizedtesting.rules.SystemPropertiesRestoreRule$1.evaluate(SystemPropertiesRestoreRule.java:57)
	at org.apache.lucene.util.AbstractBeforeAfterRule$1.evaluate(AbstractBeforeAfterRule.java:45)
	at com.carrotsearch.randomizedtesting.rules.StatementAdapter.evaluate(StatementAdapter.java:36)
	at org.apache.lucene.util.TestRuleStoreClassName$1.evaluate(TestRuleStoreClassName.java:41)
	at com.carrotsearch.randomizedtesting.rules.NoShadowingOrOverridesOnMethodsRule$1.evaluate(NoShadowingOrOverridesOnMethodsRule.java:40)
	at com.carrotsearch.randomizedtesting.rules.NoShadowingOrOverridesOnMethodsRule$1.evaluate(NoShadowingOrOverridesOnMethodsRule.java:40)
	at com.carrotsearch.randomizedtesting.rules.StatementAdapter.evaluate(StatementAdapter.java:36)
	at com.carrotsearch.randomizedtesting.rules.StatementAdapter.evaluate(StatementAdapter.java:36)
	at com.carrotsearch.randomizedtesting.rules.StatementAdapter.evaluate(StatementAdapter.java:36)
	at org.apache.lucene.util.TestRuleAssertionsRequired$1.evaluate(TestRuleAssertionsRequired.java:53)
	at org.apache.lucene.util.TestRuleMarkFailure$1.evaluate(TestRuleMarkFailure.java:47)
	at org.apache.lucene.util.TestRuleIgnoreAfterMaxFailures$1.evaluate(TestRuleIgnoreAfterMaxFailures.java:64)
	at org.apache.lucene.util.TestRuleIgnoreTestSuites$1.evaluate(TestRuleIgnoreTestSuites.java:54)
	at com.carrotsearch.randomizedtesting.rules.StatementAdapter.evaluate(StatementAdapter.java:36)
	at com.carrotsearch.randomizedtesting.ThreadLeakControl$StatementRunner.run(ThreadLeakControl.java:368)
	at java.lang.Thread.run(Thread.java:748)
Caused by: java.lang.RuntimeException: REQUEST FAILED: xpath=//result[@numFound=1]
	xml response was: <?xml version="1.0" encoding="UTF-8"?>
<response>
<lst name="responseHeader"><int name="status">0</int><int name="QTime">0</int></lst><result
name="response" numFound="0" start="0"></result>
</response>

	request was:q=letter0:lett&wt=xml
	at org.apache.solr.SolrTestCaseJ4.assertQ(SolrTestCaseJ4.java:888)
	... 40 more




Build Log:
[...truncated 11433 lines...]
   [junit4] Suite: org.apache.solr.util.TestMaxTokenLenTokenizer
   [junit4]   2> Creating dataDir: /home/jenkins/workspace/Lucene-Solr-6.x-Linux/solr/build/solr-core/test/J1/temp/solr.util.TestMaxTokenLenTokenizer_ED11F8EA6375C040-001/init-core-data-001
   [junit4]   2> 331944 WARN  (SUITE-TestMaxTokenLenTokenizer-seed#[ED11F8EA6375C040]-worker)
[    ] o.a.s.SolrTestCaseJ4 startTrackingSearchers: numOpens=2 numCloses=2
   [junit4]   2> 331944 INFO  (SUITE-TestMaxTokenLenTokenizer-seed#[ED11F8EA6375C040]-worker)
[    ] o.a.s.SolrTestCaseJ4 Using PointFields
   [junit4]   2> 331945 INFO  (SUITE-TestMaxTokenLenTokenizer-seed#[ED11F8EA6375C040]-worker)
[    ] o.a.s.SolrTestCaseJ4 Randomized ssl (true) and clientAuth (true) via: @org.apache.solr.util.RandomizeSSL(reason=,
ssl=NaN, value=NaN, clientAuth=NaN)
   [junit4]   2> 331946 INFO  (SUITE-TestMaxTokenLenTokenizer-seed#[ED11F8EA6375C040]-worker)
[    ] o.a.s.SolrTestCaseJ4 ####initCore
   [junit4]   2> 331946 INFO  (SUITE-TestMaxTokenLenTokenizer-seed#[ED11F8EA6375C040]-worker)
[    ] o.a.s.c.SolrResourceLoader [null] Added 2 libs to classloader, from paths: [/home/jenkins/workspace/Lucene-Solr-6.x-Linux/solr/core/src/test-files/solr/collection1/lib,
/home/jenkins/workspace/Lucene-Solr-6.x-Linux/solr/core/src/test-files/solr/collection1/lib/classes]
   [junit4]   2> 331969 INFO  (SUITE-TestMaxTokenLenTokenizer-seed#[ED11F8EA6375C040]-worker)
[    ] o.a.s.c.SolrConfig Using Lucene MatchVersion: 6.7.0
   [junit4]   2> 331993 INFO  (SUITE-TestMaxTokenLenTokenizer-seed#[ED11F8EA6375C040]-worker)
[    ] o.a.s.s.IndexSchema [null] Schema name=test
   [junit4]   2> 332001 INFO  (SUITE-TestMaxTokenLenTokenizer-seed#[ED11F8EA6375C040]-worker)
[    ] o.a.s.s.IndexSchema Loaded schema test/1.0 with uniqueid field id
   [junit4]   2> 332004 INFO  (SUITE-TestMaxTokenLenTokenizer-seed#[ED11F8EA6375C040]-worker)
[    ] o.a.s.u.UpdateShardHandler Creating UpdateShardHandler HTTP client with params: socketTimeout=30000&connTimeout=30000&retry=true
   [junit4]   2> 332030 INFO  (SUITE-TestMaxTokenLenTokenizer-seed#[ED11F8EA6375C040]-worker)
[    ] o.a.s.m.r.SolrJmxReporter JMX monitoring for 'solr.node' (registry 'solr.node') enabled
at server: com.sun.jmx.mbeanserver.JmxMBeanServer@15e77a7
   [junit4]   2> 332034 INFO  (SUITE-TestMaxTokenLenTokenizer-seed#[ED11F8EA6375C040]-worker)
[    ] o.a.s.m.r.SolrJmxReporter JMX monitoring for 'solr.jvm' (registry 'solr.jvm') enabled
at server: com.sun.jmx.mbeanserver.JmxMBeanServer@15e77a7
   [junit4]   2> 332034 INFO  (SUITE-TestMaxTokenLenTokenizer-seed#[ED11F8EA6375C040]-worker)
[    ] o.a.s.m.r.SolrJmxReporter JMX monitoring for 'solr.jetty' (registry 'solr.jetty') enabled
at server: com.sun.jmx.mbeanserver.JmxMBeanServer@15e77a7
   [junit4]   2> 332041 INFO  (coreLoadExecutor-1472-thread-1) [    x:collection1] o.a.s.c.SolrResourceLoader
[null] Added 2 libs to classloader, from paths: [/home/jenkins/workspace/Lucene-Solr-6.x-Linux/solr/core/src/test-files/solr/collection1/lib,
/home/jenkins/workspace/Lucene-Solr-6.x-Linux/solr/core/src/test-files/solr/collection1/lib/classes]
   [junit4]   2> 332083 INFO  (coreLoadExecutor-1472-thread-1) [    x:collection1] o.a.s.c.SolrConfig
Using Lucene MatchVersion: 6.7.0
   [junit4]   2> 332125 INFO  (coreLoadExecutor-1472-thread-1) [    x:collection1] o.a.s.s.IndexSchema
[collection1] Schema name=test
   [junit4]   2> 332134 INFO  (coreLoadExecutor-1472-thread-1) [    x:collection1] o.a.s.s.IndexSchema
Loaded schema test/1.0 with uniqueid field id
   [junit4]   2> 332134 INFO  (coreLoadExecutor-1472-thread-1) [    x:collection1] o.a.s.c.CoreContainer
Creating SolrCore 'collection1' using configuration from instancedir /home/jenkins/workspace/Lucene-Solr-6.x-Linux/solr/core/src/test-files/solr/collection1,
trusted=true
   [junit4]   2> 332134 INFO  (coreLoadExecutor-1472-thread-1) [    x:collection1] o.a.s.m.r.SolrJmxReporter
JMX monitoring for 'solr.core.collection1' (registry 'solr.core.collection1') enabled at server:
com.sun.jmx.mbeanserver.JmxMBeanServer@15e77a7
   [junit4]   2> 332134 INFO  (coreLoadExecutor-1472-thread-1) [    x:collection1] o.a.s.c.SolrCore
solr.RecoveryStrategy.Builder
   [junit4]   2> 332134 INFO  (coreLoadExecutor-1472-thread-1) [    x:collection1] o.a.s.c.SolrCore
[[collection1] ] Opening new SolrCore at [/home/jenkins/workspace/Lucene-Solr-6.x-Linux/solr/core/src/test-files/solr/collection1],
dataDir=[/home/jenkins/workspace/Lucene-Solr-6.x-Linux/solr/build/solr-core/test/J1/temp/solr.util.TestMaxTokenLenTokenizer_ED11F8EA6375C040-001/init-core-data-001/]
   [junit4]   2> 332136 INFO  (coreLoadExecutor-1472-thread-1) [    x:collection1] o.a.s.u.RandomMergePolicy
RandomMergePolicy wrapping class org.apache.lucene.index.TieredMergePolicy: [TieredMergePolicy:
maxMergeAtOnce=38, maxMergeAtOnceExplicit=21, maxMergedSegmentMB=26.6083984375, floorSegmentMB=0.6181640625,
forceMergeDeletesPctAllowed=10.84268383482144, segmentsPerTier=40.0, maxCFSSegmentSizeMB=8.796093022207999E12,
noCFSRatio=0.21856291021844687
   [junit4]   2> 332388 INFO  (coreLoadExecutor-1472-thread-1) [    x:collection1] o.a.s.u.CommitTracker
Hard AutoCommit: disabled
   [junit4]   2> 332388 INFO  (coreLoadExecutor-1472-thread-1) [    x:collection1] o.a.s.u.CommitTracker
Soft AutoCommit: disabled
   [junit4]   2> 332389 INFO  (coreLoadExecutor-1472-thread-1) [    x:collection1] o.a.s.u.RandomMergePolicy
RandomMergePolicy wrapping class org.apache.lucene.index.LogByteSizeMergePolicy: [LogByteSizeMergePolicy:
minMergeSize=1677721, mergeFactor=37, maxMergeSize=2147483648, maxMergeSizeForForcedMerge=9223372036854775807,
calibrateSizeByDeletes=false, maxMergeDocs=2147483647, maxCFSSegmentSizeMB=8.796093022207999E12,
noCFSRatio=1.0]
   [junit4]   2> 332389 INFO  (coreLoadExecutor-1472-thread-1) [    x:collection1] o.a.s.s.SolrIndexSearcher
Opening [Searcher@cbbc48[collection1] main]
   [junit4]   2> 332389 WARN  (coreLoadExecutor-1472-thread-1) [    x:collection1] o.a.s.r.ManagedResourceStorage
Cannot write to config directory /home/jenkins/workspace/Lucene-Solr-6.x-Linux/solr/core/src/test-files/solr/collection1/conf;
switching to use InMemory storage instead.
   [junit4]   2> 332397 INFO  (coreLoadExecutor-1472-thread-1) [    x:collection1] o.a.s.h.ReplicationHandler
Commits will be reserved for  10000
   [junit4]   2> 332397 INFO  (searcherExecutor-1473-thread-1-processing-x:collection1)
[    x:collection1] o.a.s.c.SolrCore [collection1] Registered new searcher Searcher@cbbc48[collection1]
main{ExitableDirectoryReader(UninvertingDirectoryReader())}
   [junit4]   2> 332399 INFO  (SUITE-TestMaxTokenLenTokenizer-seed#[ED11F8EA6375C040]-worker)
[    ] o.a.s.SolrTestCaseJ4 ####initCore end
   [junit4]   2> 332401 INFO  (TEST-TestMaxTokenLenTokenizer.testSingleFieldDiffAnalyzers-seed#[ED11F8EA6375C040])
[    ] o.a.s.SolrTestCaseJ4 ###Starting testSingleFieldDiffAnalyzers
   [junit4]   2> 332401 INFO  (TEST-TestMaxTokenLenTokenizer.testSingleFieldDiffAnalyzers-seed#[ED11F8EA6375C040])
[    ] o.a.s.u.DirectUpdateHandler2 [collection1] REMOVING ALL DOCUMENTS FROM INDEX
   [junit4]   2> 332401 INFO  (TEST-TestMaxTokenLenTokenizer.testSingleFieldDiffAnalyzers-seed#[ED11F8EA6375C040])
[    ] o.a.s.u.p.LogUpdateProcessorFactory [collection1]  webapp=null path=null params={_version_=-9223372036854775807&update.distrib=FROMLEADER&versions=true&wt=json&indent=true}{deleteByQuery=*:*}
0 0
   [junit4]   2> 332402 INFO  (TEST-TestMaxTokenLenTokenizer.testSingleFieldDiffAnalyzers-seed#[ED11F8EA6375C040])
[    ] o.a.s.u.DirectUpdateHandler2 start commit{,optimize=false,openSearcher=true,waitSearcher=true,expungeDeletes=false,softCommit=false,prepareCommit=false}
   [junit4]   2> 332402 INFO  (TEST-TestMaxTokenLenTokenizer.testSingleFieldDiffAnalyzers-seed#[ED11F8EA6375C040])
[    ] o.a.s.u.SolrIndexWriter Calling setCommitData with IW:org.apache.solr.update.SolrIndexWriter@1e7ab5e
   [junit4]   2> 332404 INFO  (TEST-TestMaxTokenLenTokenizer.testSingleFieldDiffAnalyzers-seed#[ED11F8EA6375C040])
[    ] o.a.s.s.SolrIndexSearcher Opening [Searcher@f9954f[collection1] main]
   [junit4]   2> 332405 INFO  (TEST-TestMaxTokenLenTokenizer.testSingleFieldDiffAnalyzers-seed#[ED11F8EA6375C040])
[    ] o.a.s.u.DirectUpdateHandler2 end_commit_flush
   [junit4]   2> 332405 INFO  (searcherExecutor-1473-thread-1) [    ] o.a.s.c.SolrCore
[collection1] Registered new searcher Searcher@f9954f[collection1] main{ExitableDirectoryReader(UninvertingDirectoryReader(Uninverting(_0(6.7.0):c1)))}
   [junit4]   2> 332405 INFO  (TEST-TestMaxTokenLenTokenizer.testSingleFieldDiffAnalyzers-seed#[ED11F8EA6375C040])
[    ] o.a.s.u.p.LogUpdateProcessorFactory [collection1]  webapp=null path=null params={wt=json&indent=true}{add=[1],commit=}
0 3
   [junit4]   2> 332406 INFO  (TEST-TestMaxTokenLenTokenizer.testSingleFieldDiffAnalyzers-seed#[ED11F8EA6375C040])
[    ] o.a.s.u.DirectUpdateHandler2 start commit{,optimize=false,openSearcher=true,waitSearcher=true,expungeDeletes=false,softCommit=false,prepareCommit=false}
   [junit4]   2> 332406 INFO  (TEST-TestMaxTokenLenTokenizer.testSingleFieldDiffAnalyzers-seed#[ED11F8EA6375C040])
[    ] o.a.s.u.SolrIndexWriter Calling setCommitData with IW:org.apache.solr.update.SolrIndexWriter@1e7ab5e
   [junit4]   2> 332407 INFO  (TEST-TestMaxTokenLenTokenizer.testSingleFieldDiffAnalyzers-seed#[ED11F8EA6375C040])
[    ] o.a.s.s.SolrIndexSearcher Opening [Searcher@8a4c52[collection1] main]
   [junit4]   2> 332408 INFO  (TEST-TestMaxTokenLenTokenizer.testSingleFieldDiffAnalyzers-seed#[ED11F8EA6375C040])
[    ] o.a.s.u.DirectUpdateHandler2 end_commit_flush
   [junit4]   2> 332408 INFO  (searcherExecutor-1473-thread-1) [    ] o.a.s.c.SolrCore
[collection1] Registered new searcher Searcher@8a4c52[collection1] main{ExitableDirectoryReader(UninvertingDirectoryReader(Uninverting(_0(6.7.0):c1)
Uninverting(_1(6.7.0):c1)))}
   [junit4]   2> 332408 INFO  (TEST-TestMaxTokenLenTokenizer.testSingleFieldDiffAnalyzers-seed#[ED11F8EA6375C040])
[    ] o.a.s.u.p.LogUpdateProcessorFactory [collection1]  webapp=null path=null params={wt=json&indent=true}{add=[2],commit=}
0 3
   [junit4]   2> 332409 INFO  (TEST-TestMaxTokenLenTokenizer.testSingleFieldDiffAnalyzers-seed#[ED11F8EA6375C040])
[    ] o.a.s.u.DirectUpdateHandler2 start commit{,optimize=false,openSearcher=true,waitSearcher=true,expungeDeletes=false,softCommit=false,prepareCommit=false}
   [junit4]   2> 332409 INFO  (TEST-TestMaxTokenLenTokenizer.testSingleFieldDiffAnalyzers-seed#[ED11F8EA6375C040])
[    ] o.a.s.u.SolrIndexWriter Calling setCommitData with IW:org.apache.solr.update.SolrIndexWriter@1e7ab5e
   [junit4]   2> 332414 INFO  (TEST-TestMaxTokenLenTokenizer.testSingleFieldDiffAnalyzers-seed#[ED11F8EA6375C040])
[    ] o.a.s.s.SolrIndexSearcher Opening [Searcher@ad6eb9[collection1] main]
   [junit4]   2> 332414 INFO  (TEST-TestMaxTokenLenTokenizer.testSingleFieldDiffAnalyzers-seed#[ED11F8EA6375C040])
[    ] o.a.s.u.DirectUpdateHandler2 end_commit_flush
   [junit4]   2> 332414 INFO  (searcherExecutor-1473-thread-1) [    ] o.a.s.c.SolrCore
[collection1] Registered new searcher Searcher@ad6eb9[collection1] main{ExitableDirectoryReader(UninvertingDirectoryReader(Uninverting(_0(6.7.0):c1)
Uninverting(_1(6.7.0):c1) Uninverting(_2(6.7.0):c1)))}
   [junit4]   2> 332415 INFO  (TEST-TestMaxTokenLenTokenizer.testSingleFieldDiffAnalyzers-seed#[ED11F8EA6375C040])
[    ] o.a.s.u.p.LogUpdateProcessorFactory [collection1]  webapp=null path=null params={wt=json&indent=true}{add=[3],commit=}
0 6
   [junit4]   2> 332415 INFO  (TEST-TestMaxTokenLenTokenizer.testSingleFieldDiffAnalyzers-seed#[ED11F8EA6375C040])
[    ] o.a.s.u.DirectUpdateHandler2 start commit{,optimize=false,openSearcher=true,waitSearcher=true,expungeDeletes=false,softCommit=false,prepareCommit=false}
   [junit4]   2> 332415 INFO  (TEST-TestMaxTokenLenTokenizer.testSingleFieldDiffAnalyzers-seed#[ED11F8EA6375C040])
[    ] o.a.s.u.SolrIndexWriter Calling setCommitData with IW:org.apache.solr.update.SolrIndexWriter@1e7ab5e
   [junit4]   2> 332417 INFO  (TEST-TestMaxTokenLenTokenizer.testSingleFieldDiffAnalyzers-seed#[ED11F8EA6375C040])
[    ] o.a.s.s.SolrIndexSearcher Opening [Searcher@1df2483[collection1] main]
   [junit4]   2> 332418 INFO  (TEST-TestMaxTokenLenTokenizer.testSingleFieldDiffAnalyzers-seed#[ED11F8EA6375C040])
[    ] o.a.s.u.DirectUpdateHandler2 end_commit_flush
   [junit4]   2> 332418 INFO  (searcherExecutor-1473-thread-1) [    ] o.a.s.c.SolrCore
[collection1] Registered new searcher Searcher@1df2483[collection1] main{ExitableDirectoryReader(UninvertingDirectoryReader(Uninverting(_0(6.7.0):c1)
Uninverting(_1(6.7.0):c1) Uninverting(_2(6.7.0):c1) Uninverting(_3(6.7.0):c1)))}
   [junit4]   2> 332418 INFO  (TEST-TestMaxTokenLenTokenizer.testSingleFieldDiffAnalyzers-seed#[ED11F8EA6375C040])
[    ] o.a.s.u.p.LogUpdateProcessorFactory [collection1]  webapp=null path=null params={wt=json&indent=true}{add=[4],commit=}
0 3
   [junit4]   2> 332418 INFO  (TEST-TestMaxTokenLenTokenizer.testSingleFieldDiffAnalyzers-seed#[ED11F8EA6375C040])
[    ] o.a.s.u.DirectUpdateHandler2 start commit{,optimize=false,openSearcher=true,waitSearcher=true,expungeDeletes=false,softCommit=false,prepareCommit=false}
   [junit4]   2> 332418 INFO  (TEST-TestMaxTokenLenTokenizer.testSingleFieldDiffAnalyzers-seed#[ED11F8EA6375C040])
[    ] o.a.s.u.SolrIndexWriter Calling setCommitData with IW:org.apache.solr.update.SolrIndexWriter@1e7ab5e
   [junit4]   2> 332420 INFO  (TEST-TestMaxTokenLenTokenizer.testSingleFieldDiffAnalyzers-seed#[ED11F8EA6375C040])
[    ] o.a.s.s.SolrIndexSearcher Opening [Searcher@73184b[collection1] main]
   [junit4]   2> 332421 INFO  (TEST-TestMaxTokenLenTokenizer.testSingleFieldDiffAnalyzers-seed#[ED11F8EA6375C040])
[    ] o.a.s.u.DirectUpdateHandler2 end_commit_flush
   [junit4]   2> 332421 INFO  (searcherExecutor-1473-thread-1) [    ] o.a.s.c.SolrCore
[collection1] Registered new searcher Searcher@73184b[collection1] main{ExitableDirectoryReader(UninvertingDirectoryReader(Uninverting(_0(6.7.0):c1)
Uninverting(_1(6.7.0):c1) Uninverting(_2(6.7.0):c1) Uninverting(_3(6.7.0):c1) Uninverting(_4(6.7.0):c1)))}
   [junit4]   2> 332421 INFO  (TEST-TestMaxTokenLenTokenizer.testSingleFieldDiffAnalyzers-seed#[ED11F8EA6375C040])
[    ] o.a.s.u.p.LogUpdateProcessorFactory [collection1]  webapp=null path=null params={wt=json&indent=true}{add=[5],commit=}
0 3
   [junit4]   2> 332421 INFO  (TEST-TestMaxTokenLenTokenizer.testSingleFieldDiffAnalyzers-seed#[ED11F8EA6375C040])
[    ] o.a.s.u.DirectUpdateHandler2 start commit{,optimize=false,openSearcher=true,waitSearcher=true,expungeDeletes=false,softCommit=false,prepareCommit=false}
   [junit4]   2> 332422 INFO  (TEST-TestMaxTokenLenTokenizer.testSingleFieldDiffAnalyzers-seed#[ED11F8EA6375C040])
[    ] o.a.s.u.DirectUpdateHandler2 No uncommitted changes. Skipping IW.commit.
   [junit4]   2> 332422 INFO  (TEST-TestMaxTokenLenTokenizer.testSingleFieldDiffAnalyzers-seed#[ED11F8EA6375C040])
[    ] o.a.s.u.DirectUpdateHandler2 end_commit_flush
   [junit4]   2> 332422 INFO  (TEST-TestMaxTokenLenTokenizer.testSingleFieldDiffAnalyzers-seed#[ED11F8EA6375C040])
[    ] o.a.s.u.p.LogUpdateProcessorFactory [collection1]  webapp=null path=null params={}{commit=}
0 0
   [junit4]   2> 332424 INFO  (TEST-TestMaxTokenLenTokenizer.testSingleFieldDiffAnalyzers-seed#[ED11F8EA6375C040])
[    ] o.a.s.c.S.Request [collection1]  webapp=null path=null params={q=*:*&wt=xml} hits=5
status=0 QTime=0
   [junit4]   2> 332426 INFO  (TEST-TestMaxTokenLenTokenizer.testSingleFieldDiffAnalyzers-seed#[ED11F8EA6375C040])
[    ] o.a.s.c.S.Request [collection1]  webapp=null path=null params={q=letter:let&wt=xml}
hits=1 status=0 QTime=0
   [junit4]   2> 332426 INFO  (TEST-TestMaxTokenLenTokenizer.testSingleFieldDiffAnalyzers-seed#[ED11F8EA6375C040])
[    ] o.a.s.c.S.Request [collection1]  webapp=null path=null params={q=letter:lett&wt=xml}
hits=0 status=0 QTime=0
   [junit4]   2> 332426 INFO  (TEST-TestMaxTokenLenTokenizer.testSingleFieldDiffAnalyzers-seed#[ED11F8EA6375C040])
[    ] o.a.s.c.S.Request [collection1]  webapp=null path=null params={q=lowerCase:low&wt=xml}
hits=1 status=0 QTime=0
   [junit4]   2> 332427 INFO  (TEST-TestMaxTokenLenTokenizer.testSingleFieldDiffAnalyzers-seed#[ED11F8EA6375C040])
[    ] o.a.s.c.S.Request [collection1]  webapp=null path=null params={q=lowerCase:l&wt=xml}
hits=0 status=0 QTime=0
   [junit4]   2> 332427 INFO  (TEST-TestMaxTokenLenTokenizer.testSingleFieldDiffAnalyzers-seed#[ED11F8EA6375C040])
[    ] o.a.s.c.S.Request [collection1]  webapp=null path=null params={q=lowerCase:lo&wt=xml}
hits=0 status=0 QTime=0
   [junit4]   2> 332427 INFO  (TEST-TestMaxTokenLenTokenizer.testSingleFieldDiffAnalyzers-seed#[ED11F8EA6375C040])
[    ] o.a.s.c.S.Request [collection1]  webapp=null path=null params={q=lowerCase:lower&wt=xml}
hits=0 status=0 QTime=0
   [junit4]   2> 332428 INFO  (TEST-TestMaxTokenLenTokenizer.testSingleFieldDiffAnalyzers-seed#[ED11F8EA6375C040])
[    ] o.a.s.c.S.Request [collection1]  webapp=null path=null params={q=whiteSpace:whi&wt=xml}
hits=1 status=0 QTime=0
   [junit4]   2> 332428 INFO  (TEST-TestMaxTokenLenTokenizer.testSingleFieldDiffAnalyzers-seed#[ED11F8EA6375C040])
[    ] o.a.s.c.S.Request [collection1]  webapp=null path=null params={q=whiteSpace:teS&wt=xml}
hits=1 status=0 QTime=0
   [junit4]   2> 332428 INFO  (TEST-TestMaxTokenLenTokenizer.testSingleFieldDiffAnalyzers-seed#[ED11F8EA6375C040])
[    ] o.a.s.c.S.Request [collection1]  webapp=null path=null params={q=whiteSpace:in&wt=xml}
hits=1 status=0 QTime=0
   [junit4]   2> 332429 INFO  (TEST-TestMaxTokenLenTokenizer.testSingleFieldDiffAnalyzers-seed#[ED11F8EA6375C040])
[    ] o.a.s.c.S.Request [collection1]  webapp=null path=null params={q=whiteSpace:white&wt=xml}
hits=0 status=0 QTime=0
   [junit4]   2> 332429 INFO  (TEST-TestMaxTokenLenTokenizer.testSingleFieldDiffAnalyzers-seed#[ED11F8EA6375C040])
[    ] o.a.s.c.S.Request [collection1]  webapp=null path=null params={q=unicodeWhiteSpace:uni&wt=xml}
hits=1 status=0 QTime=0
   [junit4]   2> 332438 INFO  (TEST-TestMaxTokenLenTokenizer.testSingleFieldDiffAnalyzers-seed#[ED11F8EA6375C040])
[    ] o.a.s.c.S.Request [collection1]  webapp=null path=null params={q=unicodeWhiteSpace:cod&wt=xml}
hits=1 status=0 QTime=0
   [junit4]   2> 332439 INFO  (TEST-TestMaxTokenLenTokenizer.testSingleFieldDiffAnalyzers-seed#[ED11F8EA6375C040])
[    ] o.a.s.c.S.Request [collection1]  webapp=null path=null params={q=unicodeWhiteSpace:e&wt=xml}
hits=1 status=0 QTime=0
   [junit4]   2> 332440 INFO  (TEST-TestMaxTokenLenTokenizer.testSingleFieldDiffAnalyzers-seed#[ED11F8EA6375C040])
[    ] o.a.s.c.S.Request [collection1]  webapp=null path=null params={q=unicodeWhiteSpace:unico&wt=xml}
hits=0 status=0 QTime=0
   [junit4]   2> 332443 INFO  (TEST-TestMaxTokenLenTokenizer.testSingleFieldDiffAnalyzers-seed#[ED11F8EA6375C040])
[    ] o.a.s.c.S.Request [collection1]  webapp=null path=null params={q=keyword:keyword&wt=xml}
hits=1 status=0 QTime=0
   [junit4]   2> 332444 INFO  (TEST-TestMaxTokenLenTokenizer.testSingleFieldDiffAnalyzers-seed#[ED11F8EA6375C040])
[    ] o.a.s.c.S.Request [collection1]  webapp=null path=null params={q=keyword:key&wt=xml}
hits=0 status=0 QTime=0
   [junit4]   2> 332444 INFO  (TEST-TestMaxTokenLenTokenizer.testSingleFieldDiffAnalyzers-seed#[ED11F8EA6375C040])
[    ] o.a.s.SolrTestCaseJ4 ###Ending testSingleFieldDiffAnalyzers
   [junit4]   2> 332446 INFO  (TEST-TestMaxTokenLenTokenizer.testSingleFieldSameAnalyzers-seed#[ED11F8EA6375C040])
[    ] o.a.s.SolrTestCaseJ4 ###Starting testSingleFieldSameAnalyzers
   [junit4]   2> 332446 INFO  (TEST-TestMaxTokenLenTokenizer.testSingleFieldSameAnalyzers-seed#[ED11F8EA6375C040])
[    ] o.a.s.u.DirectUpdateHandler2 [collection1] REMOVING ALL DOCUMENTS FROM INDEX
   [junit4]   2> 332446 INFO  (TEST-TestMaxTokenLenTokenizer.testSingleFieldSameAnalyzers-seed#[ED11F8EA6375C040])
[    ] o.a.s.u.p.LogUpdateProcessorFactory [collection1]  webapp=null path=null params={_version_=-9223372036854775807&update.distrib=FROMLEADER&versions=true&wt=json&indent=true}{deleteByQuery=*:*}
0 0
   [junit4]   2> 332446 INFO  (TEST-TestMaxTokenLenTokenizer.testSingleFieldSameAnalyzers-seed#[ED11F8EA6375C040])
[    ] o.a.s.u.DirectUpdateHandler2 start commit{,optimize=false,openSearcher=true,waitSearcher=true,expungeDeletes=false,softCommit=false,prepareCommit=false}
   [junit4]   2> 332446 INFO  (TEST-TestMaxTokenLenTokenizer.testSingleFieldSameAnalyzers-seed#[ED11F8EA6375C040])
[    ] o.a.s.u.SolrIndexWriter Calling setCommitData with IW:org.apache.solr.update.SolrIndexWriter@1e7ab5e
   [junit4]   2> 332448 INFO  (TEST-TestMaxTokenLenTokenizer.testSingleFieldSameAnalyzers-seed#[ED11F8EA6375C040])
[    ] o.a.s.s.SolrIndexSearcher Opening [Searcher@1d37afd[collection1] main]
   [junit4]   2> 332448 INFO  (TEST-TestMaxTokenLenTokenizer.testSingleFieldSameAnalyzers-seed#[ED11F8EA6375C040])
[    ] o.a.s.u.DirectUpdateHandler2 end_commit_flush
   [junit4]   2> 332452 INFO  (searcherExecutor-1473-thread-1) [    ] o.a.s.c.SolrCore
[collection1] Registered new searcher Searcher@1d37afd[collection1] main{ExitableDirectoryReader(UninvertingDirectoryReader(Uninverting(_5(6.7.0):c1)))}
   [junit4]   2> 332456 INFO  (TEST-TestMaxTokenLenTokenizer.testSingleFieldSameAnalyzers-seed#[ED11F8EA6375C040])
[    ] o.a.s.u.p.LogUpdateProcessorFactory [collection1]  webapp=null path=null params={wt=json&indent=true}{add=[1],commit=}
0 9
   [junit4]   2> 332456 INFO  (TEST-TestMaxTokenLenTokenizer.testSingleFieldSameAnalyzers-seed#[ED11F8EA6375C040])
[    ] o.a.s.u.DirectUpdateHandler2 start commit{,optimize=false,openSearcher=true,waitSearcher=true,expungeDeletes=false,softCommit=false,prepareCommit=false}
   [junit4]   2> 332456 INFO  (TEST-TestMaxTokenLenTokenizer.testSingleFieldSameAnalyzers-seed#[ED11F8EA6375C040])
[    ] o.a.s.u.SolrIndexWriter Calling setCommitData with IW:org.apache.solr.update.SolrIndexWriter@1e7ab5e
   [junit4]   2> 332458 INFO  (TEST-TestMaxTokenLenTokenizer.testSingleFieldSameAnalyzers-seed#[ED11F8EA6375C040])
[    ] o.a.s.s.SolrIndexSearcher Opening [Searcher@e7f524[collection1] main]
   [junit4]   2> 332458 INFO  (TEST-TestMaxTokenLenTokenizer.testSingleFieldSameAnalyzers-seed#[ED11F8EA6375C040])
[    ] o.a.s.u.DirectUpdateHandler2 end_commit_flush
   [junit4]   2> 332468 INFO  (searcherExecutor-1473-thread-1) [    ] o.a.s.c.SolrCore
[collection1] Registered new searcher Searcher@e7f524[collection1] main{ExitableDirectoryReader(UninvertingDirectoryReader(Uninverting(_5(6.7.0):c1)
Uninverting(_6(6.7.0):c1)))}
   [junit4]   2> 332468 INFO  (TEST-TestMaxTokenLenTokenizer.testSingleFieldSameAnalyzers-seed#[ED11F8EA6375C040])
[    ] o.a.s.u.p.LogUpdateProcessorFactory [collection1]  webapp=null path=null params={wt=json&indent=true}{add=[2],commit=}
0 12
   [junit4]   2> 332469 INFO  (TEST-TestMaxTokenLenTokenizer.testSingleFieldSameAnalyzers-seed#[ED11F8EA6375C040])
[    ] o.a.s.u.DirectUpdateHandler2 start commit{,optimize=false,openSearcher=true,waitSearcher=true,expungeDeletes=false,softCommit=false,prepareCommit=false}
   [junit4]   2> 332469 INFO  (TEST-TestMaxTokenLenTokenizer.testSingleFieldSameAnalyzers-seed#[ED11F8EA6375C040])
[    ] o.a.s.u.SolrIndexWriter Calling setCommitData with IW:org.apache.solr.update.SolrIndexWriter@1e7ab5e
   [junit4]   2> 332471 INFO  (TEST-TestMaxTokenLenTokenizer.testSingleFieldSameAnalyzers-seed#[ED11F8EA6375C040])
[    ] o.a.s.s.SolrIndexSearcher Opening [Searcher@1de08f9[collection1] main]
   [junit4]   2> 332471 INFO  (TEST-TestMaxTokenLenTokenizer.testSingleFieldSameAnalyzers-seed#[ED11F8EA6375C040])
[    ] o.a.s.u.DirectUpdateHandler2 end_commit_flush
   [junit4]   2> 332471 INFO  (searcherExecutor-1473-thread-1) [    ] o.a.s.c.SolrCore
[collection1] Registered new searcher Searcher@1de08f9[collection1] main{ExitableDirectoryReader(UninvertingDirectoryReader(Uninverting(_5(6.7.0):c1)
Uninverting(_6(6.7.0):c1) Uninverting(_7(6.7.0):c1)))}
   [junit4]   2> 332471 INFO  (TEST-TestMaxTokenLenTokenizer.testSingleFieldSameAnalyzers-seed#[ED11F8EA6375C040])
[    ] o.a.s.u.p.LogUpdateProcessorFactory [collection1]  webapp=null path=null params={wt=json&indent=true}{add=[3],commit=}
0 3
   [junit4]   2> 332472 INFO  (TEST-TestMaxTokenLenTokenizer.testSingleFieldSameAnalyzers-seed#[ED11F8EA6375C040])
[    ] o.a.s.u.DirectUpdateHandler2 start commit{,optimize=false,openSearcher=true,waitSearcher=true,expungeDeletes=false,softCommit=false,prepareCommit=false}
   [junit4]   2> 332472 INFO  (TEST-TestMaxTokenLenTokenizer.testSingleFieldSameAnalyzers-seed#[ED11F8EA6375C040])
[    ] o.a.s.u.SolrIndexWriter Calling setCommitData with IW:org.apache.solr.update.SolrIndexWriter@1e7ab5e
   [junit4]   2> 332474 INFO  (TEST-TestMaxTokenLenTokenizer.testSingleFieldSameAnalyzers-seed#[ED11F8EA6375C040])
[    ] o.a.s.s.SolrIndexSearcher Opening [Searcher@5a76f3[collection1] main]
   [junit4]   2> 332474 INFO  (TEST-TestMaxTokenLenTokenizer.testSingleFieldSameAnalyzers-seed#[ED11F8EA6375C040])
[    ] o.a.s.u.DirectUpdateHandler2 end_commit_flush
   [junit4]   2> 332474 INFO  (searcherExecutor-1473-thread-1) [    ] o.a.s.c.SolrCore
[collection1] Registered new searcher Searcher@5a76f3[collection1] main{ExitableDirectoryReader(UninvertingDirectoryReader(Uninverting(_5(6.7.0):c1)
Uninverting(_6(6.7.0):c1) Uninverting(_7(6.7.0):c1) Uninverting(_8(6.7.0):c1)))}
   [junit4]   2> 332474 INFO  (TEST-TestMaxTokenLenTokenizer.testSingleFieldSameAnalyzers-seed#[ED11F8EA6375C040])
[    ] o.a.s.u.p.LogUpdateProcessorFactory [collection1]  webapp=null path=null params={wt=json&indent=true}{add=[4],commit=}
0 2
   [junit4]   2> 332475 INFO  (TEST-TestMaxTokenLenTokenizer.testSingleFieldSameAnalyzers-seed#[ED11F8EA6375C040])
[    ] o.a.s.u.DirectUpdateHandler2 start commit{,optimize=false,openSearcher=true,waitSearcher=true,expungeDeletes=false,softCommit=false,prepareCommit=false}
   [junit4]   2> 332475 INFO  (TEST-TestMaxTokenLenTokenizer.testSingleFieldSameAnalyzers-seed#[ED11F8EA6375C040])
[    ] o.a.s.u.SolrIndexWriter Calling setCommitData with IW:org.apache.solr.update.SolrIndexWriter@1e7ab5e
   [junit4]   2> 332476 INFO  (TEST-TestMaxTokenLenTokenizer.testSingleFieldSameAnalyzers-seed#[ED11F8EA6375C040])
[    ] o.a.s.s.SolrIndexSearcher Opening [Searcher@12cbf6[collection1] main]
   [junit4]   2> 332477 INFO  (searcherExecutor-1473-thread-1) [    ] o.a.s.c.SolrCore
[collection1] Registered new searcher Searcher@12cbf6[collection1] main{ExitableDirectoryReader(UninvertingDirectoryReader(Uninverting(_5(6.7.0):c1)
Uninverting(_6(6.7.0):c1) Uninverting(_7(6.7.0):c1) Uninverting(_8(6.7.0):c1) Uninverting(_9(6.7.0):c1)))}
   [junit4]   2> 332477 INFO  (TEST-TestMaxTokenLenTokenizer.testSingleFieldSameAnalyzers-seed#[ED11F8EA6375C040])
[    ] o.a.s.u.DirectUpdateHandler2 end_commit_flush
   [junit4]   2> 332477 INFO  (TEST-TestMaxTokenLenTokenizer.testSingleFieldSameAnalyzers-seed#[ED11F8EA6375C040])
[    ] o.a.s.u.p.LogUpdateProcessorFactory [collection1]  webapp=null path=null params={wt=json&indent=true}{add=[5],commit=}
0 2
   [junit4]   2> 332477 INFO  (TEST-TestMaxTokenLenTokenizer.testSingleFieldSameAnalyzers-seed#[ED11F8EA6375C040])
[    ] o.a.s.u.DirectUpdateHandler2 start commit{,optimize=false,openSearcher=true,waitSearcher=true,expungeDeletes=false,softCommit=false,prepareCommit=false}
   [junit4]   2> 332477 INFO  (TEST-TestMaxTokenLenTokenizer.testSingleFieldSameAnalyzers-seed#[ED11F8EA6375C040])
[    ] o.a.s.u.DirectUpdateHandler2 No uncommitted changes. Skipping IW.commit.
   [junit4]   2> 332477 INFO  (TEST-TestMaxTokenLenTokenizer.testSingleFieldSameAnalyzers-seed#[ED11F8EA6375C040])
[    ] o.a.s.u.DirectUpdateHandler2 end_commit_flush
   [junit4]   2> 332477 INFO  (TEST-TestMaxTokenLenTokenizer.testSingleFieldSameAnalyzers-seed#[ED11F8EA6375C040])
[    ] o.a.s.u.p.LogUpdateProcessorFactory [collection1]  webapp=null path=null params={}{commit=}
0 0
   [junit4]   2> 332478 INFO  (TEST-TestMaxTokenLenTokenizer.testSingleFieldSameAnalyzers-seed#[ED11F8EA6375C040])
[    ] o.a.s.c.S.Request [collection1]  webapp=null path=null params={q=*:*&wt=xml} hits=5
status=0 QTime=0
   [junit4]   2> 332479 INFO  (TEST-TestMaxTokenLenTokenizer.testSingleFieldSameAnalyzers-seed#[ED11F8EA6375C040])
[    ] o.a.s.c.S.Request [collection1]  webapp=null path=null params={q=letter0:l&wt=xml}
hits=0 status=0 QTime=0
   [junit4]   2> 332479 INFO  (TEST-TestMaxTokenLenTokenizer.testSingleFieldSameAnalyzers-seed#[ED11F8EA6375C040])
[    ] o.a.s.c.S.Request [collection1]  webapp=null path=null params={q=letter0:let&wt=xml}
hits=1 status=0 QTime=0
   [junit4]   2> 332480 INFO  (TEST-TestMaxTokenLenTokenizer.testSingleFieldSameAnalyzers-seed#[ED11F8EA6375C040])
[    ] o.a.s.c.S.Request [collection1]  webapp=null path=null params={q=letter0:lett&wt=xml}
hits=0 status=0 QTime=0
   [junit4]   2> 332480 ERROR (TEST-TestMaxTokenLenTokenizer.testSingleFieldSameAnalyzers-seed#[ED11F8EA6375C040])
[    ] o.a.s.SolrTestCaseJ4 REQUEST FAILED: xpath=//result[@numFound=1]
   [junit4]   2> 	xml response was: <?xml version="1.0" encoding="UTF-8"?>
   [junit4]   2> <response>
   [junit4]   2> <lst name="responseHeader"><int name="status">0</int><int
name="QTime">0</int></lst><result name="response" numFound="0" start="0"></result>
   [junit4]   2> </response>
   [junit4]   2> 
   [junit4]   2> 	request was:q=letter0:lett&wt=xml
   [junit4]   2> 332480 ERROR (TEST-TestMaxTokenLenTokenizer.testSingleFieldSameAnalyzers-seed#[ED11F8EA6375C040])
[    ] o.a.s.SolrTestCaseJ4 REQUEST FAILED: q=letter0:lett&wt=xml:java.lang.RuntimeException:
REQUEST FAILED: xpath=//result[@numFound=1]
   [junit4]   2> 	xml response was: <?xml version="1.0" encoding="UTF-8"?>
   [junit4]   2> <response>
   [junit4]   2> <lst name="responseHeader"><int name="status">0</int><int
name="QTime">0</int></lst><result name="response" numFound="0" start="0"></result>
   [junit4]   2> </response>
   [junit4]   2> 
   [junit4]   2> 	request was:q=letter0:lett&wt=xml
   [junit4]   2> 	at org.apache.solr.SolrTestCaseJ4.assertQ(SolrTestCaseJ4.java:888)
   [junit4]   2> 	at org.apache.solr.util.TestMaxTokenLenTokenizer.testSingleFieldSameAnalyzers(TestMaxTokenLenTokenizer.java:104)
   [junit4]   2> 	at sun.reflect.NativeMethodAccessorImpl.invoke0(Native Method)
   [junit4]   2> 	at sun.reflect.NativeMethodAccessorImpl.invoke(NativeMethodAccessorImpl.java:62)
   [junit4]   2> 	at sun.reflect.DelegatingMethodAccessorImpl.invoke(DelegatingMethodAccessorImpl.java:43)
   [junit4]   2> 	at java.lang.reflect.Method.invoke(Method.java:498)
   [junit4]   2> 	at com.carrotsearch.randomizedtesting.RandomizedRunner.invoke(RandomizedRunner.java:1713)
   [junit4]   2> 	at com.carrotsearch.randomizedtesting.RandomizedRunner$8.evaluate(RandomizedRunner.java:907)
   [junit4]   2> 	at com.carrotsearch.randomizedtesting.RandomizedRunner$9.evaluate(RandomizedRunner.java:943)
   [junit4]   2> 	at com.carrotsearch.randomizedtesting.RandomizedRunner$10.evaluate(RandomizedRunner.java:957)
   [junit4]   2> 	at com.carrotsearch.randomizedtesting.rules.SystemPropertiesRestoreRule$1.evaluate(SystemPropertiesRestoreRule.java:57)
   [junit4]   2> 	at org.apache.lucene.util.TestRuleSetupTeardownChained$1.evaluate(TestRuleSetupTeardownChained.java:49)
   [junit4]   2> 	at org.apache.lucene.util.AbstractBeforeAfterRule$1.evaluate(AbstractBeforeAfterRule.java:45)
   [junit4]   2> 	at org.apache.lucene.util.TestRuleThreadAndTestName$1.evaluate(TestRuleThreadAndTestName.java:48)
   [junit4]   2> 	at org.apache.lucene.util.TestRuleIgnoreAfterMaxFailures$1.evaluate(TestRuleIgnoreAfterMaxFailures.java:64)
   [junit4]   2> 	at org.apache.lucene.util.TestRuleMarkFailure$1.evaluate(TestRuleMarkFailure.java:47)
   [junit4]   2> 	at com.carrotsearch.randomizedtesting.rules.StatementAdapter.evaluate(StatementAdapter.java:36)
   [junit4]   2> 	at com.carrotsearch.randomizedtesting.ThreadLeakControl$StatementRunner.run(ThreadLeakControl.java:368)
   [junit4]   2> 	at com.carrotsearch.randomizedtesting.ThreadLeakControl.forkTimeoutingTask(ThreadLeakControl.java:817)
   [junit4]   2> 	at com.carrotsearch.randomizedtesting.ThreadLeakControl$3.evaluate(ThreadLeakControl.java:468)
   [junit4]   2> 	at com.carrotsearch.randomizedtesting.RandomizedRunner.runSingleTest(RandomizedRunner.java:916)
   [junit4]   2> 	at com.carrotsearch.randomizedtesting.RandomizedRunner$5.evaluate(RandomizedRunner.java:802)
   [junit4]   2> 	at com.carrotsearch.randomizedtesting.RandomizedRunner$6.evaluate(RandomizedRunner.java:852)
   [junit4]   2> 	at com.carrotsearch.randomizedtesting.RandomizedRunner$7.evaluate(RandomizedRunner.java:863)
   [junit4]   2> 	at com.carrotsearch.randomizedtesting.rules.StatementAdapter.evaluate(StatementAdapter.java:36)
   [junit4]   2> 	at com.carrotsearch.randomizedtesting.rules.SystemPropertiesRestoreRule$1.evaluate(SystemPropertiesRestoreRule.java:57)
   [junit4]   2> 	at org.apache.lucene.util.AbstractBeforeAfterRule$1.evaluate(AbstractBeforeAfterRule.java:45)
   [junit4]   2> 	at com.carrotsearch.randomizedtesting.rules.StatementAdapter.evaluate(StatementAdapter.java:36)
   [junit4]   2> 	at org.apache.lucene.util.TestRuleStoreClassName$1.evaluate(TestRuleStoreClassName.java:41)
   [junit4]   2> 	at com.carrotsearch.randomizedtesting.rules.NoShadowingOrOverridesOnMethodsRule$1.evaluate(NoShadowingOrOverridesOnMethodsRule.java:40)
   [junit4]   2> 	at com.carrotsearch.randomizedtesting.rules.NoShadowingOrOverridesOnMethodsRule$1.evaluate(NoShadowingOrOverridesOnMethodsRule.java:40)
   [junit4]   2> 	at com.carrotsearch.randomizedtesting.rules.StatementAdapter.evaluate(StatementAdapter.java:36)
   [junit4]   2> 	at com.carrotsearch.randomizedtesting.rules.StatementAdapter.evaluate(StatementAdapter.java:36)
   [junit4]   2> 	at com.carrotsearch.randomizedtesting.rules.StatementAdapter.evaluate(StatementAdapter.java:36)
   [junit4]   2> 	at org.apache.lucene.util.TestRuleAssertionsRequired$1.evaluate(TestRuleAssertionsRequired.java:53)
   [junit4]   2> 	at org.apache.lucene.util.TestRuleMarkFailure$1.evaluate(TestRuleMarkFailure.java:47)
   [junit4]   2> 	at org.apache.lucene.util.TestRuleIgnoreAfterMaxFailures$1.evaluate(TestRuleIgnoreAfterMaxFailures.java:64)
   [junit4]   2> 	at org.apache.lucene.util.TestRuleIgnoreTestSuites$1.evaluate(TestRuleIgnoreTestSuites.java:54)
   [junit4]   2> 	at com.carrotsearch.randomizedtesting.rules.StatementAdapter.evaluate(StatementAdapter.java:36)
   [junit4]   2> 	at com.carrotsearch.randomizedtesting.ThreadLeakControl$StatementRunner.run(ThreadLeakControl.java:368)
   [junit4]   2> 	at java.lang.Thread.run(Thread.java:748)
   [junit4]   2> 
   [junit4]   2> 332481 INFO  (TEST-TestMaxTokenLenTokenizer.testSingleFieldSameAnalyzers-seed#[ED11F8EA6375C040])
[    ] o.a.s.SolrTestCaseJ4 ###Ending testSingleFieldSameAnalyzers
   [junit4]   2> NOTE: reproduce with: ant test  -Dtestcase=TestMaxTokenLenTokenizer -Dtests.method=testSingleFieldSameAnalyzers
-Dtests.seed=ED11F8EA6375C040 -Dtests.multiplier=3 -Dtests.slow=true -Dtests.locale=fr-BE
-Dtests.timezone=SystemV/PST8PDT -Dtests.asserts=true -Dtests.file.encoding=ISO-8859-1
   [junit4] ERROR   0.04s J1 | TestMaxTokenLenTokenizer.testSingleFieldSameAnalyzers <<<
   [junit4]    > Throwable #1: java.lang.RuntimeException: Exception during query
   [junit4]    > 	at __randomizedtesting.SeedInfo.seed([ED11F8EA6375C040:87C3C7853B96108F]:0)
   [junit4]    > 	at org.apache.solr.SolrTestCaseJ4.assertQ(SolrTestCaseJ4.java:895)
   [junit4]    > 	at org.apache.solr.util.TestMaxTokenLenTokenizer.testSingleFieldSameAnalyzers(TestMaxTokenLenTokenizer.java:104)
   [junit4]    > 	at java.lang.Thread.run(Thread.java:748)
   [junit4]    > Caused by: java.lang.RuntimeException: REQUEST FAILED: xpath=//result[@numFound=1]
   [junit4]    > 	xml response was: <?xml version="1.0" encoding="UTF-8"?>
   [junit4]    > <response>
   [junit4]    > <lst name="responseHeader"><int name="status">0</int><int
name="QTime">0</int></lst><result name="response" numFound="0" start="0"></result>
   [junit4]    > </response>
   [junit4]    > 	request was:q=letter0:lett&wt=xml
   [junit4]    > 	at org.apache.solr.SolrTestCaseJ4.assertQ(SolrTestCaseJ4.java:888)
   [junit4]    > 	... 40 more
   [junit4]   2> 332482 INFO  (SUITE-TestMaxTokenLenTokenizer-seed#[ED11F8EA6375C040]-worker)
[    ] o.a.s.SolrTestCaseJ4 ###deleteCore
   [junit4]   2> 332482 INFO  (SUITE-TestMaxTokenLenTokenizer-seed#[ED11F8EA6375C040]-worker)
[    ] o.a.s.c.CoreContainer Shutting down CoreContainer instance=7336241
   [junit4]   2> 332483 INFO  (SUITE-TestMaxTokenLenTokenizer-seed#[ED11F8EA6375C040]-worker)
[    ] o.a.s.m.SolrMetricManager Closing metric reporters for: solr.node
   [junit4]   2> 332483 INFO  (SUITE-TestMaxTokenLenTokenizer-seed#[ED11F8EA6375C040]-worker)
[    ] o.a.s.m.SolrMetricManager Closing metric reporters for: solr.jvm
   [junit4]   2> 332484 INFO  (SUITE-TestMaxTokenLenTokenizer-seed#[ED11F8EA6375C040]-worker)
[    ] o.a.s.m.SolrMetricManager Closing metric reporters for: solr.jetty
   [junit4]   2> 332484 INFO  (SUITE-TestMaxTokenLenTokenizer-seed#[ED11F8EA6375C040]-worker)
[    ] o.a.s.c.TransientSolrCoreCacheDefault Allocating transient cache for 2147483647 transient
cores
   [junit4]   2> 332485 INFO  (coreCloseExecutor-1477-thread-1) [    x:collection1] o.a.s.c.SolrCore
[collection1]  CLOSING SolrCore org.apache.solr.core.SolrCore@16c0f5e
   [junit4]   2> 332486 INFO  (coreCloseExecutor-1477-thread-1) [    x:collection1] o.a.s.m.SolrMetricManager
Closing metric reporters for: solr.core.collection1
   [junit4]   2> NOTE: leaving temporary files on disk at: /home/jenkins/workspace/Lucene-Solr-6.x-Linux/solr/build/solr-core/test/J1/temp/solr.util.TestMaxTokenLenTokenizer_ED11F8EA6375C040-001
   [junit4]   2> NOTE: test params are: codec=Asserting(Lucene62): {lowerCase0=TestBloomFilteredLucenePostings(BloomFilteringPostingsFormat(Lucene50(blocksize=128))),
whiteSpace=PostingsFormat(name=LuceneVarGapDocFreqInterval), letter=FST50, lowerCase=TestBloomFilteredLucenePostings(BloomFilteringPostingsFormat(Lucene50(blocksize=128))),
unicodeWhiteSpace=FST50, letter0=FST50, unicodeWhiteSpace0=FST50, keyword0=TestBloomFilteredLucenePostings(BloomFilteringPostingsFormat(Lucene50(blocksize=128))),
id=TestBloomFilteredLucenePostings(BloomFilteringPostingsFormat(Lucene50(blocksize=128))),
keyword=TestBloomFilteredLucenePostings(BloomFilteringPostingsFormat(Lucene50(blocksize=128))),
whiteSpace0=PostingsFormat(name=LuceneVarGapDocFreqInterval)}, docValues:{}, maxPointsInLeafNode=1897,
maxMBSortInHeap=5.477204698504007, sim=RandomSimilarity(queryNorm=false,coord=crazy): {},
locale=fr-BE, timezone=SystemV/PST8PDT
   [junit4]   2> NOTE: Linux 4.10.0-21-generic i386/Oracle Corporation 1.8.0_131 (32-bit)/cpus=8,threads=1,free=313957368,total=510656512
   [junit4]   2> NOTE: All tests run in this JVM: [DeleteInactiveReplicaTest, AnalyticsQueryTest,
BadCopyFieldTest, TestFastOutputStream, CopyFieldTest, JsonLoaderTest, TestXmlQParserPlugin,
TestComplexPhraseQParserPlugin, SpatialHeatmapFacetsTest, BlockCacheTest, ConnectionManagerTest,
TestElisionMultitermQuery, SimplePostToolTest, DistributedQueueTest, TestPayloadCheckQParserPlugin,
TestCloudPivotFacet, TestStressCloudBlindAtomicUpdates, TestDeleteCollectionOnDownNodes, TestRequestForwarding,
ZkSolrClientTest, SystemInfoHandlerTest, LeaderInitiatedRecoveryOnShardRestartTest, TestHashPartitioner,
ConnectionReuseTest, TestSegmentSorting, TestFieldTypeResource, TestSubQueryTransformerDistrib,
BasicFunctionalityTest, HdfsBasicDistributedZkTest, DistributedMLTComponentTest, SharedFSAutoReplicaFailoverUtilsTest,
TestSearchPerf, TestLeaderElectionZkExpiry, AssignTest, MergeStrategyTest, DistributedDebugComponentTest,
TestShardHandlerFactory, SpellingQueryConverterTest, MultiTermTest, TestDelegationWithHadoopAuth,
TestPivotHelperCode, DistributedIntervalFacetingTest, SchemaVersionSpecificBehaviorTest, SampleTest,
SaslZkACLProviderTest, TestReqParamsAPI, TestQueryTypes, TestMaxTokenLenTokenizer]
   [junit4] Completed [133/715 (1!)] on J1 in 0.55s, 2 tests, 1 error <<< FAILURES!

[...truncated 41336 lines...]

Mime
View raw message