lucene-dev mailing list archives

Site index · List index
Message view « Date » · « Thread »
Top « Date » · « Thread »
From Policeman Jenkins Server <jenk...@thetaphi.de>
Subject [JENKINS] Lucene-Solr-6.x-Linux (32bit/jdk1.8.0_131) - Build # 3634 - Still Unstable!
Date Thu, 01 Jun 2017 01:20:37 GMT
Build: https://jenkins.thetaphi.de/job/Lucene-Solr-6.x-Linux/3634/
Java: 32bit/jdk1.8.0_131 -server -XX:+UseConcMarkSweepGC

1 tests failed.
FAILED:  org.apache.solr.util.TestMaxTokenLenTokenizer.testSingleFieldSameAnalyzers

Error Message:
Exception during query

Stack Trace:
java.lang.RuntimeException: Exception during query
	at __randomizedtesting.SeedInfo.seed([9B58DB541240BF31:F18AE43B4AA36FFE]:0)
	at org.apache.solr.SolrTestCaseJ4.assertQ(SolrTestCaseJ4.java:895)
	at org.apache.solr.util.TestMaxTokenLenTokenizer.testSingleFieldSameAnalyzers(TestMaxTokenLenTokenizer.java:104)
	at sun.reflect.NativeMethodAccessorImpl.invoke0(Native Method)
	at sun.reflect.NativeMethodAccessorImpl.invoke(NativeMethodAccessorImpl.java:62)
	at sun.reflect.DelegatingMethodAccessorImpl.invoke(DelegatingMethodAccessorImpl.java:43)
	at java.lang.reflect.Method.invoke(Method.java:498)
	at com.carrotsearch.randomizedtesting.RandomizedRunner.invoke(RandomizedRunner.java:1713)
	at com.carrotsearch.randomizedtesting.RandomizedRunner$8.evaluate(RandomizedRunner.java:907)
	at com.carrotsearch.randomizedtesting.RandomizedRunner$9.evaluate(RandomizedRunner.java:943)
	at com.carrotsearch.randomizedtesting.RandomizedRunner$10.evaluate(RandomizedRunner.java:957)
	at com.carrotsearch.randomizedtesting.rules.SystemPropertiesRestoreRule$1.evaluate(SystemPropertiesRestoreRule.java:57)
	at org.apache.lucene.util.TestRuleSetupTeardownChained$1.evaluate(TestRuleSetupTeardownChained.java:49)
	at org.apache.lucene.util.AbstractBeforeAfterRule$1.evaluate(AbstractBeforeAfterRule.java:45)
	at org.apache.lucene.util.TestRuleThreadAndTestName$1.evaluate(TestRuleThreadAndTestName.java:48)
	at org.apache.lucene.util.TestRuleIgnoreAfterMaxFailures$1.evaluate(TestRuleIgnoreAfterMaxFailures.java:64)
	at org.apache.lucene.util.TestRuleMarkFailure$1.evaluate(TestRuleMarkFailure.java:47)
	at com.carrotsearch.randomizedtesting.rules.StatementAdapter.evaluate(StatementAdapter.java:36)
	at com.carrotsearch.randomizedtesting.ThreadLeakControl$StatementRunner.run(ThreadLeakControl.java:368)
	at com.carrotsearch.randomizedtesting.ThreadLeakControl.forkTimeoutingTask(ThreadLeakControl.java:817)
	at com.carrotsearch.randomizedtesting.ThreadLeakControl$3.evaluate(ThreadLeakControl.java:468)
	at com.carrotsearch.randomizedtesting.RandomizedRunner.runSingleTest(RandomizedRunner.java:916)
	at com.carrotsearch.randomizedtesting.RandomizedRunner$5.evaluate(RandomizedRunner.java:802)
	at com.carrotsearch.randomizedtesting.RandomizedRunner$6.evaluate(RandomizedRunner.java:852)
	at com.carrotsearch.randomizedtesting.RandomizedRunner$7.evaluate(RandomizedRunner.java:863)
	at com.carrotsearch.randomizedtesting.rules.StatementAdapter.evaluate(StatementAdapter.java:36)
	at com.carrotsearch.randomizedtesting.rules.SystemPropertiesRestoreRule$1.evaluate(SystemPropertiesRestoreRule.java:57)
	at org.apache.lucene.util.AbstractBeforeAfterRule$1.evaluate(AbstractBeforeAfterRule.java:45)
	at com.carrotsearch.randomizedtesting.rules.StatementAdapter.evaluate(StatementAdapter.java:36)
	at org.apache.lucene.util.TestRuleStoreClassName$1.evaluate(TestRuleStoreClassName.java:41)
	at com.carrotsearch.randomizedtesting.rules.NoShadowingOrOverridesOnMethodsRule$1.evaluate(NoShadowingOrOverridesOnMethodsRule.java:40)
	at com.carrotsearch.randomizedtesting.rules.NoShadowingOrOverridesOnMethodsRule$1.evaluate(NoShadowingOrOverridesOnMethodsRule.java:40)
	at com.carrotsearch.randomizedtesting.rules.StatementAdapter.evaluate(StatementAdapter.java:36)
	at com.carrotsearch.randomizedtesting.rules.StatementAdapter.evaluate(StatementAdapter.java:36)
	at com.carrotsearch.randomizedtesting.rules.StatementAdapter.evaluate(StatementAdapter.java:36)
	at org.apache.lucene.util.TestRuleAssertionsRequired$1.evaluate(TestRuleAssertionsRequired.java:53)
	at org.apache.lucene.util.TestRuleMarkFailure$1.evaluate(TestRuleMarkFailure.java:47)
	at org.apache.lucene.util.TestRuleIgnoreAfterMaxFailures$1.evaluate(TestRuleIgnoreAfterMaxFailures.java:64)
	at org.apache.lucene.util.TestRuleIgnoreTestSuites$1.evaluate(TestRuleIgnoreTestSuites.java:54)
	at com.carrotsearch.randomizedtesting.rules.StatementAdapter.evaluate(StatementAdapter.java:36)
	at com.carrotsearch.randomizedtesting.ThreadLeakControl$StatementRunner.run(ThreadLeakControl.java:368)
	at java.lang.Thread.run(Thread.java:748)
Caused by: java.lang.RuntimeException: REQUEST FAILED: xpath=//result[@numFound=1]
	xml response was: <?xml version="1.0" encoding="UTF-8"?>
<response>
<lst name="responseHeader"><int name="status">0</int><int name="QTime">0</int></lst><result name="response" numFound="0" start="0"></result>
</response>

	request was:q=letter0:lett&wt=xml
	at org.apache.solr.SolrTestCaseJ4.assertQ(SolrTestCaseJ4.java:888)
	... 40 more




Build Log:
[...truncated 13288 lines...]
   [junit4] Suite: org.apache.solr.util.TestMaxTokenLenTokenizer
   [junit4]   2> Creating dataDir: /home/jenkins/workspace/Lucene-Solr-6.x-Linux/solr/build/solr-core/test/J1/temp/solr.util.TestMaxTokenLenTokenizer_9B58DB541240BF31-001/init-core-data-001
   [junit4]   2> 1657062 WARN  (SUITE-TestMaxTokenLenTokenizer-seed#[9B58DB541240BF31]-worker) [    ] o.a.s.SolrTestCaseJ4 startTrackingSearchers: numOpens=1 numCloses=1
   [junit4]   2> 1657063 INFO  (SUITE-TestMaxTokenLenTokenizer-seed#[9B58DB541240BF31]-worker) [    ] o.a.s.SolrTestCaseJ4 Using PointFields
   [junit4]   2> 1657064 INFO  (SUITE-TestMaxTokenLenTokenizer-seed#[9B58DB541240BF31]-worker) [    ] o.a.s.SolrTestCaseJ4 Randomized ssl (true) and clientAuth (false) via: @org.apache.solr.util.RandomizeSSL(reason=, ssl=NaN, value=NaN, clientAuth=NaN)
   [junit4]   2> 1657064 INFO  (SUITE-TestMaxTokenLenTokenizer-seed#[9B58DB541240BF31]-worker) [    ] o.a.s.SolrTestCaseJ4 ####initCore
   [junit4]   2> 1657064 INFO  (SUITE-TestMaxTokenLenTokenizer-seed#[9B58DB541240BF31]-worker) [    ] o.a.s.c.SolrResourceLoader [null] Added 2 libs to classloader, from paths: [/home/jenkins/workspace/Lucene-Solr-6.x-Linux/solr/core/src/test-files/solr/collection1/lib, /home/jenkins/workspace/Lucene-Solr-6.x-Linux/solr/core/src/test-files/solr/collection1/lib/classes]
   [junit4]   2> 1657082 INFO  (SUITE-TestMaxTokenLenTokenizer-seed#[9B58DB541240BF31]-worker) [    ] o.a.s.c.SolrConfig Using Lucene MatchVersion: 6.7.0
   [junit4]   2> 1657097 INFO  (SUITE-TestMaxTokenLenTokenizer-seed#[9B58DB541240BF31]-worker) [    ] o.a.s.s.IndexSchema [null] Schema name=test
   [junit4]   2> 1657111 INFO  (SUITE-TestMaxTokenLenTokenizer-seed#[9B58DB541240BF31]-worker) [    ] o.a.s.s.IndexSchema Loaded schema test/1.0 with uniqueid field id
   [junit4]   2> 1657113 INFO  (SUITE-TestMaxTokenLenTokenizer-seed#[9B58DB541240BF31]-worker) [    ] o.a.s.u.UpdateShardHandler Creating UpdateShardHandler HTTP client with params: socketTimeout=30000&connTimeout=30000&retry=true
   [junit4]   2> 1657134 INFO  (SUITE-TestMaxTokenLenTokenizer-seed#[9B58DB541240BF31]-worker) [    ] o.a.s.m.r.SolrJmxReporter JMX monitoring for 'solr.node' (registry 'solr.node') enabled at server: com.sun.jmx.mbeanserver.JmxMBeanServer@1d4431c
   [junit4]   2> 1657137 INFO  (SUITE-TestMaxTokenLenTokenizer-seed#[9B58DB541240BF31]-worker) [    ] o.a.s.m.r.SolrJmxReporter JMX monitoring for 'solr.jvm' (registry 'solr.jvm') enabled at server: com.sun.jmx.mbeanserver.JmxMBeanServer@1d4431c
   [junit4]   2> 1657137 INFO  (SUITE-TestMaxTokenLenTokenizer-seed#[9B58DB541240BF31]-worker) [    ] o.a.s.m.r.SolrJmxReporter JMX monitoring for 'solr.jetty' (registry 'solr.jetty') enabled at server: com.sun.jmx.mbeanserver.JmxMBeanServer@1d4431c
   [junit4]   2> 1657138 INFO  (coreLoadExecutor-8760-thread-1) [    x:collection1] o.a.s.c.SolrResourceLoader [null] Added 2 libs to classloader, from paths: [/home/jenkins/workspace/Lucene-Solr-6.x-Linux/solr/core/src/test-files/solr/collection1/lib, /home/jenkins/workspace/Lucene-Solr-6.x-Linux/solr/core/src/test-files/solr/collection1/lib/classes]
   [junit4]   2> 1657160 INFO  (coreLoadExecutor-8760-thread-1) [    x:collection1] o.a.s.c.SolrConfig Using Lucene MatchVersion: 6.7.0
   [junit4]   2> 1657175 INFO  (coreLoadExecutor-8760-thread-1) [    x:collection1] o.a.s.s.IndexSchema [collection1] Schema name=test
   [junit4]   2> 1657189 INFO  (coreLoadExecutor-8760-thread-1) [    x:collection1] o.a.s.s.IndexSchema Loaded schema test/1.0 with uniqueid field id
   [junit4]   2> 1657189 INFO  (coreLoadExecutor-8760-thread-1) [    x:collection1] o.a.s.c.CoreContainer Creating SolrCore 'collection1' using configuration from instancedir /home/jenkins/workspace/Lucene-Solr-6.x-Linux/solr/core/src/test-files/solr/collection1, trusted=true
   [junit4]   2> 1657189 INFO  (coreLoadExecutor-8760-thread-1) [    x:collection1] o.a.s.m.r.SolrJmxReporter JMX monitoring for 'solr.core.collection1' (registry 'solr.core.collection1') enabled at server: com.sun.jmx.mbeanserver.JmxMBeanServer@1d4431c
   [junit4]   2> 1657189 INFO  (coreLoadExecutor-8760-thread-1) [    x:collection1] o.a.s.c.SolrCore solr.RecoveryStrategy.Builder
   [junit4]   2> 1657189 INFO  (coreLoadExecutor-8760-thread-1) [    x:collection1] o.a.s.c.SolrCore [[collection1] ] Opening new SolrCore at [/home/jenkins/workspace/Lucene-Solr-6.x-Linux/solr/core/src/test-files/solr/collection1], dataDir=[/home/jenkins/workspace/Lucene-Solr-6.x-Linux/solr/build/solr-core/test/J1/temp/solr.util.TestMaxTokenLenTokenizer_9B58DB541240BF31-001/init-core-data-001/]
   [junit4]   2> 1657190 INFO  (coreLoadExecutor-8760-thread-1) [    x:collection1] o.a.s.u.RandomMergePolicy RandomMergePolicy wrapping class org.apache.lucene.index.TieredMergePolicy: [TieredMergePolicy: maxMergeAtOnce=18, maxMergeAtOnceExplicit=17, maxMergedSegmentMB=65.8642578125, floorSegmentMB=1.7421875, forceMergeDeletesPctAllowed=2.861180901671627, segmentsPerTier=29.0, maxCFSSegmentSizeMB=8.796093022207999E12, noCFSRatio=0.0
   [junit4]   2> 1657215 INFO  (coreLoadExecutor-8760-thread-1) [    x:collection1] o.a.s.u.CommitTracker Hard AutoCommit: disabled
   [junit4]   2> 1657215 INFO  (coreLoadExecutor-8760-thread-1) [    x:collection1] o.a.s.u.CommitTracker Soft AutoCommit: disabled
   [junit4]   2> 1657216 INFO  (coreLoadExecutor-8760-thread-1) [    x:collection1] o.a.s.u.RandomMergePolicy RandomMergePolicy wrapping class org.apache.lucene.index.TieredMergePolicy: [TieredMergePolicy: maxMergeAtOnce=18, maxMergeAtOnceExplicit=20, maxMergedSegmentMB=87.98828125, floorSegmentMB=1.4619140625, forceMergeDeletesPctAllowed=8.140216102016458, segmentsPerTier=49.0, maxCFSSegmentSizeMB=8.796093022207999E12, noCFSRatio=1.0
   [junit4]   2> 1657216 INFO  (coreLoadExecutor-8760-thread-1) [    x:collection1] o.a.s.s.SolrIndexSearcher Opening [Searcher@c79ae4[collection1] main]
   [junit4]   2> 1657216 WARN  (coreLoadExecutor-8760-thread-1) [    x:collection1] o.a.s.r.ManagedResourceStorage Cannot write to config directory /home/jenkins/workspace/Lucene-Solr-6.x-Linux/solr/core/src/test-files/solr/collection1/conf; switching to use InMemory storage instead.
   [junit4]   2> 1657216 INFO  (coreLoadExecutor-8760-thread-1) [    x:collection1] o.a.s.h.ReplicationHandler Commits will be reserved for  10000
   [junit4]   2> 1657217 INFO  (searcherExecutor-8761-thread-1-processing-x:collection1) [    x:collection1] o.a.s.c.SolrCore [collection1] Registered new searcher Searcher@c79ae4[collection1] main{ExitableDirectoryReader(UninvertingDirectoryReader())}
   [junit4]   2> 1657217 INFO  (SUITE-TestMaxTokenLenTokenizer-seed#[9B58DB541240BF31]-worker) [    ] o.a.s.SolrTestCaseJ4 ####initCore end
   [junit4]   2> 1657219 INFO  (TEST-TestMaxTokenLenTokenizer.testSingleFieldDiffAnalyzers-seed#[9B58DB541240BF31]) [    ] o.a.s.SolrTestCaseJ4 ###Starting testSingleFieldDiffAnalyzers
   [junit4]   2> 1657219 INFO  (TEST-TestMaxTokenLenTokenizer.testSingleFieldDiffAnalyzers-seed#[9B58DB541240BF31]) [    ] o.a.s.u.DirectUpdateHandler2 [collection1] REMOVING ALL DOCUMENTS FROM INDEX
   [junit4]   2> 1657219 INFO  (TEST-TestMaxTokenLenTokenizer.testSingleFieldDiffAnalyzers-seed#[9B58DB541240BF31]) [    ] o.a.s.u.p.LogUpdateProcessorFactory [collection1]  webapp=null path=null params={_version_=-9223372036854775807&update.distrib=FROMLEADER&versions=true&wt=json&indent=true}{deleteByQuery=*:*} 0 0
   [junit4]   2> 1657220 INFO  (TEST-TestMaxTokenLenTokenizer.testSingleFieldDiffAnalyzers-seed#[9B58DB541240BF31]) [    ] o.a.s.u.DirectUpdateHandler2 start commit{,optimize=false,openSearcher=true,waitSearcher=true,expungeDeletes=false,softCommit=false,prepareCommit=false}
   [junit4]   2> 1657220 INFO  (TEST-TestMaxTokenLenTokenizer.testSingleFieldDiffAnalyzers-seed#[9B58DB541240BF31]) [    ] o.a.s.u.SolrIndexWriter Calling setCommitData with IW:org.apache.solr.update.SolrIndexWriter@17d738b
   [junit4]   2> 1657221 INFO  (TEST-TestMaxTokenLenTokenizer.testSingleFieldDiffAnalyzers-seed#[9B58DB541240BF31]) [    ] o.a.s.s.SolrIndexSearcher Opening [Searcher@114081d[collection1] main]
   [junit4]   2> 1657222 INFO  (TEST-TestMaxTokenLenTokenizer.testSingleFieldDiffAnalyzers-seed#[9B58DB541240BF31]) [    ] o.a.s.u.DirectUpdateHandler2 end_commit_flush
   [junit4]   2> 1657222 INFO  (searcherExecutor-8761-thread-1) [    ] o.a.s.c.SolrCore [collection1] Registered new searcher Searcher@114081d[collection1] main{ExitableDirectoryReader(UninvertingDirectoryReader(Uninverting(_0(6.7.0):c1)))}
   [junit4]   2> 1657222 INFO  (TEST-TestMaxTokenLenTokenizer.testSingleFieldDiffAnalyzers-seed#[9B58DB541240BF31]) [    ] o.a.s.u.p.LogUpdateProcessorFactory [collection1]  webapp=null path=null params={wt=json&indent=true}{add=[1],commit=} 0 2
   [junit4]   2> 1657222 INFO  (TEST-TestMaxTokenLenTokenizer.testSingleFieldDiffAnalyzers-seed#[9B58DB541240BF31]) [    ] o.a.s.u.DirectUpdateHandler2 start commit{,optimize=false,openSearcher=true,waitSearcher=true,expungeDeletes=false,softCommit=false,prepareCommit=false}
   [junit4]   2> 1657222 INFO  (TEST-TestMaxTokenLenTokenizer.testSingleFieldDiffAnalyzers-seed#[9B58DB541240BF31]) [    ] o.a.s.u.SolrIndexWriter Calling setCommitData with IW:org.apache.solr.update.SolrIndexWriter@17d738b
   [junit4]   2> 1657223 INFO  (TEST-TestMaxTokenLenTokenizer.testSingleFieldDiffAnalyzers-seed#[9B58DB541240BF31]) [    ] o.a.s.s.SolrIndexSearcher Opening [Searcher@a28127[collection1] main]
   [junit4]   2> 1657224 INFO  (TEST-TestMaxTokenLenTokenizer.testSingleFieldDiffAnalyzers-seed#[9B58DB541240BF31]) [    ] o.a.s.u.DirectUpdateHandler2 end_commit_flush
   [junit4]   2> 1657224 INFO  (searcherExecutor-8761-thread-1) [    ] o.a.s.c.SolrCore [collection1] Registered new searcher Searcher@a28127[collection1] main{ExitableDirectoryReader(UninvertingDirectoryReader(Uninverting(_0(6.7.0):c1) Uninverting(_1(6.7.0):c1)))}
   [junit4]   2> 1657224 INFO  (TEST-TestMaxTokenLenTokenizer.testSingleFieldDiffAnalyzers-seed#[9B58DB541240BF31]) [    ] o.a.s.u.p.LogUpdateProcessorFactory [collection1]  webapp=null path=null params={wt=json&indent=true}{add=[2],commit=} 0 1
   [junit4]   2> 1657224 INFO  (TEST-TestMaxTokenLenTokenizer.testSingleFieldDiffAnalyzers-seed#[9B58DB541240BF31]) [    ] o.a.s.u.DirectUpdateHandler2 start commit{,optimize=false,openSearcher=true,waitSearcher=true,expungeDeletes=false,softCommit=false,prepareCommit=false}
   [junit4]   2> 1657224 INFO  (TEST-TestMaxTokenLenTokenizer.testSingleFieldDiffAnalyzers-seed#[9B58DB541240BF31]) [    ] o.a.s.u.SolrIndexWriter Calling setCommitData with IW:org.apache.solr.update.SolrIndexWriter@17d738b
   [junit4]   2> 1657225 INFO  (TEST-TestMaxTokenLenTokenizer.testSingleFieldDiffAnalyzers-seed#[9B58DB541240BF31]) [    ] o.a.s.s.SolrIndexSearcher Opening [Searcher@1be9b33[collection1] main]
   [junit4]   2> 1657226 INFO  (TEST-TestMaxTokenLenTokenizer.testSingleFieldDiffAnalyzers-seed#[9B58DB541240BF31]) [    ] o.a.s.u.DirectUpdateHandler2 end_commit_flush
   [junit4]   2> 1657226 INFO  (searcherExecutor-8761-thread-1) [    ] o.a.s.c.SolrCore [collection1] Registered new searcher Searcher@1be9b33[collection1] main{ExitableDirectoryReader(UninvertingDirectoryReader(Uninverting(_0(6.7.0):c1) Uninverting(_1(6.7.0):c1) Uninverting(_2(6.7.0):c1)))}
   [junit4]   2> 1657226 INFO  (TEST-TestMaxTokenLenTokenizer.testSingleFieldDiffAnalyzers-seed#[9B58DB541240BF31]) [    ] o.a.s.u.p.LogUpdateProcessorFactory [collection1]  webapp=null path=null params={wt=json&indent=true}{add=[3],commit=} 0 1
   [junit4]   2> 1657226 INFO  (TEST-TestMaxTokenLenTokenizer.testSingleFieldDiffAnalyzers-seed#[9B58DB541240BF31]) [    ] o.a.s.u.DirectUpdateHandler2 start commit{,optimize=false,openSearcher=true,waitSearcher=true,expungeDeletes=false,softCommit=false,prepareCommit=false}
   [junit4]   2> 1657226 INFO  (TEST-TestMaxTokenLenTokenizer.testSingleFieldDiffAnalyzers-seed#[9B58DB541240BF31]) [    ] o.a.s.u.SolrIndexWriter Calling setCommitData with IW:org.apache.solr.update.SolrIndexWriter@17d738b
   [junit4]   2> 1657227 INFO  (TEST-TestMaxTokenLenTokenizer.testSingleFieldDiffAnalyzers-seed#[9B58DB541240BF31]) [    ] o.a.s.s.SolrIndexSearcher Opening [Searcher@15aacc0[collection1] main]
   [junit4]   2> 1657228 INFO  (TEST-TestMaxTokenLenTokenizer.testSingleFieldDiffAnalyzers-seed#[9B58DB541240BF31]) [    ] o.a.s.u.DirectUpdateHandler2 end_commit_flush
   [junit4]   2> 1657228 INFO  (searcherExecutor-8761-thread-1) [    ] o.a.s.c.SolrCore [collection1] Registered new searcher Searcher@15aacc0[collection1] main{ExitableDirectoryReader(UninvertingDirectoryReader(Uninverting(_0(6.7.0):c1) Uninverting(_1(6.7.0):c1) Uninverting(_2(6.7.0):c1) Uninverting(_3(6.7.0):c1)))}
   [junit4]   2> 1657228 INFO  (TEST-TestMaxTokenLenTokenizer.testSingleFieldDiffAnalyzers-seed#[9B58DB541240BF31]) [    ] o.a.s.u.p.LogUpdateProcessorFactory [collection1]  webapp=null path=null params={wt=json&indent=true}{add=[4],commit=} 0 1
   [junit4]   2> 1657228 INFO  (TEST-TestMaxTokenLenTokenizer.testSingleFieldDiffAnalyzers-seed#[9B58DB541240BF31]) [    ] o.a.s.u.DirectUpdateHandler2 start commit{,optimize=false,openSearcher=true,waitSearcher=true,expungeDeletes=false,softCommit=false,prepareCommit=false}
   [junit4]   2> 1657228 INFO  (TEST-TestMaxTokenLenTokenizer.testSingleFieldDiffAnalyzers-seed#[9B58DB541240BF31]) [    ] o.a.s.u.SolrIndexWriter Calling setCommitData with IW:org.apache.solr.update.SolrIndexWriter@17d738b
   [junit4]   2> 1657229 INFO  (TEST-TestMaxTokenLenTokenizer.testSingleFieldDiffAnalyzers-seed#[9B58DB541240BF31]) [    ] o.a.s.s.SolrIndexSearcher Opening [Searcher@16f61ee[collection1] main]
   [junit4]   2> 1657230 INFO  (TEST-TestMaxTokenLenTokenizer.testSingleFieldDiffAnalyzers-seed#[9B58DB541240BF31]) [    ] o.a.s.u.DirectUpdateHandler2 end_commit_flush
   [junit4]   2> 1657230 INFO  (searcherExecutor-8761-thread-1) [    ] o.a.s.c.SolrCore [collection1] Registered new searcher Searcher@16f61ee[collection1] main{ExitableDirectoryReader(UninvertingDirectoryReader(Uninverting(_0(6.7.0):c1) Uninverting(_1(6.7.0):c1) Uninverting(_2(6.7.0):c1) Uninverting(_3(6.7.0):c1) Uninverting(_4(6.7.0):c1)))}
   [junit4]   2> 1657230 INFO  (TEST-TestMaxTokenLenTokenizer.testSingleFieldDiffAnalyzers-seed#[9B58DB541240BF31]) [    ] o.a.s.u.p.LogUpdateProcessorFactory [collection1]  webapp=null path=null params={wt=json&indent=true}{add=[5],commit=} 0 2
   [junit4]   2> 1657231 INFO  (TEST-TestMaxTokenLenTokenizer.testSingleFieldDiffAnalyzers-seed#[9B58DB541240BF31]) [    ] o.a.s.u.DirectUpdateHandler2 start commit{,optimize=false,openSearcher=true,waitSearcher=true,expungeDeletes=false,softCommit=false,prepareCommit=false}
   [junit4]   2> 1657231 INFO  (TEST-TestMaxTokenLenTokenizer.testSingleFieldDiffAnalyzers-seed#[9B58DB541240BF31]) [    ] o.a.s.u.DirectUpdateHandler2 No uncommitted changes. Skipping IW.commit.
   [junit4]   2> 1657231 INFO  (TEST-TestMaxTokenLenTokenizer.testSingleFieldDiffAnalyzers-seed#[9B58DB541240BF31]) [    ] o.a.s.u.DirectUpdateHandler2 end_commit_flush
   [junit4]   2> 1657231 INFO  (TEST-TestMaxTokenLenTokenizer.testSingleFieldDiffAnalyzers-seed#[9B58DB541240BF31]) [    ] o.a.s.u.p.LogUpdateProcessorFactory [collection1]  webapp=null path=null params={}{commit=} 0 0
   [junit4]   2> 1657233 INFO  (TEST-TestMaxTokenLenTokenizer.testSingleFieldDiffAnalyzers-seed#[9B58DB541240BF31]) [    ] o.a.s.c.S.Request [collection1]  webapp=null path=null params={q=*:*&wt=xml} hits=5 status=0 QTime=0
   [junit4]   2> 1657234 INFO  (TEST-TestMaxTokenLenTokenizer.testSingleFieldDiffAnalyzers-seed#[9B58DB541240BF31]) [    ] o.a.s.c.S.Request [collection1]  webapp=null path=null params={q=letter:let&wt=xml} hits=1 status=0 QTime=0
   [junit4]   2> 1657234 INFO  (TEST-TestMaxTokenLenTokenizer.testSingleFieldDiffAnalyzers-seed#[9B58DB541240BF31]) [    ] o.a.s.c.S.Request [collection1]  webapp=null path=null params={q=letter:lett&wt=xml} hits=0 status=0 QTime=0
   [junit4]   2> 1657234 INFO  (TEST-TestMaxTokenLenTokenizer.testSingleFieldDiffAnalyzers-seed#[9B58DB541240BF31]) [    ] o.a.s.c.S.Request [collection1]  webapp=null path=null params={q=lowerCase:low&wt=xml} hits=1 status=0 QTime=0
   [junit4]   2> 1657234 INFO  (TEST-TestMaxTokenLenTokenizer.testSingleFieldDiffAnalyzers-seed#[9B58DB541240BF31]) [    ] o.a.s.c.S.Request [collection1]  webapp=null path=null params={q=lowerCase:l&wt=xml} hits=0 status=0 QTime=0
   [junit4]   2> 1657235 INFO  (TEST-TestMaxTokenLenTokenizer.testSingleFieldDiffAnalyzers-seed#[9B58DB541240BF31]) [    ] o.a.s.c.S.Request [collection1]  webapp=null path=null params={q=lowerCase:lo&wt=xml} hits=0 status=0 QTime=0
   [junit4]   2> 1657235 INFO  (TEST-TestMaxTokenLenTokenizer.testSingleFieldDiffAnalyzers-seed#[9B58DB541240BF31]) [    ] o.a.s.c.S.Request [collection1]  webapp=null path=null params={q=lowerCase:lower&wt=xml} hits=0 status=0 QTime=0
   [junit4]   2> 1657235 INFO  (TEST-TestMaxTokenLenTokenizer.testSingleFieldDiffAnalyzers-seed#[9B58DB541240BF31]) [    ] o.a.s.c.S.Request [collection1]  webapp=null path=null params={q=whiteSpace:whi&wt=xml} hits=1 status=0 QTime=0
   [junit4]   2> 1657235 INFO  (TEST-TestMaxTokenLenTokenizer.testSingleFieldDiffAnalyzers-seed#[9B58DB541240BF31]) [    ] o.a.s.c.S.Request [collection1]  webapp=null path=null params={q=whiteSpace:teS&wt=xml} hits=1 status=0 QTime=0
   [junit4]   2> 1657235 INFO  (TEST-TestMaxTokenLenTokenizer.testSingleFieldDiffAnalyzers-seed#[9B58DB541240BF31]) [    ] o.a.s.c.S.Request [collection1]  webapp=null path=null params={q=whiteSpace:in&wt=xml} hits=1 status=0 QTime=0
   [junit4]   2> 1657236 INFO  (TEST-TestMaxTokenLenTokenizer.testSingleFieldDiffAnalyzers-seed#[9B58DB541240BF31]) [    ] o.a.s.c.S.Request [collection1]  webapp=null path=null params={q=whiteSpace:white&wt=xml} hits=0 status=0 QTime=0
   [junit4]   2> 1657236 INFO  (TEST-TestMaxTokenLenTokenizer.testSingleFieldDiffAnalyzers-seed#[9B58DB541240BF31]) [    ] o.a.s.c.S.Request [collection1]  webapp=null path=null params={q=unicodeWhiteSpace:uni&wt=xml} hits=1 status=0 QTime=0
   [junit4]   2> 1657236 INFO  (TEST-TestMaxTokenLenTokenizer.testSingleFieldDiffAnalyzers-seed#[9B58DB541240BF31]) [    ] o.a.s.c.S.Request [collection1]  webapp=null path=null params={q=unicodeWhiteSpace:cod&wt=xml} hits=1 status=0 QTime=0
   [junit4]   2> 1657236 INFO  (TEST-TestMaxTokenLenTokenizer.testSingleFieldDiffAnalyzers-seed#[9B58DB541240BF31]) [    ] o.a.s.c.S.Request [collection1]  webapp=null path=null params={q=unicodeWhiteSpace:e&wt=xml} hits=1 status=0 QTime=0
   [junit4]   2> 1657236 INFO  (TEST-TestMaxTokenLenTokenizer.testSingleFieldDiffAnalyzers-seed#[9B58DB541240BF31]) [    ] o.a.s.c.S.Request [collection1]  webapp=null path=null params={q=unicodeWhiteSpace:unico&wt=xml} hits=0 status=0 QTime=0
   [junit4]   2> 1657237 INFO  (TEST-TestMaxTokenLenTokenizer.testSingleFieldDiffAnalyzers-seed#[9B58DB541240BF31]) [    ] o.a.s.c.S.Request [collection1]  webapp=null path=null params={q=keyword:keyword&wt=xml} hits=1 status=0 QTime=0
   [junit4]   2> 1657237 INFO  (TEST-TestMaxTokenLenTokenizer.testSingleFieldDiffAnalyzers-seed#[9B58DB541240BF31]) [    ] o.a.s.c.S.Request [collection1]  webapp=null path=null params={q=keyword:key&wt=xml} hits=0 status=0 QTime=0
   [junit4]   2> 1657237 INFO  (TEST-TestMaxTokenLenTokenizer.testSingleFieldDiffAnalyzers-seed#[9B58DB541240BF31]) [    ] o.a.s.SolrTestCaseJ4 ###Ending testSingleFieldDiffAnalyzers
   [junit4]   2> 1657240 INFO  (TEST-TestMaxTokenLenTokenizer.testSingleFieldSameAnalyzers-seed#[9B58DB541240BF31]) [    ] o.a.s.SolrTestCaseJ4 ###Starting testSingleFieldSameAnalyzers
   [junit4]   2> 1657240 INFO  (TEST-TestMaxTokenLenTokenizer.testSingleFieldSameAnalyzers-seed#[9B58DB541240BF31]) [    ] o.a.s.u.DirectUpdateHandler2 [collection1] REMOVING ALL DOCUMENTS FROM INDEX
   [junit4]   2> 1657241 INFO  (TEST-TestMaxTokenLenTokenizer.testSingleFieldSameAnalyzers-seed#[9B58DB541240BF31]) [    ] o.a.s.u.p.LogUpdateProcessorFactory [collection1]  webapp=null path=null params={_version_=-9223372036854775807&update.distrib=FROMLEADER&versions=true&wt=json&indent=true}{deleteByQuery=*:*} 0 0
   [junit4]   2> 1657241 INFO  (TEST-TestMaxTokenLenTokenizer.testSingleFieldSameAnalyzers-seed#[9B58DB541240BF31]) [    ] o.a.s.u.DirectUpdateHandler2 start commit{,optimize=false,openSearcher=true,waitSearcher=true,expungeDeletes=false,softCommit=false,prepareCommit=false}
   [junit4]   2> 1657241 INFO  (TEST-TestMaxTokenLenTokenizer.testSingleFieldSameAnalyzers-seed#[9B58DB541240BF31]) [    ] o.a.s.u.SolrIndexWriter Calling setCommitData with IW:org.apache.solr.update.SolrIndexWriter@17d738b
   [junit4]   2> 1657242 INFO  (TEST-TestMaxTokenLenTokenizer.testSingleFieldSameAnalyzers-seed#[9B58DB541240BF31]) [    ] o.a.s.s.SolrIndexSearcher Opening [Searcher@13b1d7e[collection1] main]
   [junit4]   2> 1657243 INFO  (TEST-TestMaxTokenLenTokenizer.testSingleFieldSameAnalyzers-seed#[9B58DB541240BF31]) [    ] o.a.s.u.DirectUpdateHandler2 end_commit_flush
   [junit4]   2> 1657243 INFO  (searcherExecutor-8761-thread-1) [    ] o.a.s.c.SolrCore [collection1] Registered new searcher Searcher@13b1d7e[collection1] main{ExitableDirectoryReader(UninvertingDirectoryReader(Uninverting(_5(6.7.0):c1)))}
   [junit4]   2> 1657244 INFO  (TEST-TestMaxTokenLenTokenizer.testSingleFieldSameAnalyzers-seed#[9B58DB541240BF31]) [    ] o.a.s.u.p.LogUpdateProcessorFactory [collection1]  webapp=null path=null params={wt=json&indent=true}{add=[1],commit=} 0 2
   [junit4]   2> 1657244 INFO  (TEST-TestMaxTokenLenTokenizer.testSingleFieldSameAnalyzers-seed#[9B58DB541240BF31]) [    ] o.a.s.u.DirectUpdateHandler2 start commit{,optimize=false,openSearcher=true,waitSearcher=true,expungeDeletes=false,softCommit=false,prepareCommit=false}
   [junit4]   2> 1657244 INFO  (TEST-TestMaxTokenLenTokenizer.testSingleFieldSameAnalyzers-seed#[9B58DB541240BF31]) [    ] o.a.s.u.SolrIndexWriter Calling setCommitData with IW:org.apache.solr.update.SolrIndexWriter@17d738b
   [junit4]   2> 1657245 INFO  (TEST-TestMaxTokenLenTokenizer.testSingleFieldSameAnalyzers-seed#[9B58DB541240BF31]) [    ] o.a.s.s.SolrIndexSearcher Opening [Searcher@cbc8d0[collection1] main]
   [junit4]   2> 1657246 INFO  (TEST-TestMaxTokenLenTokenizer.testSingleFieldSameAnalyzers-seed#[9B58DB541240BF31]) [    ] o.a.s.u.DirectUpdateHandler2 end_commit_flush
   [junit4]   2> 1657246 INFO  (searcherExecutor-8761-thread-1) [    ] o.a.s.c.SolrCore [collection1] Registered new searcher Searcher@cbc8d0[collection1] main{ExitableDirectoryReader(UninvertingDirectoryReader(Uninverting(_5(6.7.0):c1) Uninverting(_6(6.7.0):c1)))}
   [junit4]   2> 1657246 INFO  (TEST-TestMaxTokenLenTokenizer.testSingleFieldSameAnalyzers-seed#[9B58DB541240BF31]) [    ] o.a.s.u.p.LogUpdateProcessorFactory [collection1]  webapp=null path=null params={wt=json&indent=true}{add=[2],commit=} 0 2
   [junit4]   2> 1657246 INFO  (TEST-TestMaxTokenLenTokenizer.testSingleFieldSameAnalyzers-seed#[9B58DB541240BF31]) [    ] o.a.s.u.DirectUpdateHandler2 start commit{,optimize=false,openSearcher=true,waitSearcher=true,expungeDeletes=false,softCommit=false,prepareCommit=false}
   [junit4]   2> 1657246 INFO  (TEST-TestMaxTokenLenTokenizer.testSingleFieldSameAnalyzers-seed#[9B58DB541240BF31]) [    ] o.a.s.u.SolrIndexWriter Calling setCommitData with IW:org.apache.solr.update.SolrIndexWriter@17d738b
   [junit4]   2> 1657248 INFO  (TEST-TestMaxTokenLenTokenizer.testSingleFieldSameAnalyzers-seed#[9B58DB541240BF31]) [    ] o.a.s.s.SolrIndexSearcher Opening [Searcher@69cfd4[collection1] main]
   [junit4]   2> 1657248 INFO  (searcherExecutor-8761-thread-1) [    ] o.a.s.c.SolrCore [collection1] Registered new searcher Searcher@69cfd4[collection1] main{ExitableDirectoryReader(UninvertingDirectoryReader(Uninverting(_5(6.7.0):c1) Uninverting(_6(6.7.0):c1) Uninverting(_7(6.7.0):c1)))}
   [junit4]   2> 1657249 INFO  (TEST-TestMaxTokenLenTokenizer.testSingleFieldSameAnalyzers-seed#[9B58DB541240BF31]) [    ] o.a.s.u.DirectUpdateHandler2 end_commit_flush
   [junit4]   2> 1657249 INFO  (TEST-TestMaxTokenLenTokenizer.testSingleFieldSameAnalyzers-seed#[9B58DB541240BF31]) [    ] o.a.s.u.p.LogUpdateProcessorFactory [collection1]  webapp=null path=null params={wt=json&indent=true}{add=[3],commit=} 0 2
   [junit4]   2> 1657249 INFO  (TEST-TestMaxTokenLenTokenizer.testSingleFieldSameAnalyzers-seed#[9B58DB541240BF31]) [    ] o.a.s.u.DirectUpdateHandler2 start commit{,optimize=false,openSearcher=true,waitSearcher=true,expungeDeletes=false,softCommit=false,prepareCommit=false}
   [junit4]   2> 1657249 INFO  (TEST-TestMaxTokenLenTokenizer.testSingleFieldSameAnalyzers-seed#[9B58DB541240BF31]) [    ] o.a.s.u.SolrIndexWriter Calling setCommitData with IW:org.apache.solr.update.SolrIndexWriter@17d738b
   [junit4]   2> 1657250 INFO  (TEST-TestMaxTokenLenTokenizer.testSingleFieldSameAnalyzers-seed#[9B58DB541240BF31]) [    ] o.a.s.s.SolrIndexSearcher Opening [Searcher@fc6a7c[collection1] main]
   [junit4]   2> 1657251 INFO  (searcherExecutor-8761-thread-1) [    ] o.a.s.c.SolrCore [collection1] Registered new searcher Searcher@fc6a7c[collection1] main{ExitableDirectoryReader(UninvertingDirectoryReader(Uninverting(_5(6.7.0):c1) Uninverting(_6(6.7.0):c1) Uninverting(_7(6.7.0):c1) Uninverting(_8(6.7.0):c1)))}
   [junit4]   2> 1657251 INFO  (TEST-TestMaxTokenLenTokenizer.testSingleFieldSameAnalyzers-seed#[9B58DB541240BF31]) [    ] o.a.s.u.DirectUpdateHandler2 end_commit_flush
   [junit4]   2> 1657251 INFO  (TEST-TestMaxTokenLenTokenizer.testSingleFieldSameAnalyzers-seed#[9B58DB541240BF31]) [    ] o.a.s.u.p.LogUpdateProcessorFactory [collection1]  webapp=null path=null params={wt=json&indent=true}{add=[4],commit=} 0 2
   [junit4]   2> 1657252 INFO  (TEST-TestMaxTokenLenTokenizer.testSingleFieldSameAnalyzers-seed#[9B58DB541240BF31]) [    ] o.a.s.u.DirectUpdateHandler2 start commit{,optimize=false,openSearcher=true,waitSearcher=true,expungeDeletes=false,softCommit=false,prepareCommit=false}
   [junit4]   2> 1657252 INFO  (TEST-TestMaxTokenLenTokenizer.testSingleFieldSameAnalyzers-seed#[9B58DB541240BF31]) [    ] o.a.s.u.SolrIndexWriter Calling setCommitData with IW:org.apache.solr.update.SolrIndexWriter@17d738b
   [junit4]   2> 1657253 INFO  (TEST-TestMaxTokenLenTokenizer.testSingleFieldSameAnalyzers-seed#[9B58DB541240BF31]) [    ] o.a.s.s.SolrIndexSearcher Opening [Searcher@c6567e[collection1] main]
   [junit4]   2> 1657254 INFO  (searcherExecutor-8761-thread-1) [    ] o.a.s.c.SolrCore [collection1] Registered new searcher Searcher@c6567e[collection1] main{ExitableDirectoryReader(UninvertingDirectoryReader(Uninverting(_5(6.7.0):c1) Uninverting(_6(6.7.0):c1) Uninverting(_7(6.7.0):c1) Uninverting(_8(6.7.0):c1) Uninverting(_9(6.7.0):c1)))}
   [junit4]   2> 1657254 INFO  (TEST-TestMaxTokenLenTokenizer.testSingleFieldSameAnalyzers-seed#[9B58DB541240BF31]) [    ] o.a.s.u.DirectUpdateHandler2 end_commit_flush
   [junit4]   2> 1657254 INFO  (TEST-TestMaxTokenLenTokenizer.testSingleFieldSameAnalyzers-seed#[9B58DB541240BF31]) [    ] o.a.s.u.p.LogUpdateProcessorFactory [collection1]  webapp=null path=null params={wt=json&indent=true}{add=[5],commit=} 0 2
   [junit4]   2> 1657254 INFO  (TEST-TestMaxTokenLenTokenizer.testSingleFieldSameAnalyzers-seed#[9B58DB541240BF31]) [    ] o.a.s.u.DirectUpdateHandler2 start commit{,optimize=false,openSearcher=true,waitSearcher=true,expungeDeletes=false,softCommit=false,prepareCommit=false}
   [junit4]   2> 1657254 INFO  (TEST-TestMaxTokenLenTokenizer.testSingleFieldSameAnalyzers-seed#[9B58DB541240BF31]) [    ] o.a.s.u.DirectUpdateHandler2 No uncommitted changes. Skipping IW.commit.
   [junit4]   2> 1657254 INFO  (TEST-TestMaxTokenLenTokenizer.testSingleFieldSameAnalyzers-seed#[9B58DB541240BF31]) [    ] o.a.s.u.DirectUpdateHandler2 end_commit_flush
   [junit4]   2> 1657254 INFO  (TEST-TestMaxTokenLenTokenizer.testSingleFieldSameAnalyzers-seed#[9B58DB541240BF31]) [    ] o.a.s.u.p.LogUpdateProcessorFactory [collection1]  webapp=null path=null params={}{commit=} 0 0
   [junit4]   2> 1657255 INFO  (TEST-TestMaxTokenLenTokenizer.testSingleFieldSameAnalyzers-seed#[9B58DB541240BF31]) [    ] o.a.s.c.S.Request [collection1]  webapp=null path=null params={q=*:*&wt=xml} hits=5 status=0 QTime=0
   [junit4]   2> 1657258 INFO  (TEST-TestMaxTokenLenTokenizer.testSingleFieldSameAnalyzers-seed#[9B58DB541240BF31]) [    ] o.a.s.c.S.Request [collection1]  webapp=null path=null params={q=letter0:l&wt=xml} hits=0 status=0 QTime=0
   [junit4]   2> 1657259 INFO  (TEST-TestMaxTokenLenTokenizer.testSingleFieldSameAnalyzers-seed#[9B58DB541240BF31]) [    ] o.a.s.c.S.Request [collection1]  webapp=null path=null params={q=letter0:let&wt=xml} hits=1 status=0 QTime=0
   [junit4]   2> 1657259 INFO  (TEST-TestMaxTokenLenTokenizer.testSingleFieldSameAnalyzers-seed#[9B58DB541240BF31]) [    ] o.a.s.c.S.Request [collection1]  webapp=null path=null params={q=letter0:lett&wt=xml} hits=0 status=0 QTime=0
   [junit4]   2> 1657260 ERROR (TEST-TestMaxTokenLenTokenizer.testSingleFieldSameAnalyzers-seed#[9B58DB541240BF31]) [    ] o.a.s.SolrTestCaseJ4 REQUEST FAILED: xpath=//result[@numFound=1]
   [junit4]   2> 	xml response was: <?xml version="1.0" encoding="UTF-8"?>
   [junit4]   2> <response>
   [junit4]   2> <lst name="responseHeader"><int name="status">0</int><int name="QTime">0</int></lst><result name="response" numFound="0" start="0"></result>
   [junit4]   2> </response>
   [junit4]   2> 
   [junit4]   2> 	request was:q=letter0:lett&wt=xml
   [junit4]   2> 1657260 ERROR (TEST-TestMaxTokenLenTokenizer.testSingleFieldSameAnalyzers-seed#[9B58DB541240BF31]) [    ] o.a.s.SolrTestCaseJ4 REQUEST FAILED: q=letter0:lett&wt=xml:java.lang.RuntimeException: REQUEST FAILED: xpath=//result[@numFound=1]
   [junit4]   2> 	xml response was: <?xml version="1.0" encoding="UTF-8"?>
   [junit4]   2> <response>
   [junit4]   2> <lst name="responseHeader"><int name="status">0</int><int name="QTime">0</int></lst><result name="response" numFound="0" start="0"></result>
   [junit4]   2> </response>
   [junit4]   2> 
   [junit4]   2> 	request was:q=letter0:lett&wt=xml
   [junit4]   2> 	at org.apache.solr.SolrTestCaseJ4.assertQ(SolrTestCaseJ4.java:888)
   [junit4]   2> 	at org.apache.solr.util.TestMaxTokenLenTokenizer.testSingleFieldSameAnalyzers(TestMaxTokenLenTokenizer.java:104)
   [junit4]   2> 	at sun.reflect.NativeMethodAccessorImpl.invoke0(Native Method)
   [junit4]   2> 	at sun.reflect.NativeMethodAccessorImpl.invoke(NativeMethodAccessorImpl.java:62)
   [junit4]   2> 	at sun.reflect.DelegatingMethodAccessorImpl.invoke(DelegatingMethodAccessorImpl.java:43)
   [junit4]   2> 	at java.lang.reflect.Method.invoke(Method.java:498)
   [junit4]   2> 	at com.carrotsearch.randomizedtesting.RandomizedRunner.invoke(RandomizedRunner.java:1713)
   [junit4]   2> 	at com.carrotsearch.randomizedtesting.RandomizedRunner$8.evaluate(RandomizedRunner.java:907)
   [junit4]   2> 	at com.carrotsearch.randomizedtesting.RandomizedRunner$9.evaluate(RandomizedRunner.java:943)
   [junit4]   2> 	at com.carrotsearch.randomizedtesting.RandomizedRunner$10.evaluate(RandomizedRunner.java:957)
   [junit4]   2> 	at com.carrotsearch.randomizedtesting.rules.SystemPropertiesRestoreRule$1.evaluate(SystemPropertiesRestoreRule.java:57)
   [junit4]   2> 	at org.apache.lucene.util.TestRuleSetupTeardownChained$1.evaluate(TestRuleSetupTeardownChained.java:49)
   [junit4]   2> 	at org.apache.lucene.util.AbstractBeforeAfterRule$1.evaluate(AbstractBeforeAfterRule.java:45)
   [junit4]   2> 	at org.apache.lucene.util.TestRuleThreadAndTestName$1.evaluate(TestRuleThreadAndTestName.java:48)
   [junit4]   2> 	at org.apache.lucene.util.TestRuleIgnoreAfterMaxFailures$1.evaluate(TestRuleIgnoreAfterMaxFailures.java:64)
   [junit4]   2> 	at org.apache.lucene.util.TestRuleMarkFailure$1.evaluate(TestRuleMarkFailure.java:47)
   [junit4]   2> 	at com.carrotsearch.randomizedtesting.rules.StatementAdapter.evaluate(StatementAdapter.java:36)
   [junit4]   2> 	at com.carrotsearch.randomizedtesting.ThreadLeakControl$StatementRunner.run(ThreadLeakControl.java:368)
   [junit4]   2> 	at com.carrotsearch.randomizedtesting.ThreadLeakControl.forkTimeoutingTask(ThreadLeakControl.java:817)
   [junit4]   2> 	at com.carrotsearch.randomizedtesting.ThreadLeakControl$3.evaluate(ThreadLeakControl.java:468)
   [junit4]   2> 	at com.carrotsearch.randomizedtesting.RandomizedRunner.runSingleTest(RandomizedRunner.java:916)
   [junit4]   2> 	at com.carrotsearch.randomizedtesting.RandomizedRunner$5.evaluate(RandomizedRunner.java:802)
   [junit4]   2> 	at com.carrotsearch.randomizedtesting.RandomizedRunner$6.evaluate(RandomizedRunner.java:852)
   [junit4]   2> 	at com.carrotsearch.randomizedtesting.RandomizedRunner$7.evaluate(RandomizedRunner.java:863)
   [junit4]   2> 	at com.carrotsearch.randomizedtesting.rules.StatementAdapter.evaluate(StatementAdapter.java:36)
   [junit4]   2> 	at com.carrotsearch.randomizedtesting.rules.SystemPropertiesRestoreRule$1.evaluate(SystemPropertiesRestoreRule.java:57)
   [junit4]   2> 	at org.apache.lucene.util.AbstractBeforeAfterRule$1.evaluate(AbstractBeforeAfterRule.java:45)
   [junit4]   2> 	at com.carrotsearch.randomizedtesting.rules.StatementAdapter.evaluate(StatementAdapter.java:36)
   [junit4]   2> 	at org.apache.lucene.util.TestRuleStoreClassName$1.evaluate(TestRuleStoreClassName.java:41)
   [junit4]   2> 	at com.carrotsearch.randomizedtesting.rules.NoShadowingOrOverridesOnMethodsRule$1.evaluate(NoShadowingOrOverridesOnMethodsRule.java:40)
   [junit4]   2> 	at com.carrotsearch.randomizedtesting.rules.NoShadowingOrOverridesOnMethodsRule$1.evaluate(NoShadowingOrOverridesOnMethodsRule.java:40)
   [junit4]   2> 	at com.carrotsearch.randomizedtesting.rules.StatementAdapter.evaluate(StatementAdapter.java:36)
   [junit4]   2> 	at com.carrotsearch.randomizedtesting.rules.StatementAdapter.evaluate(StatementAdapter.java:36)
   [junit4]   2> 	at com.carrotsearch.randomizedtesting.rules.StatementAdapter.evaluate(StatementAdapter.java:36)
   [junit4]   2> 	at org.apache.lucene.util.TestRuleAssertionsRequired$1.evaluate(TestRuleAssertionsRequired.java:53)
   [junit4]   2> 	at org.apache.lucene.util.TestRuleMarkFailure$1.evaluate(TestRuleMarkFailure.java:47)
   [junit4]   2> 	at org.apache.lucene.util.TestRuleIgnoreAfterMaxFailures$1.evaluate(TestRuleIgnoreAfterMaxFailures.java:64)
   [junit4]   2> 	at org.apache.lucene.util.TestRuleIgnoreTestSuites$1.evaluate(TestRuleIgnoreTestSuites.java:54)
   [junit4]   2> 	at com.carrotsearch.randomizedtesting.rules.StatementAdapter.evaluate(StatementAdapter.java:36)
   [junit4]   2> 	at com.carrotsearch.randomizedtesting.ThreadLeakControl$StatementRunner.run(ThreadLeakControl.java:368)
   [junit4]   2> 	at java.lang.Thread.run(Thread.java:748)
   [junit4]   2> 
   [junit4]   2> 1657261 INFO  (TEST-TestMaxTokenLenTokenizer.testSingleFieldSameAnalyzers-seed#[9B58DB541240BF31]) [    ] o.a.s.SolrTestCaseJ4 ###Ending testSingleFieldSameAnalyzers
   [junit4]   2> NOTE: reproduce with: ant test  -Dtestcase=TestMaxTokenLenTokenizer -Dtests.method=testSingleFieldSameAnalyzers -Dtests.seed=9B58DB541240BF31 -Dtests.multiplier=3 -Dtests.slow=true -Dtests.locale=el-GR -Dtests.timezone=SystemV/YST9YDT -Dtests.asserts=true -Dtests.file.encoding=UTF-8
   [junit4] ERROR   0.03s J1 | TestMaxTokenLenTokenizer.testSingleFieldSameAnalyzers <<<
   [junit4]    > Throwable #1: java.lang.RuntimeException: Exception during query
   [junit4]    > 	at __randomizedtesting.SeedInfo.seed([9B58DB541240BF31:F18AE43B4AA36FFE]:0)
   [junit4]    > 	at org.apache.solr.SolrTestCaseJ4.assertQ(SolrTestCaseJ4.java:895)
   [junit4]    > 	at org.apache.solr.util.TestMaxTokenLenTokenizer.testSingleFieldSameAnalyzers(TestMaxTokenLenTokenizer.java:104)
   [junit4]    > 	at java.lang.Thread.run(Thread.java:748)
   [junit4]    > Caused by: java.lang.RuntimeException: REQUEST FAILED: xpath=//result[@numFound=1]
   [junit4]    > 	xml response was: <?xml version="1.0" encoding="UTF-8"?>
   [junit4]    > <response>
   [junit4]    > <lst name="responseHeader"><int name="status">0</int><int name="QTime">0</int></lst><result name="response" numFound="0" start="0"></result>
   [junit4]    > </response>
   [junit4]    > 	request was:q=letter0:lett&wt=xml
   [junit4]    > 	at org.apache.solr.SolrTestCaseJ4.assertQ(SolrTestCaseJ4.java:888)
   [junit4]    > 	... 40 more
   [junit4]   2> 1657263 INFO  (SUITE-TestMaxTokenLenTokenizer-seed#[9B58DB541240BF31]-worker) [    ] o.a.s.SolrTestCaseJ4 ###deleteCore
   [junit4]   2> 1657263 INFO  (SUITE-TestMaxTokenLenTokenizer-seed#[9B58DB541240BF31]-worker) [    ] o.a.s.c.CoreContainer Shutting down CoreContainer instance=11578076
   [junit4]   2> 1657263 INFO  (SUITE-TestMaxTokenLenTokenizer-seed#[9B58DB541240BF31]-worker) [    ] o.a.s.m.SolrMetricManager Closing metric reporters for: solr.node
   [junit4]   2> 1657264 INFO  (SUITE-TestMaxTokenLenTokenizer-seed#[9B58DB541240BF31]-worker) [    ] o.a.s.m.SolrMetricManager Closing metric reporters for: solr.jvm
   [junit4]   2> 1657265 INFO  (SUITE-TestMaxTokenLenTokenizer-seed#[9B58DB541240BF31]-worker) [    ] o.a.s.m.SolrMetricManager Closing metric reporters for: solr.jetty
   [junit4]   2> 1657265 INFO  (SUITE-TestMaxTokenLenTokenizer-seed#[9B58DB541240BF31]-worker) [    ] o.a.s.c.TransientSolrCoreCacheDefault Allocating transient cache for 2147483647 transient cores
   [junit4]   2> 1657265 INFO  (coreCloseExecutor-8765-thread-1) [    x:collection1] o.a.s.c.SolrCore [collection1]  CLOSING SolrCore org.apache.solr.core.SolrCore@dd7346
   [junit4]   2> 1657266 INFO  (coreCloseExecutor-8765-thread-1) [    x:collection1] o.a.s.m.SolrMetricManager Closing metric reporters for: solr.core.collection1
   [junit4]   2> NOTE: leaving temporary files on disk at: /home/jenkins/workspace/Lucene-Solr-6.x-Linux/solr/build/solr-core/test/J1/temp/solr.util.TestMaxTokenLenTokenizer_9B58DB541240BF31-001
   [junit4]   2> NOTE: test params are: codec=Asserting(Lucene62): {lowerCase0=PostingsFormat(name=Memory doPackFST= true), whiteSpace=PostingsFormat(name=Asserting), letter=PostingsFormat(name=LuceneFixedGap), lowerCase=PostingsFormat(name=Asserting), unicodeWhiteSpace=PostingsFormat(name=LuceneFixedGap), letter0=PostingsFormat(name=Memory doPackFST= false), unicodeWhiteSpace0=PostingsFormat(name=Memory doPackFST= false), keyword0=PostingsFormat(name=Memory doPackFST= true), id=PostingsFormat(name=Memory doPackFST= true), keyword=PostingsFormat(name=Asserting), whiteSpace0=PostingsFormat(name=Memory doPackFST= true)}, docValues:{}, maxPointsInLeafNode=2021, maxMBSortInHeap=5.107252650112141, sim=RandomSimilarity(queryNorm=false,coord=no): {}, locale=el-GR, timezone=SystemV/YST9YDT
   [junit4]   2> NOTE: Linux 4.10.0-21-generic i386/Oracle Corporation 1.8.0_131 (32-bit)/cpus=8,threads=1,free=120838408,total=416034816
   [junit4]   2> NOTE: All tests run in this JVM: [TestStressVersions, OverseerModifyCollectionTest, TestGraphMLResponseWriter, DistributedMLTComponentTest, TestFieldCache, TestRestManager, DistribCursorPagingTest, TestFiltering, TestTrie, TestCloudSchemaless, TestExactStatsCache, TestJsonRequest, TestPivotHelperCode, JvmMetricsTest, TestMinMaxOnMultiValuedField, ConvertedLegacyTest, SliceStateTest, TestCloudDeleteByQuery, ShardRoutingCustomTest, CollectionsAPIDistributedZkTest, WordBreakSolrSpellCheckerTest, TestLMDirichletSimilarityFactory, LoggingHandlerTest, RemoteQueryErrorTest, DistributedQueryComponentOptimizationTest, TestQueryUtils, TestDefaultStatsCache, HdfsDirectoryTest, TestElisionMultitermQuery, PeerSyncWithIndexFingerprintCachingTest, TermsComponentTest, SaslZkACLProviderTest, HdfsRecoveryZkTest, IndexBasedSpellCheckerTest, SmileWriterTest, HdfsWriteToMultipleCollectionsTest, TestSimpleQParserPlugin, TestCloudPivotFacet, TestConfigOverlay, TestClassicSimilarityFactory, OutOfBoxZkACLAndCredentialsProvidersTest, TestConfigSetsAPIExclusivity, TestConfigReload, HighlighterMaxOffsetTest, DistributedFacetPivotSmallTest, TestDynamicLoading, URLClassifyProcessorTest, TestNestedDocsSort, TestQueryTypes, ConnectionManagerTest, DistributedIntervalFacetingTest, SharedFSAutoReplicaFailoverUtilsTest, ZkControllerTest, TestConfigSets, TestLRUCache, ClassificationUpdateProcessorFactoryTest, TestSweetSpotSimilarityFactory, TermVectorComponentTest, BJQParserTest, DirectSolrConnectionTest, TestWordDelimiterFilterFactory, TestDistributedStatsComponentCardinality, TestRawResponseWriter, SuggesterFSTTest, SystemInfoHandlerTest, TestRandomRequestDistribution, ZkSolrClientTest, MoreLikeThisHandlerTest, SpatialHeatmapFacetsTest, BitVectorTest, TestFieldCollectionResource, TestSurroundQueryParser, CdcrBootstrapTest, DocumentBuilderTest, ShardRoutingTest, TestFileDictionaryLookup, BasicAuthStandaloneTest, TestSolrIndexConfig, SoftAutoCommitTest, RestartWhileUpdatingTest, TemplateUpdateProcessorTest, FileUtilsTest, TestFuzzyAnalyzedSuggestions, TestXmlQParserPlugin, DistributedDebugComponentTest, DocValuesTest, RAMDirectoryFactoryTest, TestStressUserVersions, TestCollectionAPIs, HdfsCollectionsAPIDistributedZkTest, AssignTest, TestManagedSchema, ZkCLITest, MetricsHandlerTest, AnalyticsQueryTest, SpatialFilterTest, CleanupOldIndexTest, TestPKIAuthenticationPlugin, ForceLeaderTest, TestCharFilters, UpdateRequestProcessorFactoryTest, TestExclusionRuleCollectionAccess, TestBM25SimilarityFactory, TestUpdate, AnalysisErrorHandlingTest, SolrGraphiteReporterTest, LeaderFailoverAfterPartitionTest, TestDeleteCollectionOnDownNodes, MultiTermTest, TestSolrDynamicMBean, TestDistributedGrouping, SampleTest, TestCursorMarkWithoutUniqueKey, SortByFunctionTest, ConnectionReuseTest, TestDelegationWithHadoopAuth, SchemaVersionSpecificBehaviorTest, CoreSorterTest, TestJoin, SpellCheckComponentTest, QueryElevationComponentTest, BadIndexSchemaTest, TestBadConfig, TestIndexSearcher, SolrIndexSplitterTest, SimplePostToolTest, SignatureUpdateProcessorFactoryTest, SpellCheckCollatorTest, TestFoldingMultitermQuery, TestStressLucene, TestPseudoReturnFields, DistanceFunctionTest, CacheHeaderTest, TestWriterPerf, FileBasedSpellCheckerTest, PathHierarchyTokenizerFactoryTest, FastVectorHighlighterTest, SolrPluginUtilsTest, TestJmxIntegration, JSONWriterTest, JsonLoaderTest, TestPartialUpdateDeduplication, CSVRequestHandlerTest, SearchHandlerTest, SOLR749Test, TestQuerySenderListener, AlternateDirectoryTest, CopyFieldTest, ResponseLogComponentTest, SolrIndexConfigTest, BadComponentTest, TestMergePolicyConfig, TestDocSet, TestSearchPerf, TestPostingsSolrHighlighter, NotRequiredUniqueKeyTest, TestLuceneMatchVersion, TimeZoneUtilsTest, ResourceLoaderTest, ScriptEngineTest, PluginInfoTest, DateMathParserTest, PreAnalyzedFieldTest, TestSystemIdResolver, PrimUtilsTest, TestSuggestSpellingConverter, SpellingQueryConverterTest, DOMUtilTest, ClusterStateTest, TestUtils, TestDocumentBuilder, ZkNodePropsTest, UUIDFieldTest, CircularListTest, TestRTGBase, CursorPagingTest, TestDistributedMissingSort, TestSimpleTrackingShardHandler, TestTolerantSearch, TestEmbeddedSolrServerConstructors, AsyncCallRequestStatusResponseTest, CloudExitableDirectoryReaderTest, CollectionStateFormat2Test, CollectionTooManyReplicasTest, DeleteInactiveReplicaTest, DeleteLastCustomShardedReplicaTest, DeleteReplicaTest, DocValuesNotIndexedTest, LeaderFailureAfterFreshStartTest, MoveReplicaTest, MultiThreadedOCPTest, SolrXmlInZkTest, TestCloudInspectUtil, TestCloudPseudoReturnFields, TestClusterProperties, TestCollectionAPI, TestCryptoKeys, TestDistribDocBasedVersion, TestDownShardTolerantSearch, TestLeaderElectionZkExpiry, TestLocalFSCloudBackupRestore, TestMiniSolrCloudClusterSSL, TestReplicaProperties, TestRequestForwarding, TestSSLRandomization, TestSegmentSorting, TestTolerantUpdateProcessorCloud, TestTolerantUpdateProcessorRandomCloud, HdfsBasicDistributedZkTest, HdfsNNFailoverTest, HdfsThreadLeakTest, StressHdfsTest, ZkStateWriterTest, BlobRepositoryCloudTest, TestInitParams, TestReloadAndDeleteDocs, TestShardHandlerFactory, TestSimpleTextCodec, TestSolrXml, TestSolrCloudSnapshots, V2ApiIntegrationTest, CoreAdminRequestStatusTest, InfoHandlerTest, PropertiesRequestHandlerTest, SecurityConfHandlerTest, SegmentsInfoRequestHandlerTest, StatsReloadRaceTest, DistributedFacetExistsSmallTest, DistributedSuggestComponentTest, TestExpandComponent, TestTrackingShardHandlerFactory, TestChildDocTransformer, TestBulkSchemaAPI, TestManagedSynonymGraphFilterFactory, DateRangeFieldTest, ManagedSchemaRoundRobinCloudTest, TestSchemaManager, TestUseDocValuesAsStored, TestComplexPhraseLeadingWildcard, TestFieldSortValues, TestFilteredDocIdSet, TestHashQParserPlugin, TestMaxScoreQueryParser, TestOverriddenPrefixQueryForCustomFieldType, TestQueryWrapperFilter, TestRandomCollapseQParserPlugin, TestScoreJoinQPScore, SimpleMLTQParserTest, TestNonDefinedSimilarityFactory, TestPerFieldSimilarityClassic, PKIAuthenticationIntegrationTest, TestAuthorizationFramework, TestLegacyFieldCache, AddBlockUpdateTest, DataDrivenBlockJoinTest, TestDocBasedVersionConstraints, TestHdfsUpdateLog, UpdateLogTest, VersionInfoTest, AddSchemaFieldsUpdateProcessorFactoryTest, AtomicUpdateProcessorFactoryTest, ClassificationUpdateProcessorTest, CloneFieldUpdateProcessorFactoryTest, ParsingFieldUpdateProcessorsTest, PreAnalyzedUpdateProcessorTest, UUIDUpdateProcessorFallbackTest, TestMaxTokenLenTokenizer]
   [junit4] Completed [706/715 (1!)] on J1 in 0.22s, 2 tests, 1 error <<< FAILURES!

[...truncated 39516 lines...]

Mime
View raw message