lucene-dev mailing list archives

Site index · List index
Message view « Date » · « Thread »
Top « Date » · « Thread »
From Policeman Jenkins Server <jenk...@thetaphi.de>
Subject [JENKINS] Lucene-Solr-6.x-Linux (32bit/jdk1.8.0_131) - Build # 3639 - Still Unstable!
Date Thu, 01 Jun 2017 17:37:48 GMT
Build: https://jenkins.thetaphi.de/job/Lucene-Solr-6.x-Linux/3639/
Java: 32bit/jdk1.8.0_131 -client -XX:+UseParallelGC

1 tests failed.
FAILED:  org.apache.solr.util.TestMaxTokenLenTokenizer.testSingleFieldSameAnalyzers

Error Message:
Exception during query

Stack Trace:
java.lang.RuntimeException: Exception during query
	at __randomizedtesting.SeedInfo.seed([E7BB2663521ADA0C:8D69190C0AF90AC3]:0)
	at org.apache.solr.SolrTestCaseJ4.assertQ(SolrTestCaseJ4.java:895)
	at org.apache.solr.util.TestMaxTokenLenTokenizer.testSingleFieldSameAnalyzers(TestMaxTokenLenTokenizer.java:104)
	at sun.reflect.NativeMethodAccessorImpl.invoke0(Native Method)
	at sun.reflect.NativeMethodAccessorImpl.invoke(NativeMethodAccessorImpl.java:62)
	at sun.reflect.DelegatingMethodAccessorImpl.invoke(DelegatingMethodAccessorImpl.java:43)
	at java.lang.reflect.Method.invoke(Method.java:498)
	at com.carrotsearch.randomizedtesting.RandomizedRunner.invoke(RandomizedRunner.java:1713)
	at com.carrotsearch.randomizedtesting.RandomizedRunner$8.evaluate(RandomizedRunner.java:907)
	at com.carrotsearch.randomizedtesting.RandomizedRunner$9.evaluate(RandomizedRunner.java:943)
	at com.carrotsearch.randomizedtesting.RandomizedRunner$10.evaluate(RandomizedRunner.java:957)
	at com.carrotsearch.randomizedtesting.rules.SystemPropertiesRestoreRule$1.evaluate(SystemPropertiesRestoreRule.java:57)
	at org.apache.lucene.util.TestRuleSetupTeardownChained$1.evaluate(TestRuleSetupTeardownChained.java:49)
	at org.apache.lucene.util.AbstractBeforeAfterRule$1.evaluate(AbstractBeforeAfterRule.java:45)
	at org.apache.lucene.util.TestRuleThreadAndTestName$1.evaluate(TestRuleThreadAndTestName.java:48)
	at org.apache.lucene.util.TestRuleIgnoreAfterMaxFailures$1.evaluate(TestRuleIgnoreAfterMaxFailures.java:64)
	at org.apache.lucene.util.TestRuleMarkFailure$1.evaluate(TestRuleMarkFailure.java:47)
	at com.carrotsearch.randomizedtesting.rules.StatementAdapter.evaluate(StatementAdapter.java:36)
	at com.carrotsearch.randomizedtesting.ThreadLeakControl$StatementRunner.run(ThreadLeakControl.java:368)
	at com.carrotsearch.randomizedtesting.ThreadLeakControl.forkTimeoutingTask(ThreadLeakControl.java:817)
	at com.carrotsearch.randomizedtesting.ThreadLeakControl$3.evaluate(ThreadLeakControl.java:468)
	at com.carrotsearch.randomizedtesting.RandomizedRunner.runSingleTest(RandomizedRunner.java:916)
	at com.carrotsearch.randomizedtesting.RandomizedRunner$5.evaluate(RandomizedRunner.java:802)
	at com.carrotsearch.randomizedtesting.RandomizedRunner$6.evaluate(RandomizedRunner.java:852)
	at com.carrotsearch.randomizedtesting.RandomizedRunner$7.evaluate(RandomizedRunner.java:863)
	at com.carrotsearch.randomizedtesting.rules.StatementAdapter.evaluate(StatementAdapter.java:36)
	at com.carrotsearch.randomizedtesting.rules.SystemPropertiesRestoreRule$1.evaluate(SystemPropertiesRestoreRule.java:57)
	at org.apache.lucene.util.AbstractBeforeAfterRule$1.evaluate(AbstractBeforeAfterRule.java:45)
	at com.carrotsearch.randomizedtesting.rules.StatementAdapter.evaluate(StatementAdapter.java:36)
	at org.apache.lucene.util.TestRuleStoreClassName$1.evaluate(TestRuleStoreClassName.java:41)
	at com.carrotsearch.randomizedtesting.rules.NoShadowingOrOverridesOnMethodsRule$1.evaluate(NoShadowingOrOverridesOnMethodsRule.java:40)
	at com.carrotsearch.randomizedtesting.rules.NoShadowingOrOverridesOnMethodsRule$1.evaluate(NoShadowingOrOverridesOnMethodsRule.java:40)
	at com.carrotsearch.randomizedtesting.rules.StatementAdapter.evaluate(StatementAdapter.java:36)
	at com.carrotsearch.randomizedtesting.rules.StatementAdapter.evaluate(StatementAdapter.java:36)
	at com.carrotsearch.randomizedtesting.rules.StatementAdapter.evaluate(StatementAdapter.java:36)
	at org.apache.lucene.util.TestRuleAssertionsRequired$1.evaluate(TestRuleAssertionsRequired.java:53)
	at org.apache.lucene.util.TestRuleMarkFailure$1.evaluate(TestRuleMarkFailure.java:47)
	at org.apache.lucene.util.TestRuleIgnoreAfterMaxFailures$1.evaluate(TestRuleIgnoreAfterMaxFailures.java:64)
	at org.apache.lucene.util.TestRuleIgnoreTestSuites$1.evaluate(TestRuleIgnoreTestSuites.java:54)
	at com.carrotsearch.randomizedtesting.rules.StatementAdapter.evaluate(StatementAdapter.java:36)
	at com.carrotsearch.randomizedtesting.ThreadLeakControl$StatementRunner.run(ThreadLeakControl.java:368)
	at java.lang.Thread.run(Thread.java:748)
Caused by: java.lang.RuntimeException: REQUEST FAILED: xpath=//result[@numFound=1]
	xml response was: <?xml version="1.0" encoding="UTF-8"?>
<response>
<lst name="responseHeader"><int name="status">0</int><int name="QTime">4</int></lst><result
name="response" numFound="0" start="0"></result>
</response>

	request was:q=letter0:lett&wt=xml
	at org.apache.solr.SolrTestCaseJ4.assertQ(SolrTestCaseJ4.java:888)
	... 40 more




Build Log:
[...truncated 11023 lines...]
   [junit4] Suite: org.apache.solr.util.TestMaxTokenLenTokenizer
   [junit4]   2> Creating dataDir: /home/jenkins/workspace/Lucene-Solr-6.x-Linux/solr/build/solr-core/test/J1/temp/solr.util.TestMaxTokenLenTokenizer_E7BB2663521ADA0C-001/init-core-data-001
   [junit4]   2> 16940 WARN  (SUITE-TestMaxTokenLenTokenizer-seed#[E7BB2663521ADA0C]-worker)
[    ] o.a.s.SolrTestCaseJ4 startTrackingSearchers: numOpens=16 numCloses=16
   [junit4]   2> 16940 INFO  (SUITE-TestMaxTokenLenTokenizer-seed#[E7BB2663521ADA0C]-worker)
[    ] o.a.s.SolrTestCaseJ4 Using PointFields
   [junit4]   2> 16941 INFO  (SUITE-TestMaxTokenLenTokenizer-seed#[E7BB2663521ADA0C]-worker)
[    ] o.a.s.SolrTestCaseJ4 Randomized ssl (true) and clientAuth (true) via: @org.apache.solr.util.RandomizeSSL(reason=,
ssl=NaN, value=NaN, clientAuth=NaN)
   [junit4]   2> 16944 INFO  (SUITE-TestMaxTokenLenTokenizer-seed#[E7BB2663521ADA0C]-worker)
[    ] o.a.s.SolrTestCaseJ4 ####initCore
   [junit4]   2> 16944 INFO  (SUITE-TestMaxTokenLenTokenizer-seed#[E7BB2663521ADA0C]-worker)
[    ] o.a.s.c.SolrResourceLoader [null] Added 2 libs to classloader, from paths: [/home/jenkins/workspace/Lucene-Solr-6.x-Linux/solr/core/src/test-files/solr/collection1/lib,
/home/jenkins/workspace/Lucene-Solr-6.x-Linux/solr/core/src/test-files/solr/collection1/lib/classes]
   [junit4]   2> 17026 WARN  (SUITE-TestMaxTokenLenTokenizer-seed#[E7BB2663521ADA0C]-worker)
[    ] o.a.s.c.Config Beginning with Solr 5.5, <mergePolicy> is deprecated, use <mergePolicyFactory>
instead.
   [junit4]   2> 17028 INFO  (SUITE-TestMaxTokenLenTokenizer-seed#[E7BB2663521ADA0C]-worker)
[    ] o.a.s.c.SolrConfig Using Lucene MatchVersion: 6.7.0
   [junit4]   2> 17052 INFO  (SUITE-TestMaxTokenLenTokenizer-seed#[E7BB2663521ADA0C]-worker)
[    ] o.a.s.s.IndexSchema [null] Schema name=test
   [junit4]   2> 17065 INFO  (SUITE-TestMaxTokenLenTokenizer-seed#[E7BB2663521ADA0C]-worker)
[    ] o.a.s.s.IndexSchema Loaded schema test/1.0 with uniqueid field id
   [junit4]   2> 17068 INFO  (SUITE-TestMaxTokenLenTokenizer-seed#[E7BB2663521ADA0C]-worker)
[    ] o.a.s.u.UpdateShardHandler Creating UpdateShardHandler HTTP client with params: socketTimeout=30000&connTimeout=30000&retry=true
   [junit4]   2> 17091 WARN  (SUITE-TestMaxTokenLenTokenizer-seed#[E7BB2663521ADA0C]-worker)
[    ] o.a.s.m.r.SolrJmxReporter No JMX server found. Not exposing Solr metrics via JMX.
   [junit4]   2> 17091 WARN  (SUITE-TestMaxTokenLenTokenizer-seed#[E7BB2663521ADA0C]-worker)
[    ] o.a.s.m.r.SolrJmxReporter No JMX server found. Not exposing Solr metrics via JMX.
   [junit4]   2> 17091 WARN  (SUITE-TestMaxTokenLenTokenizer-seed#[E7BB2663521ADA0C]-worker)
[    ] o.a.s.m.r.SolrJmxReporter No JMX server found. Not exposing Solr metrics via JMX.
   [junit4]   2> 17091 INFO  (coreLoadExecutor-214-thread-1) [    x:collection1] o.a.s.c.SolrResourceLoader
[null] Added 2 libs to classloader, from paths: [/home/jenkins/workspace/Lucene-Solr-6.x-Linux/solr/core/src/test-files/solr/collection1/lib,
/home/jenkins/workspace/Lucene-Solr-6.x-Linux/solr/core/src/test-files/solr/collection1/lib/classes]
   [junit4]   2> 17117 WARN  (coreLoadExecutor-214-thread-1) [    x:collection1] o.a.s.c.Config
Beginning with Solr 5.5, <mergePolicy> is deprecated, use <mergePolicyFactory>
instead.
   [junit4]   2> 17118 INFO  (coreLoadExecutor-214-thread-1) [    x:collection1] o.a.s.c.SolrConfig
Using Lucene MatchVersion: 6.7.0
   [junit4]   2> 17139 INFO  (coreLoadExecutor-214-thread-1) [    x:collection1] o.a.s.s.IndexSchema
[collection1] Schema name=test
   [junit4]   2> 17290 INFO  (coreLoadExecutor-214-thread-1) [    x:collection1] o.a.s.s.IndexSchema
Loaded schema test/1.0 with uniqueid field id
   [junit4]   2> 17290 INFO  (coreLoadExecutor-214-thread-1) [    x:collection1] o.a.s.c.CoreContainer
Creating SolrCore 'collection1' using configuration from instancedir /home/jenkins/workspace/Lucene-Solr-6.x-Linux/solr/core/src/test-files/solr/collection1,
trusted=true
   [junit4]   2> 17291 WARN  (coreLoadExecutor-214-thread-1) [    x:collection1] o.a.s.m.r.SolrJmxReporter
No JMX server found. Not exposing Solr metrics via JMX.
   [junit4]   2> 17291 INFO  (coreLoadExecutor-214-thread-1) [    x:collection1] o.a.s.c.SolrCore
solr.RecoveryStrategy.Builder
   [junit4]   2> 17291 INFO  (coreLoadExecutor-214-thread-1) [    x:collection1] o.a.s.c.SolrCore
[[collection1] ] Opening new SolrCore at [/home/jenkins/workspace/Lucene-Solr-6.x-Linux/solr/core/src/test-files/solr/collection1],
dataDir=[/home/jenkins/workspace/Lucene-Solr-6.x-Linux/solr/build/solr-core/test/J1/temp/solr.util.TestMaxTokenLenTokenizer_E7BB2663521ADA0C-001/init-core-data-001/]
   [junit4]   2> 17292 INFO  (coreLoadExecutor-214-thread-1) [    x:collection1] o.a.s.u.RandomMergePolicy
RandomMergePolicy wrapping class org.apache.lucene.index.TieredMergePolicy: [TieredMergePolicy:
maxMergeAtOnce=16, maxMergeAtOnceExplicit=41, maxMergedSegmentMB=96.611328125, floorSegmentMB=1.833984375,
forceMergeDeletesPctAllowed=6.765148747958845, segmentsPerTier=38.0, maxCFSSegmentSizeMB=8.796093022207999E12,
noCFSRatio=0.45282320006757315
   [junit4]   2> 17457 INFO  (coreLoadExecutor-214-thread-1) [    x:collection1] o.a.s.u.CommitTracker
Hard AutoCommit: disabled
   [junit4]   2> 17457 INFO  (coreLoadExecutor-214-thread-1) [    x:collection1] o.a.s.u.CommitTracker
Soft AutoCommit: disabled
   [junit4]   2> 17458 INFO  (coreLoadExecutor-214-thread-1) [    x:collection1] o.a.s.u.RandomMergePolicy
RandomMergePolicy wrapping class org.apache.lucene.index.TieredMergePolicy: [TieredMergePolicy:
maxMergeAtOnce=37, maxMergeAtOnceExplicit=30, maxMergedSegmentMB=97.224609375, floorSegmentMB=0.39453125,
forceMergeDeletesPctAllowed=7.675307373276822, segmentsPerTier=14.0, maxCFSSegmentSizeMB=8.796093022207999E12,
noCFSRatio=0.0
   [junit4]   2> 17458 INFO  (coreLoadExecutor-214-thread-1) [    x:collection1] o.a.s.s.SolrIndexSearcher
Opening [Searcher@b053c9[collection1] main]
   [junit4]   2> 17459 WARN  (coreLoadExecutor-214-thread-1) [    x:collection1] o.a.s.r.ManagedResourceStorage
Cannot write to config directory /home/jenkins/workspace/Lucene-Solr-6.x-Linux/solr/core/src/test-files/solr/collection1/conf;
switching to use InMemory storage instead.
   [junit4]   2> 17464 INFO  (coreLoadExecutor-214-thread-1) [    x:collection1] o.a.s.h.ReplicationHandler
Commits will be reserved for  10000
   [junit4]   2> 17465 INFO  (searcherExecutor-215-thread-1-processing-x:collection1) [
   x:collection1] o.a.s.c.SolrCore [collection1] Registered new searcher Searcher@b053c9[collection1]
main{ExitableDirectoryReader(UninvertingDirectoryReader())}
   [junit4]   2> 17466 INFO  (SUITE-TestMaxTokenLenTokenizer-seed#[E7BB2663521ADA0C]-worker)
[    ] o.a.s.SolrTestCaseJ4 ####initCore end
   [junit4]   2> 17468 INFO  (TEST-TestMaxTokenLenTokenizer.testSingleFieldSameAnalyzers-seed#[E7BB2663521ADA0C])
[    ] o.a.s.SolrTestCaseJ4 ###Starting testSingleFieldSameAnalyzers
   [junit4]   2> 17473 INFO  (TEST-TestMaxTokenLenTokenizer.testSingleFieldSameAnalyzers-seed#[E7BB2663521ADA0C])
[    ] o.a.s.u.DirectUpdateHandler2 [collection1] REMOVING ALL DOCUMENTS FROM INDEX
   [junit4]   2> 17474 INFO  (TEST-TestMaxTokenLenTokenizer.testSingleFieldSameAnalyzers-seed#[E7BB2663521ADA0C])
[    ] o.a.s.u.p.LogUpdateProcessorFactory [collection1]  webapp=null path=null params={_version_=-9223372036854775807&update.distrib=FROMLEADER&versions=true&wt=json&indent=true}{deleteByQuery=*:*}
0 3
   [junit4]   2> 17478 INFO  (TEST-TestMaxTokenLenTokenizer.testSingleFieldSameAnalyzers-seed#[E7BB2663521ADA0C])
[    ] o.a.s.u.DirectUpdateHandler2 start commit{,optimize=false,openSearcher=true,waitSearcher=true,expungeDeletes=false,softCommit=false,prepareCommit=false}
   [junit4]   2> 17479 INFO  (TEST-TestMaxTokenLenTokenizer.testSingleFieldSameAnalyzers-seed#[E7BB2663521ADA0C])
[    ] o.a.s.u.SolrIndexWriter Calling setCommitData with IW:org.apache.solr.update.SolrIndexWriter@19252c8
   [junit4]   2> 17487 INFO  (TEST-TestMaxTokenLenTokenizer.testSingleFieldSameAnalyzers-seed#[E7BB2663521ADA0C])
[    ] o.a.s.s.SolrIndexSearcher Opening [Searcher@10990eb[collection1] main]
   [junit4]   2> 17487 INFO  (TEST-TestMaxTokenLenTokenizer.testSingleFieldSameAnalyzers-seed#[E7BB2663521ADA0C])
[    ] o.a.s.u.DirectUpdateHandler2 end_commit_flush
   [junit4]   2> 17487 INFO  (searcherExecutor-215-thread-1) [    ] o.a.s.c.SolrCore [collection1]
Registered new searcher Searcher@10990eb[collection1] main{ExitableDirectoryReader(UninvertingDirectoryReader(Uninverting(_0(6.7.0):c1)))}
   [junit4]   2> 17487 INFO  (TEST-TestMaxTokenLenTokenizer.testSingleFieldSameAnalyzers-seed#[E7BB2663521ADA0C])
[    ] o.a.s.u.p.LogUpdateProcessorFactory [collection1]  webapp=null path=null params={wt=json&indent=true}{add=[1],commit=}
0 13
   [junit4]   2> 17488 INFO  (TEST-TestMaxTokenLenTokenizer.testSingleFieldSameAnalyzers-seed#[E7BB2663521ADA0C])
[    ] o.a.s.u.DirectUpdateHandler2 start commit{,optimize=false,openSearcher=true,waitSearcher=true,expungeDeletes=false,softCommit=false,prepareCommit=false}
   [junit4]   2> 17488 INFO  (TEST-TestMaxTokenLenTokenizer.testSingleFieldSameAnalyzers-seed#[E7BB2663521ADA0C])
[    ] o.a.s.u.SolrIndexWriter Calling setCommitData with IW:org.apache.solr.update.SolrIndexWriter@19252c8
   [junit4]   2> 17490 INFO  (TEST-TestMaxTokenLenTokenizer.testSingleFieldSameAnalyzers-seed#[E7BB2663521ADA0C])
[    ] o.a.s.s.SolrIndexSearcher Opening [Searcher@442812[collection1] main]
   [junit4]   2> 17490 INFO  (TEST-TestMaxTokenLenTokenizer.testSingleFieldSameAnalyzers-seed#[E7BB2663521ADA0C])
[    ] o.a.s.u.DirectUpdateHandler2 end_commit_flush
   [junit4]   2> 17490 INFO  (searcherExecutor-215-thread-1) [    ] o.a.s.c.SolrCore [collection1]
Registered new searcher Searcher@442812[collection1] main{ExitableDirectoryReader(UninvertingDirectoryReader(Uninverting(_0(6.7.0):c1)
Uninverting(_1(6.7.0):c1)))}
   [junit4]   2> 17490 INFO  (TEST-TestMaxTokenLenTokenizer.testSingleFieldSameAnalyzers-seed#[E7BB2663521ADA0C])
[    ] o.a.s.u.p.LogUpdateProcessorFactory [collection1]  webapp=null path=null params={wt=json&indent=true}{add=[2],commit=}
0 2
   [junit4]   2> 17491 INFO  (TEST-TestMaxTokenLenTokenizer.testSingleFieldSameAnalyzers-seed#[E7BB2663521ADA0C])
[    ] o.a.s.u.DirectUpdateHandler2 start commit{,optimize=false,openSearcher=true,waitSearcher=true,expungeDeletes=false,softCommit=false,prepareCommit=false}
   [junit4]   2> 17491 INFO  (TEST-TestMaxTokenLenTokenizer.testSingleFieldSameAnalyzers-seed#[E7BB2663521ADA0C])
[    ] o.a.s.u.SolrIndexWriter Calling setCommitData with IW:org.apache.solr.update.SolrIndexWriter@19252c8
   [junit4]   2> 17493 INFO  (TEST-TestMaxTokenLenTokenizer.testSingleFieldSameAnalyzers-seed#[E7BB2663521ADA0C])
[    ] o.a.s.s.SolrIndexSearcher Opening [Searcher@2773ea[collection1] main]
   [junit4]   2> 17493 INFO  (TEST-TestMaxTokenLenTokenizer.testSingleFieldSameAnalyzers-seed#[E7BB2663521ADA0C])
[    ] o.a.s.u.DirectUpdateHandler2 end_commit_flush
   [junit4]   2> 17493 INFO  (searcherExecutor-215-thread-1) [    ] o.a.s.c.SolrCore [collection1]
Registered new searcher Searcher@2773ea[collection1] main{ExitableDirectoryReader(UninvertingDirectoryReader(Uninverting(_0(6.7.0):c1)
Uninverting(_1(6.7.0):c1) Uninverting(_2(6.7.0):c1)))}
   [junit4]   2> 17493 INFO  (TEST-TestMaxTokenLenTokenizer.testSingleFieldSameAnalyzers-seed#[E7BB2663521ADA0C])
[    ] o.a.s.u.p.LogUpdateProcessorFactory [collection1]  webapp=null path=null params={wt=json&indent=true}{add=[3],commit=}
0 2
   [junit4]   2> 17493 INFO  (TEST-TestMaxTokenLenTokenizer.testSingleFieldSameAnalyzers-seed#[E7BB2663521ADA0C])
[    ] o.a.s.u.DirectUpdateHandler2 start commit{,optimize=false,openSearcher=true,waitSearcher=true,expungeDeletes=false,softCommit=false,prepareCommit=false}
   [junit4]   2> 17493 INFO  (TEST-TestMaxTokenLenTokenizer.testSingleFieldSameAnalyzers-seed#[E7BB2663521ADA0C])
[    ] o.a.s.u.SolrIndexWriter Calling setCommitData with IW:org.apache.solr.update.SolrIndexWriter@19252c8
   [junit4]   2> 17495 INFO  (TEST-TestMaxTokenLenTokenizer.testSingleFieldSameAnalyzers-seed#[E7BB2663521ADA0C])
[    ] o.a.s.s.SolrIndexSearcher Opening [Searcher@1f4d989[collection1] main]
   [junit4]   2> 17495 INFO  (TEST-TestMaxTokenLenTokenizer.testSingleFieldSameAnalyzers-seed#[E7BB2663521ADA0C])
[    ] o.a.s.u.DirectUpdateHandler2 end_commit_flush
   [junit4]   2> 17495 INFO  (searcherExecutor-215-thread-1) [    ] o.a.s.c.SolrCore [collection1]
Registered new searcher Searcher@1f4d989[collection1] main{ExitableDirectoryReader(UninvertingDirectoryReader(Uninverting(_0(6.7.0):c1)
Uninverting(_1(6.7.0):c1) Uninverting(_2(6.7.0):c1) Uninverting(_3(6.7.0):c1)))}
   [junit4]   2> 17495 INFO  (TEST-TestMaxTokenLenTokenizer.testSingleFieldSameAnalyzers-seed#[E7BB2663521ADA0C])
[    ] o.a.s.u.p.LogUpdateProcessorFactory [collection1]  webapp=null path=null params={wt=json&indent=true}{add=[4],commit=}
0 2
   [junit4]   2> 17496 INFO  (TEST-TestMaxTokenLenTokenizer.testSingleFieldSameAnalyzers-seed#[E7BB2663521ADA0C])
[    ] o.a.s.u.DirectUpdateHandler2 start commit{,optimize=false,openSearcher=true,waitSearcher=true,expungeDeletes=false,softCommit=false,prepareCommit=false}
   [junit4]   2> 17496 INFO  (TEST-TestMaxTokenLenTokenizer.testSingleFieldSameAnalyzers-seed#[E7BB2663521ADA0C])
[    ] o.a.s.u.SolrIndexWriter Calling setCommitData with IW:org.apache.solr.update.SolrIndexWriter@19252c8
   [junit4]   2> 17497 INFO  (TEST-TestMaxTokenLenTokenizer.testSingleFieldSameAnalyzers-seed#[E7BB2663521ADA0C])
[    ] o.a.s.s.SolrIndexSearcher Opening [Searcher@1d748ac[collection1] main]
   [junit4]   2> 17498 INFO  (TEST-TestMaxTokenLenTokenizer.testSingleFieldSameAnalyzers-seed#[E7BB2663521ADA0C])
[    ] o.a.s.u.DirectUpdateHandler2 end_commit_flush
   [junit4]   2> 17498 INFO  (searcherExecutor-215-thread-1) [    ] o.a.s.c.SolrCore [collection1]
Registered new searcher Searcher@1d748ac[collection1] main{ExitableDirectoryReader(UninvertingDirectoryReader(Uninverting(_0(6.7.0):c1)
Uninverting(_1(6.7.0):c1) Uninverting(_2(6.7.0):c1) Uninverting(_3(6.7.0):c1) Uninverting(_4(6.7.0):c1)))}
   [junit4]   2> 17498 INFO  (TEST-TestMaxTokenLenTokenizer.testSingleFieldSameAnalyzers-seed#[E7BB2663521ADA0C])
[    ] o.a.s.u.p.LogUpdateProcessorFactory [collection1]  webapp=null path=null params={wt=json&indent=true}{add=[5],commit=}
0 2
   [junit4]   2> 17498 INFO  (TEST-TestMaxTokenLenTokenizer.testSingleFieldSameAnalyzers-seed#[E7BB2663521ADA0C])
[    ] o.a.s.u.DirectUpdateHandler2 start commit{,optimize=false,openSearcher=true,waitSearcher=true,expungeDeletes=false,softCommit=false,prepareCommit=false}
   [junit4]   2> 17498 INFO  (TEST-TestMaxTokenLenTokenizer.testSingleFieldSameAnalyzers-seed#[E7BB2663521ADA0C])
[    ] o.a.s.u.DirectUpdateHandler2 No uncommitted changes. Skipping IW.commit.
   [junit4]   2> 17498 INFO  (TEST-TestMaxTokenLenTokenizer.testSingleFieldSameAnalyzers-seed#[E7BB2663521ADA0C])
[    ] o.a.s.u.DirectUpdateHandler2 end_commit_flush
   [junit4]   2> 17498 INFO  (TEST-TestMaxTokenLenTokenizer.testSingleFieldSameAnalyzers-seed#[E7BB2663521ADA0C])
[    ] o.a.s.u.p.LogUpdateProcessorFactory [collection1]  webapp=null path=null params={}{commit=}
0 0
   [junit4]   2> 17501 INFO  (TEST-TestMaxTokenLenTokenizer.testSingleFieldSameAnalyzers-seed#[E7BB2663521ADA0C])
[    ] o.a.s.c.S.Request [collection1]  webapp=null path=null params={q=*:*&wt=xml} hits=5
status=0 QTime=0
   [junit4]   2> 17503 INFO  (TEST-TestMaxTokenLenTokenizer.testSingleFieldSameAnalyzers-seed#[E7BB2663521ADA0C])
[    ] o.a.s.c.S.Request [collection1]  webapp=null path=null params={q=letter0:l&wt=xml}
hits=0 status=0 QTime=0
   [junit4]   2> 17503 INFO  (TEST-TestMaxTokenLenTokenizer.testSingleFieldSameAnalyzers-seed#[E7BB2663521ADA0C])
[    ] o.a.s.c.S.Request [collection1]  webapp=null path=null params={q=letter0:let&wt=xml}
hits=1 status=0 QTime=0
   [junit4]   2> 17508 INFO  (TEST-TestMaxTokenLenTokenizer.testSingleFieldSameAnalyzers-seed#[E7BB2663521ADA0C])
[    ] o.a.s.c.S.Request [collection1]  webapp=null path=null params={q=letter0:lett&wt=xml}
hits=0 status=0 QTime=4
   [junit4]   2> 17508 ERROR (TEST-TestMaxTokenLenTokenizer.testSingleFieldSameAnalyzers-seed#[E7BB2663521ADA0C])
[    ] o.a.s.SolrTestCaseJ4 REQUEST FAILED: xpath=//result[@numFound=1]
   [junit4]   2> 	xml response was: <?xml version="1.0" encoding="UTF-8"?>
   [junit4]   2> <response>
   [junit4]   2> <lst name="responseHeader"><int name="status">0</int><int
name="QTime">4</int></lst><result name="response" numFound="0" start="0"></result>
   [junit4]   2> </response>
   [junit4]   2> 
   [junit4]   2> 	request was:q=letter0:lett&wt=xml
   [junit4]   2> 17509 ERROR (TEST-TestMaxTokenLenTokenizer.testSingleFieldSameAnalyzers-seed#[E7BB2663521ADA0C])
[    ] o.a.s.SolrTestCaseJ4 REQUEST FAILED: q=letter0:lett&wt=xml:java.lang.RuntimeException:
REQUEST FAILED: xpath=//result[@numFound=1]
   [junit4]   2> 	xml response was: <?xml version="1.0" encoding="UTF-8"?>
   [junit4]   2> <response>
   [junit4]   2> <lst name="responseHeader"><int name="status">0</int><int
name="QTime">4</int></lst><result name="response" numFound="0" start="0"></result>
   [junit4]   2> </response>
   [junit4]   2> 
   [junit4]   2> 	request was:q=letter0:lett&wt=xml
   [junit4]   2> 	at org.apache.solr.SolrTestCaseJ4.assertQ(SolrTestCaseJ4.java:888)
   [junit4]   2> 	at org.apache.solr.util.TestMaxTokenLenTokenizer.testSingleFieldSameAnalyzers(TestMaxTokenLenTokenizer.java:104)
   [junit4]   2> 	at sun.reflect.NativeMethodAccessorImpl.invoke0(Native Method)
   [junit4]   2> 	at sun.reflect.NativeMethodAccessorImpl.invoke(NativeMethodAccessorImpl.java:62)
   [junit4]   2> 	at sun.reflect.DelegatingMethodAccessorImpl.invoke(DelegatingMethodAccessorImpl.java:43)
   [junit4]   2> 	at java.lang.reflect.Method.invoke(Method.java:498)
   [junit4]   2> 	at com.carrotsearch.randomizedtesting.RandomizedRunner.invoke(RandomizedRunner.java:1713)
   [junit4]   2> 	at com.carrotsearch.randomizedtesting.RandomizedRunner$8.evaluate(RandomizedRunner.java:907)
   [junit4]   2> 	at com.carrotsearch.randomizedtesting.RandomizedRunner$9.evaluate(RandomizedRunner.java:943)
   [junit4]   2> 	at com.carrotsearch.randomizedtesting.RandomizedRunner$10.evaluate(RandomizedRunner.java:957)
   [junit4]   2> 	at com.carrotsearch.randomizedtesting.rules.SystemPropertiesRestoreRule$1.evaluate(SystemPropertiesRestoreRule.java:57)
   [junit4]   2> 	at org.apache.lucene.util.TestRuleSetupTeardownChained$1.evaluate(TestRuleSetupTeardownChained.java:49)
   [junit4]   2> 	at org.apache.lucene.util.AbstractBeforeAfterRule$1.evaluate(AbstractBeforeAfterRule.java:45)
   [junit4]   2> 	at org.apache.lucene.util.TestRuleThreadAndTestName$1.evaluate(TestRuleThreadAndTestName.java:48)
   [junit4]   2> 	at org.apache.lucene.util.TestRuleIgnoreAfterMaxFailures$1.evaluate(TestRuleIgnoreAfterMaxFailures.java:64)
   [junit4]   2> 	at org.apache.lucene.util.TestRuleMarkFailure$1.evaluate(TestRuleMarkFailure.java:47)
   [junit4]   2> 	at com.carrotsearch.randomizedtesting.rules.StatementAdapter.evaluate(StatementAdapter.java:36)
   [junit4]   2> 	at com.carrotsearch.randomizedtesting.ThreadLeakControl$StatementRunner.run(ThreadLeakControl.java:368)
   [junit4]   2> 	at com.carrotsearch.randomizedtesting.ThreadLeakControl.forkTimeoutingTask(ThreadLeakControl.java:817)
   [junit4]   2> 	at com.carrotsearch.randomizedtesting.ThreadLeakControl$3.evaluate(ThreadLeakControl.java:468)
   [junit4]   2> 	at com.carrotsearch.randomizedtesting.RandomizedRunner.runSingleTest(RandomizedRunner.java:916)
   [junit4]   2> 	at com.carrotsearch.randomizedtesting.RandomizedRunner$5.evaluate(RandomizedRunner.java:802)
   [junit4]   2> 	at com.carrotsearch.randomizedtesting.RandomizedRunner$6.evaluate(RandomizedRunner.java:852)
   [junit4]   2> 	at com.carrotsearch.randomizedtesting.RandomizedRunner$7.evaluate(RandomizedRunner.java:863)
   [junit4]   2> 	at com.carrotsearch.randomizedtesting.rules.StatementAdapter.evaluate(StatementAdapter.java:36)
   [junit4]   2> 	at com.carrotsearch.randomizedtesting.rules.SystemPropertiesRestoreRule$1.evaluate(SystemPropertiesRestoreRule.java:57)
   [junit4]   2> 	at org.apache.lucene.util.AbstractBeforeAfterRule$1.evaluate(AbstractBeforeAfterRule.java:45)
   [junit4]   2> 	at com.carrotsearch.randomizedtesting.rules.StatementAdapter.evaluate(StatementAdapter.java:36)
   [junit4]   2> 	at org.apache.lucene.util.TestRuleStoreClassName$1.evaluate(TestRuleStoreClassName.java:41)
   [junit4]   2> 	at com.carrotsearch.randomizedtesting.rules.NoShadowingOrOverridesOnMethodsRule$1.evaluate(NoShadowingOrOverridesOnMethodsRule.java:40)
   [junit4]   2> 	at com.carrotsearch.randomizedtesting.rules.NoShadowingOrOverridesOnMethodsRule$1.evaluate(NoShadowingOrOverridesOnMethodsRule.java:40)
   [junit4]   2> 	at com.carrotsearch.randomizedtesting.rules.StatementAdapter.evaluate(StatementAdapter.java:36)
   [junit4]   2> 	at com.carrotsearch.randomizedtesting.rules.StatementAdapter.evaluate(StatementAdapter.java:36)
   [junit4]   2> 	at com.carrotsearch.randomizedtesting.rules.StatementAdapter.evaluate(StatementAdapter.java:36)
   [junit4]   2> 	at org.apache.lucene.util.TestRuleAssertionsRequired$1.evaluate(TestRuleAssertionsRequired.java:53)
   [junit4]   2> 	at org.apache.lucene.util.TestRuleMarkFailure$1.evaluate(TestRuleMarkFailure.java:47)
   [junit4]   2> 	at org.apache.lucene.util.TestRuleIgnoreAfterMaxFailures$1.evaluate(TestRuleIgnoreAfterMaxFailures.java:64)
   [junit4]   2> 	at org.apache.lucene.util.TestRuleIgnoreTestSuites$1.evaluate(TestRuleIgnoreTestSuites.java:54)
   [junit4]   2> 	at com.carrotsearch.randomizedtesting.rules.StatementAdapter.evaluate(StatementAdapter.java:36)
   [junit4]   2> 	at com.carrotsearch.randomizedtesting.ThreadLeakControl$StatementRunner.run(ThreadLeakControl.java:368)
   [junit4]   2> 	at java.lang.Thread.run(Thread.java:748)
   [junit4]   2> 
   [junit4]   2> 17509 INFO  (TEST-TestMaxTokenLenTokenizer.testSingleFieldSameAnalyzers-seed#[E7BB2663521ADA0C])
[    ] o.a.s.SolrTestCaseJ4 ###Ending testSingleFieldSameAnalyzers
   [junit4]   2> NOTE: reproduce with: ant test  -Dtestcase=TestMaxTokenLenTokenizer -Dtests.method=testSingleFieldSameAnalyzers
-Dtests.seed=E7BB2663521ADA0C -Dtests.multiplier=3 -Dtests.slow=true -Dtests.locale=sv -Dtests.timezone=Australia/Adelaide
-Dtests.asserts=true -Dtests.file.encoding=UTF-8
   [junit4] ERROR   0.04s J1 | TestMaxTokenLenTokenizer.testSingleFieldSameAnalyzers <<<
   [junit4]    > Throwable #1: java.lang.RuntimeException: Exception during query
   [junit4]    > 	at __randomizedtesting.SeedInfo.seed([E7BB2663521ADA0C:8D69190C0AF90AC3]:0)
   [junit4]    > 	at org.apache.solr.SolrTestCaseJ4.assertQ(SolrTestCaseJ4.java:895)
   [junit4]    > 	at org.apache.solr.util.TestMaxTokenLenTokenizer.testSingleFieldSameAnalyzers(TestMaxTokenLenTokenizer.java:104)
   [junit4]    > 	at java.lang.Thread.run(Thread.java:748)
   [junit4]    > Caused by: java.lang.RuntimeException: REQUEST FAILED: xpath=//result[@numFound=1]
   [junit4]    > 	xml response was: <?xml version="1.0" encoding="UTF-8"?>
   [junit4]    > <response>
   [junit4]    > <lst name="responseHeader"><int name="status">0</int><int
name="QTime">4</int></lst><result name="response" numFound="0" start="0"></result>
   [junit4]    > </response>
   [junit4]    > 	request was:q=letter0:lett&wt=xml
   [junit4]    > 	at org.apache.solr.SolrTestCaseJ4.assertQ(SolrTestCaseJ4.java:888)
   [junit4]    > 	... 40 more
   [junit4]   2> 17511 INFO  (TEST-TestMaxTokenLenTokenizer.testSingleFieldDiffAnalyzers-seed#[E7BB2663521ADA0C])
[    ] o.a.s.SolrTestCaseJ4 ###Starting testSingleFieldDiffAnalyzers
   [junit4]   2> 17511 INFO  (TEST-TestMaxTokenLenTokenizer.testSingleFieldDiffAnalyzers-seed#[E7BB2663521ADA0C])
[    ] o.a.s.u.DirectUpdateHandler2 [collection1] REMOVING ALL DOCUMENTS FROM INDEX
   [junit4]   2> 17511 INFO  (TEST-TestMaxTokenLenTokenizer.testSingleFieldDiffAnalyzers-seed#[E7BB2663521ADA0C])
[    ] o.a.s.u.p.LogUpdateProcessorFactory [collection1]  webapp=null path=null params={_version_=-9223372036854775807&update.distrib=FROMLEADER&versions=true&wt=json&indent=true}{deleteByQuery=*:*}
0 0
   [junit4]   2> 17512 INFO  (TEST-TestMaxTokenLenTokenizer.testSingleFieldDiffAnalyzers-seed#[E7BB2663521ADA0C])
[    ] o.a.s.u.DirectUpdateHandler2 start commit{,optimize=false,openSearcher=true,waitSearcher=true,expungeDeletes=false,softCommit=false,prepareCommit=false}
   [junit4]   2> 17512 INFO  (TEST-TestMaxTokenLenTokenizer.testSingleFieldDiffAnalyzers-seed#[E7BB2663521ADA0C])
[    ] o.a.s.u.SolrIndexWriter Calling setCommitData with IW:org.apache.solr.update.SolrIndexWriter@19252c8
   [junit4]   2> 17514 INFO  (TEST-TestMaxTokenLenTokenizer.testSingleFieldDiffAnalyzers-seed#[E7BB2663521ADA0C])
[    ] o.a.s.s.SolrIndexSearcher Opening [Searcher@1e6a74a[collection1] main]
   [junit4]   2> 17514 INFO  (TEST-TestMaxTokenLenTokenizer.testSingleFieldDiffAnalyzers-seed#[E7BB2663521ADA0C])
[    ] o.a.s.u.DirectUpdateHandler2 end_commit_flush
   [junit4]   2> 17514 INFO  (searcherExecutor-215-thread-1) [    ] o.a.s.c.SolrCore [collection1]
Registered new searcher Searcher@1e6a74a[collection1] main{ExitableDirectoryReader(UninvertingDirectoryReader(Uninverting(_5(6.7.0):c1)))}
   [junit4]   2> 17514 INFO  (TEST-TestMaxTokenLenTokenizer.testSingleFieldDiffAnalyzers-seed#[E7BB2663521ADA0C])
[    ] o.a.s.u.p.LogUpdateProcessorFactory [collection1]  webapp=null path=null params={wt=json&indent=true}{add=[1],commit=}
0 2
   [junit4]   2> 17515 INFO  (TEST-TestMaxTokenLenTokenizer.testSingleFieldDiffAnalyzers-seed#[E7BB2663521ADA0C])
[    ] o.a.s.u.DirectUpdateHandler2 start commit{,optimize=false,openSearcher=true,waitSearcher=true,expungeDeletes=false,softCommit=false,prepareCommit=false}
   [junit4]   2> 17515 INFO  (TEST-TestMaxTokenLenTokenizer.testSingleFieldDiffAnalyzers-seed#[E7BB2663521ADA0C])
[    ] o.a.s.u.SolrIndexWriter Calling setCommitData with IW:org.apache.solr.update.SolrIndexWriter@19252c8
   [junit4]   2> 17516 INFO  (TEST-TestMaxTokenLenTokenizer.testSingleFieldDiffAnalyzers-seed#[E7BB2663521ADA0C])
[    ] o.a.s.s.SolrIndexSearcher Opening [Searcher@949f05[collection1] main]
   [junit4]   2> 17517 INFO  (TEST-TestMaxTokenLenTokenizer.testSingleFieldDiffAnalyzers-seed#[E7BB2663521ADA0C])
[    ] o.a.s.u.DirectUpdateHandler2 end_commit_flush
   [junit4]   2> 17517 INFO  (searcherExecutor-215-thread-1) [    ] o.a.s.c.SolrCore [collection1]
Registered new searcher Searcher@949f05[collection1] main{ExitableDirectoryReader(UninvertingDirectoryReader(Uninverting(_5(6.7.0):c1)
Uninverting(_6(6.7.0):c1)))}
   [junit4]   2> 17517 INFO  (TEST-TestMaxTokenLenTokenizer.testSingleFieldDiffAnalyzers-seed#[E7BB2663521ADA0C])
[    ] o.a.s.u.p.LogUpdateProcessorFactory [collection1]  webapp=null path=null params={wt=json&indent=true}{add=[2],commit=}
0 2
   [junit4]   2> 17517 INFO  (TEST-TestMaxTokenLenTokenizer.testSingleFieldDiffAnalyzers-seed#[E7BB2663521ADA0C])
[    ] o.a.s.u.DirectUpdateHandler2 start commit{,optimize=false,openSearcher=true,waitSearcher=true,expungeDeletes=false,softCommit=false,prepareCommit=false}
   [junit4]   2> 17517 INFO  (TEST-TestMaxTokenLenTokenizer.testSingleFieldDiffAnalyzers-seed#[E7BB2663521ADA0C])
[    ] o.a.s.u.SolrIndexWriter Calling setCommitData with IW:org.apache.solr.update.SolrIndexWriter@19252c8
   [junit4]   2> 17519 INFO  (TEST-TestMaxTokenLenTokenizer.testSingleFieldDiffAnalyzers-seed#[E7BB2663521ADA0C])
[    ] o.a.s.s.SolrIndexSearcher Opening [Searcher@99d840[collection1] main]
   [junit4]   2> 17520 INFO  (TEST-TestMaxTokenLenTokenizer.testSingleFieldDiffAnalyzers-seed#[E7BB2663521ADA0C])
[    ] o.a.s.u.DirectUpdateHandler2 end_commit_flush
   [junit4]   2> 17520 INFO  (searcherExecutor-215-thread-1) [    ] o.a.s.c.SolrCore [collection1]
Registered new searcher Searcher@99d840[collection1] main{ExitableDirectoryReader(UninvertingDirectoryReader(Uninverting(_5(6.7.0):c1)
Uninverting(_6(6.7.0):c1) Uninverting(_7(6.7.0):c1)))}
   [junit4]   2> 17520 INFO  (TEST-TestMaxTokenLenTokenizer.testSingleFieldDiffAnalyzers-seed#[E7BB2663521ADA0C])
[    ] o.a.s.u.p.LogUpdateProcessorFactory [collection1]  webapp=null path=null params={wt=json&indent=true}{add=[3],commit=}
0 2
   [junit4]   2> 17520 INFO  (TEST-TestMaxTokenLenTokenizer.testSingleFieldDiffAnalyzers-seed#[E7BB2663521ADA0C])
[    ] o.a.s.u.DirectUpdateHandler2 start commit{,optimize=false,openSearcher=true,waitSearcher=true,expungeDeletes=false,softCommit=false,prepareCommit=false}
   [junit4]   2> 17520 INFO  (TEST-TestMaxTokenLenTokenizer.testSingleFieldDiffAnalyzers-seed#[E7BB2663521ADA0C])
[    ] o.a.s.u.SolrIndexWriter Calling setCommitData with IW:org.apache.solr.update.SolrIndexWriter@19252c8
   [junit4]   2> 17522 INFO  (TEST-TestMaxTokenLenTokenizer.testSingleFieldDiffAnalyzers-seed#[E7BB2663521ADA0C])
[    ] o.a.s.s.SolrIndexSearcher Opening [Searcher@14496a2[collection1] main]
   [junit4]   2> 17522 INFO  (TEST-TestMaxTokenLenTokenizer.testSingleFieldDiffAnalyzers-seed#[E7BB2663521ADA0C])
[    ] o.a.s.u.DirectUpdateHandler2 end_commit_flush
   [junit4]   2> 17523 INFO  (searcherExecutor-215-thread-1) [    ] o.a.s.c.SolrCore [collection1]
Registered new searcher Searcher@14496a2[collection1] main{ExitableDirectoryReader(UninvertingDirectoryReader(Uninverting(_5(6.7.0):c1)
Uninverting(_6(6.7.0):c1) Uninverting(_7(6.7.0):c1) Uninverting(_8(6.7.0):c1)))}
   [junit4]   2> 17523 INFO  (TEST-TestMaxTokenLenTokenizer.testSingleFieldDiffAnalyzers-seed#[E7BB2663521ADA0C])
[    ] o.a.s.u.p.LogUpdateProcessorFactory [collection1]  webapp=null path=null params={wt=json&indent=true}{add=[4],commit=}
0 2
   [junit4]   2> 17523 INFO  (TEST-TestMaxTokenLenTokenizer.testSingleFieldDiffAnalyzers-seed#[E7BB2663521ADA0C])
[    ] o.a.s.u.DirectUpdateHandler2 start commit{,optimize=false,openSearcher=true,waitSearcher=true,expungeDeletes=false,softCommit=false,prepareCommit=false}
   [junit4]   2> 17523 INFO  (TEST-TestMaxTokenLenTokenizer.testSingleFieldDiffAnalyzers-seed#[E7BB2663521ADA0C])
[    ] o.a.s.u.SolrIndexWriter Calling setCommitData with IW:org.apache.solr.update.SolrIndexWriter@19252c8
   [junit4]   2> 17525 INFO  (TEST-TestMaxTokenLenTokenizer.testSingleFieldDiffAnalyzers-seed#[E7BB2663521ADA0C])
[    ] o.a.s.s.SolrIndexSearcher Opening [Searcher@c194ea[collection1] main]
   [junit4]   2> 17525 INFO  (TEST-TestMaxTokenLenTokenizer.testSingleFieldDiffAnalyzers-seed#[E7BB2663521ADA0C])
[    ] o.a.s.u.DirectUpdateHandler2 end_commit_flush
   [junit4]   2> 17525 INFO  (searcherExecutor-215-thread-1) [    ] o.a.s.c.SolrCore [collection1]
Registered new searcher Searcher@c194ea[collection1] main{ExitableDirectoryReader(UninvertingDirectoryReader(Uninverting(_5(6.7.0):c1)
Uninverting(_6(6.7.0):c1) Uninverting(_7(6.7.0):c1) Uninverting(_8(6.7.0):c1) Uninverting(_9(6.7.0):c1)))}
   [junit4]   2> 17525 INFO  (TEST-TestMaxTokenLenTokenizer.testSingleFieldDiffAnalyzers-seed#[E7BB2663521ADA0C])
[    ] o.a.s.u.p.LogUpdateProcessorFactory [collection1]  webapp=null path=null params={wt=json&indent=true}{add=[5],commit=}
0 2
   [junit4]   2> 17525 INFO  (TEST-TestMaxTokenLenTokenizer.testSingleFieldDiffAnalyzers-seed#[E7BB2663521ADA0C])
[    ] o.a.s.u.DirectUpdateHandler2 start commit{,optimize=false,openSearcher=true,waitSearcher=true,expungeDeletes=false,softCommit=false,prepareCommit=false}
   [junit4]   2> 17525 INFO  (TEST-TestMaxTokenLenTokenizer.testSingleFieldDiffAnalyzers-seed#[E7BB2663521ADA0C])
[    ] o.a.s.u.DirectUpdateHandler2 No uncommitted changes. Skipping IW.commit.
   [junit4]   2> 17525 INFO  (TEST-TestMaxTokenLenTokenizer.testSingleFieldDiffAnalyzers-seed#[E7BB2663521ADA0C])
[    ] o.a.s.u.DirectUpdateHandler2 end_commit_flush
   [junit4]   2> 17525 INFO  (TEST-TestMaxTokenLenTokenizer.testSingleFieldDiffAnalyzers-seed#[E7BB2663521ADA0C])
[    ] o.a.s.u.p.LogUpdateProcessorFactory [collection1]  webapp=null path=null params={}{commit=}
0 0
   [junit4]   2> 17526 INFO  (TEST-TestMaxTokenLenTokenizer.testSingleFieldDiffAnalyzers-seed#[E7BB2663521ADA0C])
[    ] o.a.s.c.S.Request [collection1]  webapp=null path=null params={q=*:*&wt=xml} hits=5
status=0 QTime=0
   [junit4]   2> 17527 INFO  (TEST-TestMaxTokenLenTokenizer.testSingleFieldDiffAnalyzers-seed#[E7BB2663521ADA0C])
[    ] o.a.s.c.S.Request [collection1]  webapp=null path=null params={q=letter:let&wt=xml}
hits=1 status=0 QTime=0
   [junit4]   2> 17527 INFO  (TEST-TestMaxTokenLenTokenizer.testSingleFieldDiffAnalyzers-seed#[E7BB2663521ADA0C])
[    ] o.a.s.c.S.Request [collection1]  webapp=null path=null params={q=letter:lett&wt=xml}
hits=0 status=0 QTime=0
   [junit4]   2> 17528 INFO  (TEST-TestMaxTokenLenTokenizer.testSingleFieldDiffAnalyzers-seed#[E7BB2663521ADA0C])
[    ] o.a.s.c.S.Request [collection1]  webapp=null path=null params={q=lowerCase:low&wt=xml}
hits=1 status=0 QTime=0
   [junit4]   2> 17529 INFO  (TEST-TestMaxTokenLenTokenizer.testSingleFieldDiffAnalyzers-seed#[E7BB2663521ADA0C])
[    ] o.a.s.c.S.Request [collection1]  webapp=null path=null params={q=lowerCase:l&wt=xml}
hits=0 status=0 QTime=0
   [junit4]   2> 17529 INFO  (TEST-TestMaxTokenLenTokenizer.testSingleFieldDiffAnalyzers-seed#[E7BB2663521ADA0C])
[    ] o.a.s.c.S.Request [collection1]  webapp=null path=null params={q=lowerCase:lo&wt=xml}
hits=0 status=0 QTime=0
   [junit4]   2> 17530 INFO  (TEST-TestMaxTokenLenTokenizer.testSingleFieldDiffAnalyzers-seed#[E7BB2663521ADA0C])
[    ] o.a.s.c.S.Request [collection1]  webapp=null path=null params={q=lowerCase:lower&wt=xml}
hits=0 status=0 QTime=0
   [junit4]   2> 17530 INFO  (TEST-TestMaxTokenLenTokenizer.testSingleFieldDiffAnalyzers-seed#[E7BB2663521ADA0C])
[    ] o.a.s.c.S.Request [collection1]  webapp=null path=null params={q=whiteSpace:whi&wt=xml}
hits=1 status=0 QTime=0
   [junit4]   2> 17531 INFO  (TEST-TestMaxTokenLenTokenizer.testSingleFieldDiffAnalyzers-seed#[E7BB2663521ADA0C])
[    ] o.a.s.c.S.Request [collection1]  webapp=null path=null params={q=whiteSpace:teS&wt=xml}
hits=1 status=0 QTime=0
   [junit4]   2> 17531 INFO  (TEST-TestMaxTokenLenTokenizer.testSingleFieldDiffAnalyzers-seed#[E7BB2663521ADA0C])
[    ] o.a.s.c.S.Request [collection1]  webapp=null path=null params={q=whiteSpace:in&wt=xml}
hits=1 status=0 QTime=0
   [junit4]   2> 17532 INFO  (TEST-TestMaxTokenLenTokenizer.testSingleFieldDiffAnalyzers-seed#[E7BB2663521ADA0C])
[    ] o.a.s.c.S.Request [collection1]  webapp=null path=null params={q=whiteSpace:white&wt=xml}
hits=0 status=0 QTime=0
   [junit4]   2> 17532 INFO  (TEST-TestMaxTokenLenTokenizer.testSingleFieldDiffAnalyzers-seed#[E7BB2663521ADA0C])
[    ] o.a.s.c.S.Request [collection1]  webapp=null path=null params={q=unicodeWhiteSpace:uni&wt=xml}
hits=1 status=0 QTime=0
   [junit4]   2> 17533 INFO  (TEST-TestMaxTokenLenTokenizer.testSingleFieldDiffAnalyzers-seed#[E7BB2663521ADA0C])
[    ] o.a.s.c.S.Request [collection1]  webapp=null path=null params={q=unicodeWhiteSpace:cod&wt=xml}
hits=1 status=0 QTime=0
   [junit4]   2> 17533 INFO  (TEST-TestMaxTokenLenTokenizer.testSingleFieldDiffAnalyzers-seed#[E7BB2663521ADA0C])
[    ] o.a.s.c.S.Request [collection1]  webapp=null path=null params={q=unicodeWhiteSpace:e&wt=xml}
hits=1 status=0 QTime=0
   [junit4]   2> 17533 INFO  (TEST-TestMaxTokenLenTokenizer.testSingleFieldDiffAnalyzers-seed#[E7BB2663521ADA0C])
[    ] o.a.s.c.S.Request [collection1]  webapp=null path=null params={q=unicodeWhiteSpace:unico&wt=xml}
hits=0 status=0 QTime=0
   [junit4]   2> 17534 INFO  (TEST-TestMaxTokenLenTokenizer.testSingleFieldDiffAnalyzers-seed#[E7BB2663521ADA0C])
[    ] o.a.s.c.S.Request [collection1]  webapp=null path=null params={q=keyword:keyword&wt=xml}
hits=1 status=0 QTime=0
   [junit4]   2> 17534 INFO  (TEST-TestMaxTokenLenTokenizer.testSingleFieldDiffAnalyzers-seed#[E7BB2663521ADA0C])
[    ] o.a.s.c.S.Request [collection1]  webapp=null path=null params={q=keyword:key&wt=xml}
hits=0 status=0 QTime=0
   [junit4]   2> 17535 INFO  (TEST-TestMaxTokenLenTokenizer.testSingleFieldDiffAnalyzers-seed#[E7BB2663521ADA0C])
[    ] o.a.s.SolrTestCaseJ4 ###Ending testSingleFieldDiffAnalyzers
   [junit4]   2> 17535 INFO  (SUITE-TestMaxTokenLenTokenizer-seed#[E7BB2663521ADA0C]-worker)
[    ] o.a.s.SolrTestCaseJ4 ###deleteCore
   [junit4]   2> 17535 INFO  (SUITE-TestMaxTokenLenTokenizer-seed#[E7BB2663521ADA0C]-worker)
[    ] o.a.s.c.CoreContainer Shutting down CoreContainer instance=2525857
   [junit4]   2> 17535 INFO  (SUITE-TestMaxTokenLenTokenizer-seed#[E7BB2663521ADA0C]-worker)
[    ] o.a.s.m.SolrMetricManager Closing metric reporters for: solr.node
   [junit4]   2> 17535 INFO  (SUITE-TestMaxTokenLenTokenizer-seed#[E7BB2663521ADA0C]-worker)
[    ] o.a.s.m.SolrMetricManager Closing metric reporters for: solr.jvm
   [junit4]   2> 17535 INFO  (SUITE-TestMaxTokenLenTokenizer-seed#[E7BB2663521ADA0C]-worker)
[    ] o.a.s.m.SolrMetricManager Closing metric reporters for: solr.jetty
   [junit4]   2> 17535 INFO  (SUITE-TestMaxTokenLenTokenizer-seed#[E7BB2663521ADA0C]-worker)
[    ] o.a.s.c.TransientSolrCoreCacheDefault Allocating transient cache for 2147483647 transient
cores
   [junit4]   2> 17535 INFO  (coreCloseExecutor-219-thread-1) [    x:collection1] o.a.s.c.SolrCore
[collection1]  CLOSING SolrCore org.apache.solr.core.SolrCore@1818d41
   [junit4]   2> 17536 INFO  (coreCloseExecutor-219-thread-1) [    x:collection1] o.a.s.m.SolrMetricManager
Closing metric reporters for: solr.core.collection1
   [junit4]   2> NOTE: leaving temporary files on disk at: /home/jenkins/workspace/Lucene-Solr-6.x-Linux/solr/build/solr-core/test/J1/temp/solr.util.TestMaxTokenLenTokenizer_E7BB2663521ADA0C-001
   [junit4]   2> NOTE: test params are: codec=Asserting(Lucene62): {lowerCase0=PostingsFormat(name=Direct),
whiteSpace=Lucene50(blocksize=128), letter=PostingsFormat(name=Memory doPackFST= true), lowerCase=PostingsFormat(name=Direct),
unicodeWhiteSpace=PostingsFormat(name=Memory doPackFST= true), letter0=PostingsFormat(name=Memory
doPackFST= true), unicodeWhiteSpace0=PostingsFormat(name=Memory doPackFST= true), keyword0=PostingsFormat(name=Direct),
id=PostingsFormat(name=Direct), keyword=PostingsFormat(name=Direct), whiteSpace0=Lucene50(blocksize=128)},
docValues:{}, maxPointsInLeafNode=364, maxMBSortInHeap=6.401471386844213, sim=RandomSimilarity(queryNorm=false,coord=crazy):
{}, locale=sv, timezone=Australia/Adelaide
   [junit4]   2> NOTE: Linux 4.10.0-21-generic i386/Oracle Corporation 1.8.0_131 (32-bit)/cpus=8,threads=1,free=104063288,total=232521728
   [junit4]   2> NOTE: All tests run in this JVM: [DistributedTermsComponentTest, HdfsBasicDistributedZkTest,
SortByFunctionTest, TestIntervalFaceting, SolrCmdDistributorTest, TestMaxTokenLenTokenizer]
   [junit4] Completed [13/715 (1!)] on J1 in 0.62s, 2 tests, 1 error <<< FAILURES!

[...truncated 41791 lines...]

Mime
View raw message