lucene-dev mailing list archives

Site index · List index
Message view « Date » · « Thread »
Top « Date » · « Thread »
From Policeman Jenkins Server <jenk...@thetaphi.de>
Subject [JENKINS] Lucene-Solr-6.x-Windows (32bit/jdk1.8.0_131) - Build # 929 - Still Unstable!
Date Fri, 02 Jun 2017 18:57:33 GMT
Build: https://jenkins.thetaphi.de/job/Lucene-Solr-6.x-Windows/929/
Java: 32bit/jdk1.8.0_131 -server -XX:+UseConcMarkSweepGC

1 tests failed.
FAILED:  org.apache.solr.util.TestMaxTokenLenTokenizer.testSingleFieldSameAnalyzers

Error Message:
Exception during query

Stack Trace:
java.lang.RuntimeException: Exception during query
	at __randomizedtesting.SeedInfo.seed([AE139E3099EF6329:C4C1A15FC10CB3E6]:0)
	at org.apache.solr.SolrTestCaseJ4.assertQ(SolrTestCaseJ4.java:895)
	at org.apache.solr.util.TestMaxTokenLenTokenizer.testSingleFieldSameAnalyzers(TestMaxTokenLenTokenizer.java:104)
	at sun.reflect.NativeMethodAccessorImpl.invoke0(Native Method)
	at sun.reflect.NativeMethodAccessorImpl.invoke(NativeMethodAccessorImpl.java:62)
	at sun.reflect.DelegatingMethodAccessorImpl.invoke(DelegatingMethodAccessorImpl.java:43)
	at java.lang.reflect.Method.invoke(Method.java:498)
	at com.carrotsearch.randomizedtesting.RandomizedRunner.invoke(RandomizedRunner.java:1713)
	at com.carrotsearch.randomizedtesting.RandomizedRunner$8.evaluate(RandomizedRunner.java:907)
	at com.carrotsearch.randomizedtesting.RandomizedRunner$9.evaluate(RandomizedRunner.java:943)
	at com.carrotsearch.randomizedtesting.RandomizedRunner$10.evaluate(RandomizedRunner.java:957)
	at com.carrotsearch.randomizedtesting.rules.SystemPropertiesRestoreRule$1.evaluate(SystemPropertiesRestoreRule.java:57)
	at org.apache.lucene.util.TestRuleSetupTeardownChained$1.evaluate(TestRuleSetupTeardownChained.java:49)
	at org.apache.lucene.util.AbstractBeforeAfterRule$1.evaluate(AbstractBeforeAfterRule.java:45)
	at org.apache.lucene.util.TestRuleThreadAndTestName$1.evaluate(TestRuleThreadAndTestName.java:48)
	at org.apache.lucene.util.TestRuleIgnoreAfterMaxFailures$1.evaluate(TestRuleIgnoreAfterMaxFailures.java:64)
	at org.apache.lucene.util.TestRuleMarkFailure$1.evaluate(TestRuleMarkFailure.java:47)
	at com.carrotsearch.randomizedtesting.rules.StatementAdapter.evaluate(StatementAdapter.java:36)
	at com.carrotsearch.randomizedtesting.ThreadLeakControl$StatementRunner.run(ThreadLeakControl.java:368)
	at com.carrotsearch.randomizedtesting.ThreadLeakControl.forkTimeoutingTask(ThreadLeakControl.java:817)
	at com.carrotsearch.randomizedtesting.ThreadLeakControl$3.evaluate(ThreadLeakControl.java:468)
	at com.carrotsearch.randomizedtesting.RandomizedRunner.runSingleTest(RandomizedRunner.java:916)
	at com.carrotsearch.randomizedtesting.RandomizedRunner$5.evaluate(RandomizedRunner.java:802)
	at com.carrotsearch.randomizedtesting.RandomizedRunner$6.evaluate(RandomizedRunner.java:852)
	at com.carrotsearch.randomizedtesting.RandomizedRunner$7.evaluate(RandomizedRunner.java:863)
	at com.carrotsearch.randomizedtesting.rules.StatementAdapter.evaluate(StatementAdapter.java:36)
	at com.carrotsearch.randomizedtesting.rules.SystemPropertiesRestoreRule$1.evaluate(SystemPropertiesRestoreRule.java:57)
	at org.apache.lucene.util.AbstractBeforeAfterRule$1.evaluate(AbstractBeforeAfterRule.java:45)
	at com.carrotsearch.randomizedtesting.rules.StatementAdapter.evaluate(StatementAdapter.java:36)
	at org.apache.lucene.util.TestRuleStoreClassName$1.evaluate(TestRuleStoreClassName.java:41)
	at com.carrotsearch.randomizedtesting.rules.NoShadowingOrOverridesOnMethodsRule$1.evaluate(NoShadowingOrOverridesOnMethodsRule.java:40)
	at com.carrotsearch.randomizedtesting.rules.NoShadowingOrOverridesOnMethodsRule$1.evaluate(NoShadowingOrOverridesOnMethodsRule.java:40)
	at com.carrotsearch.randomizedtesting.rules.StatementAdapter.evaluate(StatementAdapter.java:36)
	at com.carrotsearch.randomizedtesting.rules.StatementAdapter.evaluate(StatementAdapter.java:36)
	at com.carrotsearch.randomizedtesting.rules.StatementAdapter.evaluate(StatementAdapter.java:36)
	at org.apache.lucene.util.TestRuleAssertionsRequired$1.evaluate(TestRuleAssertionsRequired.java:53)
	at org.apache.lucene.util.TestRuleMarkFailure$1.evaluate(TestRuleMarkFailure.java:47)
	at org.apache.lucene.util.TestRuleIgnoreAfterMaxFailures$1.evaluate(TestRuleIgnoreAfterMaxFailures.java:64)
	at org.apache.lucene.util.TestRuleIgnoreTestSuites$1.evaluate(TestRuleIgnoreTestSuites.java:54)
	at com.carrotsearch.randomizedtesting.rules.StatementAdapter.evaluate(StatementAdapter.java:36)
	at com.carrotsearch.randomizedtesting.ThreadLeakControl$StatementRunner.run(ThreadLeakControl.java:368)
	at java.lang.Thread.run(Thread.java:748)
Caused by: java.lang.RuntimeException: REQUEST FAILED: xpath=//result[@numFound=1]
	xml response was: <?xml version="1.0" encoding="UTF-8"?>
<response>
<lst name="responseHeader"><int name="status">0</int><int name="QTime">0</int></lst><result name="response" numFound="0" start="0"></result>
</response>

	request was:q=letter0:lett&wt=xml
	at org.apache.solr.SolrTestCaseJ4.assertQ(SolrTestCaseJ4.java:888)
	... 40 more




Build Log:
[...truncated 13299 lines...]
   [junit4] Suite: org.apache.solr.util.TestMaxTokenLenTokenizer
   [junit4]   2> Creating dataDir: C:\Users\jenkins\workspace\Lucene-Solr-6.x-Windows\solr\build\solr-core\test\J1\temp\solr.util.TestMaxTokenLenTokenizer_AE139E3099EF6329-001\init-core-data-001
   [junit4]   2> 2890564 INFO  (SUITE-TestMaxTokenLenTokenizer-seed#[AE139E3099EF6329]-worker) [    ] o.a.s.SolrTestCaseJ4 Using TrieFields
   [junit4]   2> 2890566 INFO  (SUITE-TestMaxTokenLenTokenizer-seed#[AE139E3099EF6329]-worker) [    ] o.a.s.SolrTestCaseJ4 Randomized ssl (false) and clientAuth (true) via: @org.apache.solr.util.RandomizeSSL(reason=, value=NaN, ssl=NaN, clientAuth=NaN)
   [junit4]   2> 2890566 INFO  (SUITE-TestMaxTokenLenTokenizer-seed#[AE139E3099EF6329]-worker) [    ] o.a.s.SolrTestCaseJ4 ####initCore
   [junit4]   2> 2890568 INFO  (SUITE-TestMaxTokenLenTokenizer-seed#[AE139E3099EF6329]-worker) [    ] o.a.s.c.SolrResourceLoader [null] Added 2 libs to classloader, from paths: [/C:/Users/jenkins/workspace/Lucene-Solr-6.x-Windows/solr/core/src/test-files/solr/collection1/lib, /C:/Users/jenkins/workspace/Lucene-Solr-6.x-Windows/solr/core/src/test-files/solr/collection1/lib/classes]
   [junit4]   2> 2890620 WARN  (SUITE-TestMaxTokenLenTokenizer-seed#[AE139E3099EF6329]-worker) [    ] o.a.s.c.Config Beginning with Solr 5.5, <mergePolicy> is deprecated, use <mergePolicyFactory> instead.
   [junit4]   2> 2890621 INFO  (SUITE-TestMaxTokenLenTokenizer-seed#[AE139E3099EF6329]-worker) [    ] o.a.s.c.SolrConfig Using Lucene MatchVersion: 6.7.0
   [junit4]   2> 2890638 INFO  (SUITE-TestMaxTokenLenTokenizer-seed#[AE139E3099EF6329]-worker) [    ] o.a.s.s.IndexSchema [null] Schema name=test
   [junit4]   2> 2890645 INFO  (SUITE-TestMaxTokenLenTokenizer-seed#[AE139E3099EF6329]-worker) [    ] o.a.s.s.IndexSchema Loaded schema test/1.0 with uniqueid field id
   [junit4]   2> 2890648 INFO  (SUITE-TestMaxTokenLenTokenizer-seed#[AE139E3099EF6329]-worker) [    ] o.a.s.u.UpdateShardHandler Creating UpdateShardHandler HTTP client with params: socketTimeout=30000&connTimeout=30000&retry=true
   [junit4]   2> 2890726 INFO  (SUITE-TestMaxTokenLenTokenizer-seed#[AE139E3099EF6329]-worker) [    ] o.a.s.m.r.SolrJmxReporter JMX monitoring for 'solr.node' (registry 'solr.node') enabled at server: com.sun.jmx.mbeanserver.JmxMBeanServer@12b1b59
   [junit4]   2> 2890729 INFO  (SUITE-TestMaxTokenLenTokenizer-seed#[AE139E3099EF6329]-worker) [    ] o.a.s.m.r.SolrJmxReporter JMX monitoring for 'solr.jvm' (registry 'solr.jvm') enabled at server: com.sun.jmx.mbeanserver.JmxMBeanServer@12b1b59
   [junit4]   2> 2890729 INFO  (SUITE-TestMaxTokenLenTokenizer-seed#[AE139E3099EF6329]-worker) [    ] o.a.s.m.r.SolrJmxReporter JMX monitoring for 'solr.jetty' (registry 'solr.jetty') enabled at server: com.sun.jmx.mbeanserver.JmxMBeanServer@12b1b59
   [junit4]   2> 2890732 INFO  (coreLoadExecutor-11839-thread-1) [    x:collection1] o.a.s.c.SolrResourceLoader [null] Added 2 libs to classloader, from paths: [/C:/Users/jenkins/workspace/Lucene-Solr-6.x-Windows/solr/core/src/test-files/solr/collection1/lib, /C:/Users/jenkins/workspace/Lucene-Solr-6.x-Windows/solr/core/src/test-files/solr/collection1/lib/classes]
   [junit4]   2> 2890803 WARN  (coreLoadExecutor-11839-thread-1) [    x:collection1] o.a.s.c.Config Beginning with Solr 5.5, <mergePolicy> is deprecated, use <mergePolicyFactory> instead.
   [junit4]   2> 2890805 INFO  (coreLoadExecutor-11839-thread-1) [    x:collection1] o.a.s.c.SolrConfig Using Lucene MatchVersion: 6.7.0
   [junit4]   2> 2890827 INFO  (coreLoadExecutor-11839-thread-1) [    x:collection1] o.a.s.s.IndexSchema [collection1] Schema name=test
   [junit4]   2> 2890840 INFO  (coreLoadExecutor-11839-thread-1) [    x:collection1] o.a.s.s.IndexSchema Loaded schema test/1.0 with uniqueid field id
   [junit4]   2> 2890840 INFO  (coreLoadExecutor-11839-thread-1) [    x:collection1] o.a.s.c.CoreContainer Creating SolrCore 'collection1' using configuration from instancedir C:\Users\jenkins\workspace\Lucene-Solr-6.x-Windows\solr\core\src\test-files\solr\collection1, trusted=true
   [junit4]   2> 2890840 INFO  (coreLoadExecutor-11839-thread-1) [    x:collection1] o.a.s.m.r.SolrJmxReporter JMX monitoring for 'solr.core.collection1' (registry 'solr.core.collection1') enabled at server: com.sun.jmx.mbeanserver.JmxMBeanServer@12b1b59
   [junit4]   2> 2890841 INFO  (coreLoadExecutor-11839-thread-1) [    x:collection1] o.a.s.c.SolrCore solr.RecoveryStrategy.Builder
   [junit4]   2> 2890841 INFO  (coreLoadExecutor-11839-thread-1) [    x:collection1] o.a.s.c.SolrCore [[collection1] ] Opening new SolrCore at [C:\Users\jenkins\workspace\Lucene-Solr-6.x-Windows\solr\core\src\test-files\solr\collection1], dataDir=[C:\Users\jenkins\workspace\Lucene-Solr-6.x-Windows\solr\build\solr-core\test\J1\temp\solr.util.TestMaxTokenLenTokenizer_AE139E3099EF6329-001\init-core-data-001\]
   [junit4]   2> 2890842 INFO  (coreLoadExecutor-11839-thread-1) [    x:collection1] o.a.s.u.RandomMergePolicy RandomMergePolicy wrapping class org.apache.lucene.index.LogDocMergePolicy: [LogDocMergePolicy: minMergeSize=1000, mergeFactor=41, maxMergeSize=9223372036854775807, maxMergeSizeForForcedMerge=9223372036854775807, calibrateSizeByDeletes=false, maxMergeDocs=2147483647, maxCFSSegmentSizeMB=8.796093022207999E12, noCFSRatio=0.34204118660262206]
   [junit4]   2> 2890917 INFO  (coreLoadExecutor-11839-thread-1) [    x:collection1] o.a.s.u.CommitTracker Hard AutoCommit: disabled
   [junit4]   2> 2890918 INFO  (coreLoadExecutor-11839-thread-1) [    x:collection1] o.a.s.u.CommitTracker Soft AutoCommit: disabled
   [junit4]   2> 2890918 INFO  (coreLoadExecutor-11839-thread-1) [    x:collection1] o.a.s.u.RandomMergePolicy RandomMergePolicy wrapping class org.apache.lucene.index.AlcoholicMergePolicy: [AlcoholicMergePolicy: minMergeSize=0, mergeFactor=10, maxMergeSize=316898071, maxMergeSizeForForcedMerge=9223372036854775807, calibrateSizeByDeletes=true, maxMergeDocs=2147483647, maxCFSSegmentSizeMB=8.796093022207999E12, noCFSRatio=0.1]
   [junit4]   2> 2890919 INFO  (coreLoadExecutor-11839-thread-1) [    x:collection1] o.a.s.s.SolrIndexSearcher Opening [Searcher@33db60[collection1] main]
   [junit4]   2> 2890919 WARN  (coreLoadExecutor-11839-thread-1) [    x:collection1] o.a.s.r.ManagedResourceStorage Cannot write to config directory C:\Users\jenkins\workspace\Lucene-Solr-6.x-Windows\solr\core\src\test-files\solr\collection1\conf; switching to use InMemory storage instead.
   [junit4]   2> 2890920 INFO  (coreLoadExecutor-11839-thread-1) [    x:collection1] o.a.s.h.ReplicationHandler Commits will be reserved for  10000
   [junit4]   2> 2890920 INFO  (searcherExecutor-11840-thread-1-processing-x:collection1) [    x:collection1] o.a.s.c.SolrCore [collection1] Registered new searcher Searcher@33db60[collection1] main{ExitableDirectoryReader(UninvertingDirectoryReader())}
   [junit4]   2> 2890921 INFO  (SUITE-TestMaxTokenLenTokenizer-seed#[AE139E3099EF6329]-worker) [    ] o.a.s.SolrTestCaseJ4 ####initCore end
   [junit4]   2> 2890924 INFO  (TEST-TestMaxTokenLenTokenizer.testSingleFieldSameAnalyzers-seed#[AE139E3099EF6329]) [    ] o.a.s.SolrTestCaseJ4 ###Starting testSingleFieldSameAnalyzers
   [junit4]   2> 2890924 INFO  (TEST-TestMaxTokenLenTokenizer.testSingleFieldSameAnalyzers-seed#[AE139E3099EF6329]) [    ] o.a.s.u.DirectUpdateHandler2 [collection1] REMOVING ALL DOCUMENTS FROM INDEX
   [junit4]   2> 2890924 INFO  (TEST-TestMaxTokenLenTokenizer.testSingleFieldSameAnalyzers-seed#[AE139E3099EF6329]) [    ] o.a.s.u.p.LogUpdateProcessorFactory [collection1]  webapp=null path=null params={_version_=-9223372036854775807&update.distrib=FROMLEADER&versions=true&wt=json&indent=true}{deleteByQuery=*:*} 0 0
   [junit4]   2> 2890925 INFO  (TEST-TestMaxTokenLenTokenizer.testSingleFieldSameAnalyzers-seed#[AE139E3099EF6329]) [    ] o.a.s.u.DirectUpdateHandler2 start commit{,optimize=false,openSearcher=true,waitSearcher=true,expungeDeletes=false,softCommit=false,prepareCommit=false}
   [junit4]   2> 2890925 INFO  (TEST-TestMaxTokenLenTokenizer.testSingleFieldSameAnalyzers-seed#[AE139E3099EF6329]) [    ] o.a.s.u.SolrIndexWriter Calling setCommitData with IW:org.apache.solr.update.SolrIndexWriter@1f913aa
   [junit4]   2> 2890926 INFO  (TEST-TestMaxTokenLenTokenizer.testSingleFieldSameAnalyzers-seed#[AE139E3099EF6329]) [    ] o.a.s.s.SolrIndexSearcher Opening [Searcher@143634e[collection1] main]
   [junit4]   2> 2890926 INFO  (TEST-TestMaxTokenLenTokenizer.testSingleFieldSameAnalyzers-seed#[AE139E3099EF6329]) [    ] o.a.s.u.DirectUpdateHandler2 end_commit_flush
   [junit4]   2> 2890927 INFO  (searcherExecutor-11840-thread-1) [    ] o.a.s.c.SolrCore [collection1] Registered new searcher Searcher@143634e[collection1] main{ExitableDirectoryReader(UninvertingDirectoryReader(Uninverting(_0(6.7.0):c1)))}
   [junit4]   2> 2890927 INFO  (TEST-TestMaxTokenLenTokenizer.testSingleFieldSameAnalyzers-seed#[AE139E3099EF6329]) [    ] o.a.s.u.p.LogUpdateProcessorFactory [collection1]  webapp=null path=null params={wt=json&indent=true}{add=[1],commit=} 0 2
   [junit4]   2> 2890927 INFO  (TEST-TestMaxTokenLenTokenizer.testSingleFieldSameAnalyzers-seed#[AE139E3099EF6329]) [    ] o.a.s.u.DirectUpdateHandler2 start commit{,optimize=false,openSearcher=true,waitSearcher=true,expungeDeletes=false,softCommit=false,prepareCommit=false}
   [junit4]   2> 2890927 INFO  (TEST-TestMaxTokenLenTokenizer.testSingleFieldSameAnalyzers-seed#[AE139E3099EF6329]) [    ] o.a.s.u.SolrIndexWriter Calling setCommitData with IW:org.apache.solr.update.SolrIndexWriter@1f913aa
   [junit4]   2> 2890928 INFO  (TEST-TestMaxTokenLenTokenizer.testSingleFieldSameAnalyzers-seed#[AE139E3099EF6329]) [    ] o.a.s.s.SolrIndexSearcher Opening [Searcher@83e3ea[collection1] main]
   [junit4]   2> 2890928 INFO  (TEST-TestMaxTokenLenTokenizer.testSingleFieldSameAnalyzers-seed#[AE139E3099EF6329]) [    ] o.a.s.u.DirectUpdateHandler2 end_commit_flush
   [junit4]   2> 2890928 INFO  (searcherExecutor-11840-thread-1) [    ] o.a.s.c.SolrCore [collection1] Registered new searcher Searcher@83e3ea[collection1] main{ExitableDirectoryReader(UninvertingDirectoryReader(Uninverting(_0(6.7.0):c1) Uninverting(_1(6.7.0):c1)))}
   [junit4]   2> 2890929 INFO  (TEST-TestMaxTokenLenTokenizer.testSingleFieldSameAnalyzers-seed#[AE139E3099EF6329]) [    ] o.a.s.u.p.LogUpdateProcessorFactory [collection1]  webapp=null path=null params={wt=json&indent=true}{add=[2],commit=} 0 1
   [junit4]   2> 2890929 INFO  (TEST-TestMaxTokenLenTokenizer.testSingleFieldSameAnalyzers-seed#[AE139E3099EF6329]) [    ] o.a.s.u.DirectUpdateHandler2 start commit{,optimize=false,openSearcher=true,waitSearcher=true,expungeDeletes=false,softCommit=false,prepareCommit=false}
   [junit4]   2> 2890929 INFO  (TEST-TestMaxTokenLenTokenizer.testSingleFieldSameAnalyzers-seed#[AE139E3099EF6329]) [    ] o.a.s.u.SolrIndexWriter Calling setCommitData with IW:org.apache.solr.update.SolrIndexWriter@1f913aa
   [junit4]   2> 2890930 INFO  (TEST-TestMaxTokenLenTokenizer.testSingleFieldSameAnalyzers-seed#[AE139E3099EF6329]) [    ] o.a.s.s.SolrIndexSearcher Opening [Searcher@a0a289[collection1] main]
   [junit4]   2> 2890930 INFO  (TEST-TestMaxTokenLenTokenizer.testSingleFieldSameAnalyzers-seed#[AE139E3099EF6329]) [    ] o.a.s.u.DirectUpdateHandler2 end_commit_flush
   [junit4]   2> 2890931 INFO  (searcherExecutor-11840-thread-1) [    ] o.a.s.c.SolrCore [collection1] Registered new searcher Searcher@a0a289[collection1] main{ExitableDirectoryReader(UninvertingDirectoryReader(Uninverting(_0(6.7.0):c1) Uninverting(_1(6.7.0):c1) Uninverting(_2(6.7.0):c1)))}
   [junit4]   2> 2890931 INFO  (TEST-TestMaxTokenLenTokenizer.testSingleFieldSameAnalyzers-seed#[AE139E3099EF6329]) [    ] o.a.s.u.p.LogUpdateProcessorFactory [collection1]  webapp=null path=null params={wt=json&indent=true}{add=[3],commit=} 0 2
   [junit4]   2> 2890931 INFO  (TEST-TestMaxTokenLenTokenizer.testSingleFieldSameAnalyzers-seed#[AE139E3099EF6329]) [    ] o.a.s.u.DirectUpdateHandler2 start commit{,optimize=false,openSearcher=true,waitSearcher=true,expungeDeletes=false,softCommit=false,prepareCommit=false}
   [junit4]   2> 2890931 INFO  (TEST-TestMaxTokenLenTokenizer.testSingleFieldSameAnalyzers-seed#[AE139E3099EF6329]) [    ] o.a.s.u.SolrIndexWriter Calling setCommitData with IW:org.apache.solr.update.SolrIndexWriter@1f913aa
   [junit4]   2> 2890932 INFO  (TEST-TestMaxTokenLenTokenizer.testSingleFieldSameAnalyzers-seed#[AE139E3099EF6329]) [    ] o.a.s.s.SolrIndexSearcher Opening [Searcher@4ffc98[collection1] main]
   [junit4]   2> 2890932 INFO  (TEST-TestMaxTokenLenTokenizer.testSingleFieldSameAnalyzers-seed#[AE139E3099EF6329]) [    ] o.a.s.u.DirectUpdateHandler2 end_commit_flush
   [junit4]   2> 2890933 INFO  (searcherExecutor-11840-thread-1) [    ] o.a.s.c.SolrCore [collection1] Registered new searcher Searcher@4ffc98[collection1] main{ExitableDirectoryReader(UninvertingDirectoryReader(Uninverting(_0(6.7.0):c1) Uninverting(_1(6.7.0):c1) Uninverting(_2(6.7.0):c1) Uninverting(_3(6.7.0):c1)))}
   [junit4]   2> 2890933 INFO  (TEST-TestMaxTokenLenTokenizer.testSingleFieldSameAnalyzers-seed#[AE139E3099EF6329]) [    ] o.a.s.u.p.LogUpdateProcessorFactory [collection1]  webapp=null path=null params={wt=json&indent=true}{add=[4],commit=} 0 2
   [junit4]   2> 2890933 INFO  (TEST-TestMaxTokenLenTokenizer.testSingleFieldSameAnalyzers-seed#[AE139E3099EF6329]) [    ] o.a.s.u.DirectUpdateHandler2 start commit{,optimize=false,openSearcher=true,waitSearcher=true,expungeDeletes=false,softCommit=false,prepareCommit=false}
   [junit4]   2> 2890933 INFO  (TEST-TestMaxTokenLenTokenizer.testSingleFieldSameAnalyzers-seed#[AE139E3099EF6329]) [    ] o.a.s.u.SolrIndexWriter Calling setCommitData with IW:org.apache.solr.update.SolrIndexWriter@1f913aa
   [junit4]   2> 2890934 INFO  (TEST-TestMaxTokenLenTokenizer.testSingleFieldSameAnalyzers-seed#[AE139E3099EF6329]) [    ] o.a.s.s.SolrIndexSearcher Opening [Searcher@3808d[collection1] main]
   [junit4]   2> 2890934 INFO  (TEST-TestMaxTokenLenTokenizer.testSingleFieldSameAnalyzers-seed#[AE139E3099EF6329]) [    ] o.a.s.u.DirectUpdateHandler2 end_commit_flush
   [junit4]   2> 2890935 INFO  (searcherExecutor-11840-thread-1) [    ] o.a.s.c.SolrCore [collection1] Registered new searcher Searcher@3808d[collection1] main{ExitableDirectoryReader(UninvertingDirectoryReader(Uninverting(_0(6.7.0):c1) Uninverting(_1(6.7.0):c1) Uninverting(_2(6.7.0):c1) Uninverting(_3(6.7.0):c1) Uninverting(_4(6.7.0):c1)))}
   [junit4]   2> 2890935 INFO  (TEST-TestMaxTokenLenTokenizer.testSingleFieldSameAnalyzers-seed#[AE139E3099EF6329]) [    ] o.a.s.u.p.LogUpdateProcessorFactory [collection1]  webapp=null path=null params={wt=json&indent=true}{add=[5],commit=} 0 2
   [junit4]   2> 2890935 INFO  (TEST-TestMaxTokenLenTokenizer.testSingleFieldSameAnalyzers-seed#[AE139E3099EF6329]) [    ] o.a.s.u.DirectUpdateHandler2 start commit{,optimize=false,openSearcher=true,waitSearcher=true,expungeDeletes=false,softCommit=false,prepareCommit=false}
   [junit4]   2> 2890935 INFO  (TEST-TestMaxTokenLenTokenizer.testSingleFieldSameAnalyzers-seed#[AE139E3099EF6329]) [    ] o.a.s.u.DirectUpdateHandler2 No uncommitted changes. Skipping IW.commit.
   [junit4]   2> 2890935 INFO  (TEST-TestMaxTokenLenTokenizer.testSingleFieldSameAnalyzers-seed#[AE139E3099EF6329]) [    ] o.a.s.u.DirectUpdateHandler2 end_commit_flush
   [junit4]   2> 2890935 INFO  (TEST-TestMaxTokenLenTokenizer.testSingleFieldSameAnalyzers-seed#[AE139E3099EF6329]) [    ] o.a.s.u.p.LogUpdateProcessorFactory [collection1]  webapp=null path=null params={}{commit=} 0 0
   [junit4]   2> 2890940 INFO  (TEST-TestMaxTokenLenTokenizer.testSingleFieldSameAnalyzers-seed#[AE139E3099EF6329]) [    ] o.a.s.c.S.Request [collection1]  webapp=null path=null params={q=*:*&wt=xml} hits=5 status=0 QTime=0
   [junit4]   2> 2890940 INFO  (TEST-TestMaxTokenLenTokenizer.testSingleFieldSameAnalyzers-seed#[AE139E3099EF6329]) [    ] o.a.s.c.S.Request [collection1]  webapp=null path=null params={q=letter0:l&wt=xml} hits=0 status=0 QTime=0
   [junit4]   2> 2890940 INFO  (TEST-TestMaxTokenLenTokenizer.testSingleFieldSameAnalyzers-seed#[AE139E3099EF6329]) [    ] o.a.s.c.S.Request [collection1]  webapp=null path=null params={q=letter0:let&wt=xml} hits=1 status=0 QTime=0
   [junit4]   2> 2890941 INFO  (TEST-TestMaxTokenLenTokenizer.testSingleFieldSameAnalyzers-seed#[AE139E3099EF6329]) [    ] o.a.s.c.S.Request [collection1]  webapp=null path=null params={q=letter0:lett&wt=xml} hits=0 status=0 QTime=0
   [junit4]   2> 2890941 ERROR (TEST-TestMaxTokenLenTokenizer.testSingleFieldSameAnalyzers-seed#[AE139E3099EF6329]) [    ] o.a.s.SolrTestCaseJ4 REQUEST FAILED: xpath=//result[@numFound=1]
   [junit4]   2> 	xml response was: <?xml version="1.0" encoding="UTF-8"?>
   [junit4]   2> <response>
   [junit4]   2> <lst name="responseHeader"><int name="status">0</int><int name="QTime">0</int></lst><result name="response" numFound="0" start="0"></result>
   [junit4]   2> </response>
   [junit4]   2> 
   [junit4]   2> 	request was:q=letter0:lett&wt=xml
   [junit4]   2> 2890941 ERROR (TEST-TestMaxTokenLenTokenizer.testSingleFieldSameAnalyzers-seed#[AE139E3099EF6329]) [    ] o.a.s.SolrTestCaseJ4 REQUEST FAILED: q=letter0:lett&wt=xml:java.lang.RuntimeException: REQUEST FAILED: xpath=//result[@numFound=1]
   [junit4]   2> 	xml response was: <?xml version="1.0" encoding="UTF-8"?>
   [junit4]   2> <response>
   [junit4]   2> <lst name="responseHeader"><int name="status">0</int><int name="QTime">0</int></lst><result name="response" numFound="0" start="0"></result>
   [junit4]   2> </response>
   [junit4]   2> 
   [junit4]   2> 	request was:q=letter0:lett&wt=xml
   [junit4]   2> 	at org.apache.solr.SolrTestCaseJ4.assertQ(SolrTestCaseJ4.java:888)
   [junit4]   2> 	at org.apache.solr.util.TestMaxTokenLenTokenizer.testSingleFieldSameAnalyzers(TestMaxTokenLenTokenizer.java:104)
   [junit4]   2> 	at sun.reflect.NativeMethodAccessorImpl.invoke0(Native Method)
   [junit4]   2> 	at sun.reflect.NativeMethodAccessorImpl.invoke(NativeMethodAccessorImpl.java:62)
   [junit4]   2> 	at sun.reflect.DelegatingMethodAccessorImpl.invoke(DelegatingMethodAccessorImpl.java:43)
   [junit4]   2> 	at java.lang.reflect.Method.invoke(Method.java:498)
   [junit4]   2> 	at com.carrotsearch.randomizedtesting.RandomizedRunner.invoke(RandomizedRunner.java:1713)
   [junit4]   2> 	at com.carrotsearch.randomizedtesting.RandomizedRunner$8.evaluate(RandomizedRunner.java:907)
   [junit4]   2> 	at com.carrotsearch.randomizedtesting.RandomizedRunner$9.evaluate(RandomizedRunner.java:943)
   [junit4]   2> 	at com.carrotsearch.randomizedtesting.RandomizedRunner$10.evaluate(RandomizedRunner.java:957)
   [junit4]   2> 	at com.carrotsearch.randomizedtesting.rules.SystemPropertiesRestoreRule$1.evaluate(SystemPropertiesRestoreRule.java:57)
   [junit4]   2> 	at org.apache.lucene.util.TestRuleSetupTeardownChained$1.evaluate(TestRuleSetupTeardownChained.java:49)
   [junit4]   2> 	at org.apache.lucene.util.AbstractBeforeAfterRule$1.evaluate(AbstractBeforeAfterRule.java:45)
   [junit4]   2> 	at org.apache.lucene.util.TestRuleThreadAndTestName$1.evaluate(TestRuleThreadAndTestName.java:48)
   [junit4]   2> 	at org.apache.lucene.util.TestRuleIgnoreAfterMaxFailures$1.evaluate(TestRuleIgnoreAfterMaxFailures.java:64)
   [junit4]   2> 	at org.apache.lucene.util.TestRuleMarkFailure$1.evaluate(TestRuleMarkFailure.java:47)
   [junit4]   2> 	at com.carrotsearch.randomizedtesting.rules.StatementAdapter.evaluate(StatementAdapter.java:36)
   [junit4]   2> 	at com.carrotsearch.randomizedtesting.ThreadLeakControl$StatementRunner.run(ThreadLeakControl.java:368)
   [junit4]   2> 	at com.carrotsearch.randomizedtesting.ThreadLeakControl.forkTimeoutingTask(ThreadLeakControl.java:817)
   [junit4]   2> 	at com.carrotsearch.randomizedtesting.ThreadLeakControl$3.evaluate(ThreadLeakControl.java:468)
   [junit4]   2> 	at com.carrotsearch.randomizedtesting.RandomizedRunner.runSingleTest(RandomizedRunner.java:916)
   [junit4]   2> 	at com.carrotsearch.randomizedtesting.RandomizedRunner$5.evaluate(RandomizedRunner.java:802)
   [junit4]   2> 	at com.carrotsearch.randomizedtesting.RandomizedRunner$6.evaluate(RandomizedRunner.java:852)
   [junit4]   2> 	at com.carrotsearch.randomizedtesting.RandomizedRunner$7.evaluate(RandomizedRunner.java:863)
   [junit4]   2> 	at com.carrotsearch.randomizedtesting.rules.StatementAdapter.evaluate(StatementAdapter.java:36)
   [junit4]   2> 	at com.carrotsearch.randomizedtesting.rules.SystemPropertiesRestoreRule$1.evaluate(SystemPropertiesRestoreRule.java:57)
   [junit4]   2> 	at org.apache.lucene.util.AbstractBeforeAfterRule$1.evaluate(AbstractBeforeAfterRule.java:45)
   [junit4]   2> 	at com.carrotsearch.randomizedtesting.rules.StatementAdapter.evaluate(StatementAdapter.java:36)
   [junit4]   2> 	at org.apache.lucene.util.TestRuleStoreClassName$1.evaluate(TestRuleStoreClassName.java:41)
   [junit4]   2> 	at com.carrotsearch.randomizedtesting.rules.NoShadowingOrOverridesOnMethodsRule$1.evaluate(NoShadowingOrOverridesOnMethodsRule.java:40)
   [junit4]   2> 	at com.carrotsearch.randomizedtesting.rules.NoShadowingOrOverridesOnMethodsRule$1.evaluate(NoShadowingOrOverridesOnMethodsRule.java:40)
   [junit4]   2> 	at com.carrotsearch.randomizedtesting.rules.StatementAdapter.evaluate(StatementAdapter.java:36)
   [junit4]   2> 	at com.carrotsearch.randomizedtesting.rules.StatementAdapter.evaluate(StatementAdapter.java:36)
   [junit4]   2> 	at com.carrotsearch.randomizedtesting.rules.StatementAdapter.evaluate(StatementAdapter.java:36)
   [junit4]   2> 	at org.apache.lucene.util.TestRuleAssertionsRequired$1.evaluate(TestRuleAssertionsRequired.java:53)
   [junit4]   2> 	at org.apache.lucene.util.TestRuleMarkFailure$1.evaluate(TestRuleMarkFailure.java:47)
   [junit4]   2> 	at org.apache.lucene.util.TestRuleIgnoreAfterMaxFailures$1.evaluate(TestRuleIgnoreAfterMaxFailures.java:64)
   [junit4]   2> 	at org.apache.lucene.util.TestRuleIgnoreTestSuites$1.evaluate(TestRuleIgnoreTestSuites.java:54)
   [junit4]   2> 	at com.carrotsearch.randomizedtesting.rules.StatementAdapter.evaluate(StatementAdapter.java:36)
   [junit4]   2> 	at com.carrotsearch.randomizedtesting.ThreadLeakControl$StatementRunner.run(ThreadLeakControl.java:368)
   [junit4]   2> 	at java.lang.Thread.run(Thread.java:748)
   [junit4]   2> 
   [junit4]   2> 2890942 INFO  (TEST-TestMaxTokenLenTokenizer.testSingleFieldSameAnalyzers-seed#[AE139E3099EF6329]) [    ] o.a.s.SolrTestCaseJ4 ###Ending testSingleFieldSameAnalyzers
   [junit4]   2> NOTE: reproduce with: ant test  -Dtestcase=TestMaxTokenLenTokenizer -Dtests.method=testSingleFieldSameAnalyzers -Dtests.seed=AE139E3099EF6329 -Dtests.slow=true -Dtests.locale=ar -Dtests.timezone=Asia/Muscat -Dtests.asserts=true -Dtests.file.encoding=ISO-8859-1
   [junit4] ERROR   0.02s J1 | TestMaxTokenLenTokenizer.testSingleFieldSameAnalyzers <<<
   [junit4]    > Throwable #1: java.lang.RuntimeException: Exception during query
   [junit4]    > 	at __randomizedtesting.SeedInfo.seed([AE139E3099EF6329:C4C1A15FC10CB3E6]:0)
   [junit4]    > 	at org.apache.solr.SolrTestCaseJ4.assertQ(SolrTestCaseJ4.java:895)
   [junit4]    > 	at org.apache.solr.util.TestMaxTokenLenTokenizer.testSingleFieldSameAnalyzers(TestMaxTokenLenTokenizer.java:104)
   [junit4]    > 	at java.lang.Thread.run(Thread.java:748)
   [junit4]    > Caused by: java.lang.RuntimeException: REQUEST FAILED: xpath=//result[@numFound=1]
   [junit4]    > 	xml response was: <?xml version="1.0" encoding="UTF-8"?>
   [junit4]    > <response>
   [junit4]    > <lst name="responseHeader"><int name="status">0</int><int name="QTime">0</int></lst><result name="response" numFound="0" start="0"></result>
   [junit4]    > </response>
   [junit4]    > 	request was:q=letter0:lett&wt=xml
   [junit4]    > 	at org.apache.solr.SolrTestCaseJ4.assertQ(SolrTestCaseJ4.java:888)
   [junit4]    > 	... 40 more
   [junit4]   2> 2890946 INFO  (TEST-TestMaxTokenLenTokenizer.testSingleFieldDiffAnalyzers-seed#[AE139E3099EF6329]) [    ] o.a.s.SolrTestCaseJ4 ###Starting testSingleFieldDiffAnalyzers
   [junit4]   2> 2890946 INFO  (TEST-TestMaxTokenLenTokenizer.testSingleFieldDiffAnalyzers-seed#[AE139E3099EF6329]) [    ] o.a.s.u.DirectUpdateHandler2 [collection1] REMOVING ALL DOCUMENTS FROM INDEX
   [junit4]   2> 2890946 INFO  (TEST-TestMaxTokenLenTokenizer.testSingleFieldDiffAnalyzers-seed#[AE139E3099EF6329]) [    ] o.a.s.u.p.LogUpdateProcessorFactory [collection1]  webapp=null path=null params={_version_=-9223372036854775807&update.distrib=FROMLEADER&versions=true&wt=json&indent=true}{deleteByQuery=*:*} 0 0
   [junit4]   2> 2890946 INFO  (TEST-TestMaxTokenLenTokenizer.testSingleFieldDiffAnalyzers-seed#[AE139E3099EF6329]) [    ] o.a.s.u.DirectUpdateHandler2 start commit{,optimize=false,openSearcher=true,waitSearcher=true,expungeDeletes=false,softCommit=false,prepareCommit=false}
   [junit4]   2> 2890946 INFO  (TEST-TestMaxTokenLenTokenizer.testSingleFieldDiffAnalyzers-seed#[AE139E3099EF6329]) [    ] o.a.s.u.SolrIndexWriter Calling setCommitData with IW:org.apache.solr.update.SolrIndexWriter@1f913aa
   [junit4]   2> 2890947 INFO  (TEST-TestMaxTokenLenTokenizer.testSingleFieldDiffAnalyzers-seed#[AE139E3099EF6329]) [    ] o.a.s.s.SolrIndexSearcher Opening [Searcher@1f85793[collection1] main]
   [junit4]   2> 2890947 INFO  (TEST-TestMaxTokenLenTokenizer.testSingleFieldDiffAnalyzers-seed#[AE139E3099EF6329]) [    ] o.a.s.u.DirectUpdateHandler2 end_commit_flush
   [junit4]   2> 2890948 INFO  (searcherExecutor-11840-thread-1) [    ] o.a.s.c.SolrCore [collection1] Registered new searcher Searcher@1f85793[collection1] main{ExitableDirectoryReader(UninvertingDirectoryReader(Uninverting(_5(6.7.0):c1)))}
   [junit4]   2> 2890948 INFO  (TEST-TestMaxTokenLenTokenizer.testSingleFieldDiffAnalyzers-seed#[AE139E3099EF6329]) [    ] o.a.s.u.p.LogUpdateProcessorFactory [collection1]  webapp=null path=null params={wt=json&indent=true}{add=[1],commit=} 0 1
   [junit4]   2> 2890948 INFO  (TEST-TestMaxTokenLenTokenizer.testSingleFieldDiffAnalyzers-seed#[AE139E3099EF6329]) [    ] o.a.s.u.DirectUpdateHandler2 start commit{,optimize=false,openSearcher=true,waitSearcher=true,expungeDeletes=false,softCommit=false,prepareCommit=false}
   [junit4]   2> 2890948 INFO  (TEST-TestMaxTokenLenTokenizer.testSingleFieldDiffAnalyzers-seed#[AE139E3099EF6329]) [    ] o.a.s.u.SolrIndexWriter Calling setCommitData with IW:org.apache.solr.update.SolrIndexWriter@1f913aa
   [junit4]   2> 2890949 INFO  (TEST-TestMaxTokenLenTokenizer.testSingleFieldDiffAnalyzers-seed#[AE139E3099EF6329]) [    ] o.a.s.s.SolrIndexSearcher Opening [Searcher@3d5571[collection1] main]
   [junit4]   2> 2890949 INFO  (TEST-TestMaxTokenLenTokenizer.testSingleFieldDiffAnalyzers-seed#[AE139E3099EF6329]) [    ] o.a.s.u.DirectUpdateHandler2 end_commit_flush
   [junit4]   2> 2890950 INFO  (searcherExecutor-11840-thread-1) [    ] o.a.s.c.SolrCore [collection1] Registered new searcher Searcher@3d5571[collection1] main{ExitableDirectoryReader(UninvertingDirectoryReader(Uninverting(_5(6.7.0):c1) Uninverting(_6(6.7.0):c1)))}
   [junit4]   2> 2890950 INFO  (TEST-TestMaxTokenLenTokenizer.testSingleFieldDiffAnalyzers-seed#[AE139E3099EF6329]) [    ] o.a.s.u.p.LogUpdateProcessorFactory [collection1]  webapp=null path=null params={wt=json&indent=true}{add=[2],commit=} 0 1
   [junit4]   2> 2890950 INFO  (TEST-TestMaxTokenLenTokenizer.testSingleFieldDiffAnalyzers-seed#[AE139E3099EF6329]) [    ] o.a.s.u.DirectUpdateHandler2 start commit{,optimize=false,openSearcher=true,waitSearcher=true,expungeDeletes=false,softCommit=false,prepareCommit=false}
   [junit4]   2> 2890950 INFO  (TEST-TestMaxTokenLenTokenizer.testSingleFieldDiffAnalyzers-seed#[AE139E3099EF6329]) [    ] o.a.s.u.SolrIndexWriter Calling setCommitData with IW:org.apache.solr.update.SolrIndexWriter@1f913aa
   [junit4]   2> 2890951 INFO  (TEST-TestMaxTokenLenTokenizer.testSingleFieldDiffAnalyzers-seed#[AE139E3099EF6329]) [    ] o.a.s.s.SolrIndexSearcher Opening [Searcher@636b05[collection1] main]
   [junit4]   2> 2890952 INFO  (TEST-TestMaxTokenLenTokenizer.testSingleFieldDiffAnalyzers-seed#[AE139E3099EF6329]) [    ] o.a.s.u.DirectUpdateHandler2 end_commit_flush
   [junit4]   2> 2890952 INFO  (searcherExecutor-11840-thread-1) [    ] o.a.s.c.SolrCore [collection1] Registered new searcher Searcher@636b05[collection1] main{ExitableDirectoryReader(UninvertingDirectoryReader(Uninverting(_5(6.7.0):c1) Uninverting(_6(6.7.0):c1) Uninverting(_7(6.7.0):c1)))}
   [junit4]   2> 2890952 INFO  (TEST-TestMaxTokenLenTokenizer.testSingleFieldDiffAnalyzers-seed#[AE139E3099EF6329]) [    ] o.a.s.u.p.LogUpdateProcessorFactory [collection1]  webapp=null path=null params={wt=json&indent=true}{add=[3],commit=} 0 1
   [junit4]   2> 2890952 INFO  (TEST-TestMaxTokenLenTokenizer.testSingleFieldDiffAnalyzers-seed#[AE139E3099EF6329]) [    ] o.a.s.u.DirectUpdateHandler2 start commit{,optimize=false,openSearcher=true,waitSearcher=true,expungeDeletes=false,softCommit=false,prepareCommit=false}
   [junit4]   2> 2890952 INFO  (TEST-TestMaxTokenLenTokenizer.testSingleFieldDiffAnalyzers-seed#[AE139E3099EF6329]) [    ] o.a.s.u.SolrIndexWriter Calling setCommitData with IW:org.apache.solr.update.SolrIndexWriter@1f913aa
   [junit4]   2> 2890953 INFO  (TEST-TestMaxTokenLenTokenizer.testSingleFieldDiffAnalyzers-seed#[AE139E3099EF6329]) [    ] o.a.s.s.SolrIndexSearcher Opening [Searcher@28bb5f[collection1] main]
   [junit4]   2> 2890955 INFO  (TEST-TestMaxTokenLenTokenizer.testSingleFieldDiffAnalyzers-seed#[AE139E3099EF6329]) [    ] o.a.s.u.DirectUpdateHandler2 end_commit_flush
   [junit4]   2> 2890955 INFO  (searcherExecutor-11840-thread-1) [    ] o.a.s.c.SolrCore [collection1] Registered new searcher Searcher@28bb5f[collection1] main{ExitableDirectoryReader(UninvertingDirectoryReader(Uninverting(_5(6.7.0):c1) Uninverting(_6(6.7.0):c1) Uninverting(_7(6.7.0):c1) Uninverting(_8(6.7.0):c1)))}
   [junit4]   2> 2890955 INFO  (TEST-TestMaxTokenLenTokenizer.testSingleFieldDiffAnalyzers-seed#[AE139E3099EF6329]) [    ] o.a.s.u.p.LogUpdateProcessorFactory [collection1]  webapp=null path=null params={wt=json&indent=true}{add=[4],commit=} 0 2
   [junit4]   2> 2890955 INFO  (TEST-TestMaxTokenLenTokenizer.testSingleFieldDiffAnalyzers-seed#[AE139E3099EF6329]) [    ] o.a.s.u.DirectUpdateHandler2 start commit{,optimize=false,openSearcher=true,waitSearcher=true,expungeDeletes=false,softCommit=false,prepareCommit=false}
   [junit4]   2> 2890955 INFO  (TEST-TestMaxTokenLenTokenizer.testSingleFieldDiffAnalyzers-seed#[AE139E3099EF6329]) [    ] o.a.s.u.SolrIndexWriter Calling setCommitData with IW:org.apache.solr.update.SolrIndexWriter@1f913aa
   [junit4]   2> 2890956 INFO  (TEST-TestMaxTokenLenTokenizer.testSingleFieldDiffAnalyzers-seed#[AE139E3099EF6329]) [    ] o.a.s.s.SolrIndexSearcher Opening [Searcher@100619a[collection1] main]
   [junit4]   2> 2890957 INFO  (TEST-TestMaxTokenLenTokenizer.testSingleFieldDiffAnalyzers-seed#[AE139E3099EF6329]) [    ] o.a.s.u.DirectUpdateHandler2 end_commit_flush
   [junit4]   2> 2890957 INFO  (searcherExecutor-11840-thread-1) [    ] o.a.s.c.SolrCore [collection1] Registered new searcher Searcher@100619a[collection1] main{ExitableDirectoryReader(UninvertingDirectoryReader(Uninverting(_5(6.7.0):c1) Uninverting(_6(6.7.0):c1) Uninverting(_7(6.7.0):c1) Uninverting(_8(6.7.0):c1) Uninverting(_9(6.7.0):c1)))}
   [junit4]   2> 2890957 INFO  (TEST-TestMaxTokenLenTokenizer.testSingleFieldDiffAnalyzers-seed#[AE139E3099EF6329]) [    ] o.a.s.u.p.LogUpdateProcessorFactory [collection1]  webapp=null path=null params={wt=json&indent=true}{add=[5],commit=} 0 2
   [junit4]   2> 2890957 INFO  (TEST-TestMaxTokenLenTokenizer.testSingleFieldDiffAnalyzers-seed#[AE139E3099EF6329]) [    ] o.a.s.u.DirectUpdateHandler2 start commit{,optimize=false,openSearcher=true,waitSearcher=true,expungeDeletes=false,softCommit=false,prepareCommit=false}
   [junit4]   2> 2890957 INFO  (TEST-TestMaxTokenLenTokenizer.testSingleFieldDiffAnalyzers-seed#[AE139E3099EF6329]) [    ] o.a.s.u.DirectUpdateHandler2 No uncommitted changes. Skipping IW.commit.
   [junit4]   2> 2890957 INFO  (TEST-TestMaxTokenLenTokenizer.testSingleFieldDiffAnalyzers-seed#[AE139E3099EF6329]) [    ] o.a.s.u.DirectUpdateHandler2 end_commit_flush
   [junit4]   2> 2890958 INFO  (TEST-TestMaxTokenLenTokenizer.testSingleFieldDiffAnalyzers-seed#[AE139E3099EF6329]) [    ] o.a.s.u.p.LogUpdateProcessorFactory [collection1]  webapp=null path=null params={}{commit=} 0 0
   [junit4]   2> 2890958 INFO  (TEST-TestMaxTokenLenTokenizer.testSingleFieldDiffAnalyzers-seed#[AE139E3099EF6329]) [    ] o.a.s.c.S.Request [collection1]  webapp=null path=null params={q=*:*&wt=xml} hits=5 status=0 QTime=0
   [junit4]   2> 2890958 INFO  (TEST-TestMaxTokenLenTokenizer.testSingleFieldDiffAnalyzers-seed#[AE139E3099EF6329]) [    ] o.a.s.c.S.Request [collection1]  webapp=null path=null params={q=letter:let&wt=xml} hits=1 status=0 QTime=0
   [junit4]   2> 2890959 INFO  (TEST-TestMaxTokenLenTokenizer.testSingleFieldDiffAnalyzers-seed#[AE139E3099EF6329]) [    ] o.a.s.c.S.Request [collection1]  webapp=null path=null params={q=letter:lett&wt=xml} hits=0 status=0 QTime=0
   [junit4]   2> 2890959 INFO  (TEST-TestMaxTokenLenTokenizer.testSingleFieldDiffAnalyzers-seed#[AE139E3099EF6329]) [    ] o.a.s.c.S.Request [collection1]  webapp=null path=null params={q=lowerCase:low&wt=xml} hits=1 status=0 QTime=0
   [junit4]   2> 2890959 INFO  (TEST-TestMaxTokenLenTokenizer.testSingleFieldDiffAnalyzers-seed#[AE139E3099EF6329]) [    ] o.a.s.c.S.Request [collection1]  webapp=null path=null params={q=lowerCase:l&wt=xml} hits=0 status=0 QTime=0
   [junit4]   2> 2890959 INFO  (TEST-TestMaxTokenLenTokenizer.testSingleFieldDiffAnalyzers-seed#[AE139E3099EF6329]) [    ] o.a.s.c.S.Request [collection1]  webapp=null path=null params={q=lowerCase:lo&wt=xml} hits=0 status=0 QTime=0
   [junit4]   2> 2890961 INFO  (TEST-TestMaxTokenLenTokenizer.testSingleFieldDiffAnalyzers-seed#[AE139E3099EF6329]) [    ] o.a.s.c.S.Request [collection1]  webapp=null path=null params={q=lowerCase:lower&wt=xml} hits=0 status=0 QTime=0
   [junit4]   2> 2890961 INFO  (TEST-TestMaxTokenLenTokenizer.testSingleFieldDiffAnalyzers-seed#[AE139E3099EF6329]) [    ] o.a.s.c.S.Request [collection1]  webapp=null path=null params={q=whiteSpace:whi&wt=xml} hits=1 status=0 QTime=0
   [junit4]   2> 2890961 INFO  (TEST-TestMaxTokenLenTokenizer.testSingleFieldDiffAnalyzers-seed#[AE139E3099EF6329]) [    ] o.a.s.c.S.Request [collection1]  webapp=null path=null params={q=whiteSpace:teS&wt=xml} hits=1 status=0 QTime=0
   [junit4]   2> 2890961 INFO  (TEST-TestMaxTokenLenTokenizer.testSingleFieldDiffAnalyzers-seed#[AE139E3099EF6329]) [    ] o.a.s.c.S.Request [collection1]  webapp=null path=null params={q=whiteSpace:in&wt=xml} hits=1 status=0 QTime=0
   [junit4]   2> 2890962 INFO  (TEST-TestMaxTokenLenTokenizer.testSingleFieldDiffAnalyzers-seed#[AE139E3099EF6329]) [    ] o.a.s.c.S.Request [collection1]  webapp=null path=null params={q=whiteSpace:white&wt=xml} hits=0 status=0 QTime=0
   [junit4]   2> 2890962 INFO  (TEST-TestMaxTokenLenTokenizer.testSingleFieldDiffAnalyzers-seed#[AE139E3099EF6329]) [    ] o.a.s.c.S.Request [collection1]  webapp=null path=null params={q=unicodeWhiteSpace:uni&wt=xml} hits=1 status=0 QTime=0
   [junit4]   2> 2890962 INFO  (TEST-TestMaxTokenLenTokenizer.testSingleFieldDiffAnalyzers-seed#[AE139E3099EF6329]) [    ] o.a.s.c.S.Request [collection1]  webapp=null path=null params={q=unicodeWhiteSpace:cod&wt=xml} hits=1 status=0 QTime=0
   [junit4]   2> 2890962 INFO  (TEST-TestMaxTokenLenTokenizer.testSingleFieldDiffAnalyzers-seed#[AE139E3099EF6329]) [    ] o.a.s.c.S.Request [collection1]  webapp=null path=null params={q=unicodeWhiteSpace:e&wt=xml} hits=1 status=0 QTime=0
   [junit4]   2> 2890963 INFO  (TEST-TestMaxTokenLenTokenizer.testSingleFieldDiffAnalyzers-seed#[AE139E3099EF6329]) [    ] o.a.s.c.S.Request [collection1]  webapp=null path=null params={q=unicodeWhiteSpace:unico&wt=xml} hits=0 status=0 QTime=0
   [junit4]   2> 2890963 INFO  (TEST-TestMaxTokenLenTokenizer.testSingleFieldDiffAnalyzers-seed#[AE139E3099EF6329]) [    ] o.a.s.c.S.Request [collection1]  webapp=null path=null params={q=keyword:keyword&wt=xml} hits=1 status=0 QTime=0
   [junit4]   2> 2890963 INFO  (TEST-TestMaxTokenLenTokenizer.testSingleFieldDiffAnalyzers-seed#[AE139E3099EF6329]) [    ] o.a.s.c.S.Request [collection1]  webapp=null path=null params={q=keyword:key&wt=xml} hits=0 status=0 QTime=0
   [junit4]   2> 2890963 INFO  (TEST-TestMaxTokenLenTokenizer.testSingleFieldDiffAnalyzers-seed#[AE139E3099EF6329]) [    ] o.a.s.SolrTestCaseJ4 ###Ending testSingleFieldDiffAnalyzers
   [junit4]   2> 2890963 INFO  (SUITE-TestMaxTokenLenTokenizer-seed#[AE139E3099EF6329]-worker) [    ] o.a.s.SolrTestCaseJ4 ###deleteCore
   [junit4]   2> 2890963 INFO  (SUITE-TestMaxTokenLenTokenizer-seed#[AE139E3099EF6329]-worker) [    ] o.a.s.c.CoreContainer Shutting down CoreContainer instance=3336883
   [junit4]   2> 2890963 INFO  (SUITE-TestMaxTokenLenTokenizer-seed#[AE139E3099EF6329]-worker) [    ] o.a.s.m.SolrMetricManager Closing metric reporters for: solr.node
   [junit4]   2> 2890964 INFO  (SUITE-TestMaxTokenLenTokenizer-seed#[AE139E3099EF6329]-worker) [    ] o.a.s.m.SolrMetricManager Closing metric reporters for: solr.jvm
   [junit4]   2> 2890964 INFO  (SUITE-TestMaxTokenLenTokenizer-seed#[AE139E3099EF6329]-worker) [    ] o.a.s.m.SolrMetricManager Closing metric reporters for: solr.jetty
   [junit4]   2> 2890964 INFO  (SUITE-TestMaxTokenLenTokenizer-seed#[AE139E3099EF6329]-worker) [    ] o.a.s.c.TransientSolrCoreCacheDefault Allocating transient cache for 2147483647 transient cores
   [junit4]   2> 2890966 INFO  (coreCloseExecutor-11844-thread-1) [    x:collection1] o.a.s.c.SolrCore [collection1]  CLOSING SolrCore org.apache.solr.core.SolrCore@636218
   [junit4]   2> 2890966 INFO  (coreCloseExecutor-11844-thread-1) [    x:collection1] o.a.s.m.SolrMetricManager Closing metric reporters for: solr.core.collection1
   [junit4]   2> NOTE: leaving temporary files on disk at: C:\Users\jenkins\workspace\Lucene-Solr-6.x-Windows\solr\build\solr-core\test\J1\temp\solr.util.TestMaxTokenLenTokenizer_AE139E3099EF6329-001
   [junit4]   2> NOTE: test params are: codec=Lucene62, sim=RandomSimilarity(queryNorm=true,coord=no): {}, locale=ar, timezone=Asia/Muscat
   [junit4]   2> NOTE: Windows 10 10.0 x86/Oracle Corporation 1.8.0_131 (32-bit)/cpus=3,threads=1,free=257636504,total=518979584
   [junit4]   2> NOTE: All tests run in this JVM: [SpellCheckComponentTest, StatsReloadRaceTest, BigEndianAscendingWordSerializerTest, SolrCoreCheckLockOnStartupTest, RecoveryAfterSoftCommitTest, TestSimpleTrackingShardHandler, TestSSLRandomization, TestPerFieldSimilarityWithDefaultOverride, DeleteInactiveReplicaTest, CircularListTest, DistribJoinFromCollectionTest, CloneFieldUpdateProcessorFactoryTest, SharedFSAutoReplicaFailoverUtilsTest, BasicAuthStandaloneTest, BasicZkTest, TermVectorComponentTest, ResourceLoaderTest, CollectionReloadTest, ReturnFieldsTest, TestGraphTermsQParserPlugin, SolrCoreMetricManagerTest, TestUnifiedSolrHighlighter, DeleteNodeTest, TestSystemCollAutoCreate, TestSolrQueryParserResource, AutoCommitTest, TestClassNameShortening, AtomicUpdatesTest, CurrencyFieldOpenExchangeTest, SpellCheckCollatorTest, SolrMetricReporterTest, SolrJmxReporterTest, TestIndexSearcher, TestSmileRequest, DeleteShardTest, CreateCollectionCleanupTest, ReplaceNodeTest, CdcrVersionReplicationTest, BlockJoinFacetRandomTest, BasicFunctionalityTest, TermVectorComponentDistributedTest, TestComplexPhraseQParserPlugin, BlockCacheTest, TestNoOpRegenerator, ZkSolrClientTest, SpellingQueryConverterTest, TestInPlaceUpdatesDistrib, TestNestedDocsSort, TestPathTrie, TestXmlQParserPlugin, TestManagedSchemaThreadSafety, SearchHandlerTest, SliceStateTest, TestTolerantUpdateProcessorCloud, DateRangeFieldTest, TestTrieFacet, TestFieldTypeCollectionResource, SpatialHeatmapFacetsTest, DistributedFacetPivotWhiteBoxTest, TestConfigSetsAPI, MergeStrategyTest, SignatureUpdateProcessorFactoryTest, AsyncCallRequestStatusResponseTest, DistributedIntervalFacetingTest, SuggesterTest, ForceLeaderTest, TestDelegationWithHadoopAuth, TestSolrDeletionPolicy2, BufferStoreTest, FileBasedSpellCheckerTest, CollectionsAPIDistributedZkTest, CopyFieldTest, TestInfoStreamLogging, DirectUpdateHandlerOptimizeTest, ReplicaListTransformerTest, HdfsWriteToMultipleCollectionsTest, TestShortCircuitedRequests, WrapperMergePolicyFactoryTest, ExplicitHLLTest, ConnectionReuseTest, CachingDirectoryFactoryTest, TestJsonFacets, CoreMergeIndexesAdminHandlerTest, DistribCursorPagingTest, SSLMigrationTest, DefaultValueUpdateProcessorTest, TestScoreJoinQPScore, SolrIndexSplitterTest, TestEmbeddedSolrServerSchemaAPI, RuleEngineTest, TestCoreDiscovery, TestLeaderElectionZkExpiry, TestDistributedGrouping, OutOfBoxZkACLAndCredentialsProvidersTest, EnumFieldTest, TestDistributedMissingSort, TestJmxMonitoredMap, GraphQueryTest, IgnoreCommitOptimizeUpdateProcessorFactoryTest, SolrCLIZkUtilsTest, TestQuerySenderNoQuery, TestLMDirichletSimilarityFactory, RestartWhileUpdatingTest, TestExportWriter, DistributedVersionInfoTest, TestHdfsCloudBackupRestore, QueryResultKeyTest, MetricsHandlerTest, DistanceUnitsTest, TestFoldingMultitermQuery, SuggesterWFSTTest, CloudMLTQParserTest, CdcrBootstrapTest, TlogReplayBufferedWhileIndexingTest, TestUninvertingReader, TestRangeQuery, SmileWriterTest, ScriptEngineTest, TestBlobHandler, TestCloudJSONFacetJoinDomain, SpellPossibilityIteratorTest, TestCollectionAPIs, TestSolrCloudWithSecureImpersonation, ConvertedLegacyTest, ExternalFileFieldSortTest, DateMathParserTest, TestHdfsBackupRestoreCore, FieldMutatingUpdateProcessorTest, TestSolrCoreParser, TestShardHandlerFactory, TestConfigSetsAPIZkFailure, AnalysisErrorHandlingTest, TestClassicSimilarityFactory, TestFieldCache, AnalyticsMergeStrategyTest, StatsComponentTest, TestRawTransformer, TestConfig, TestClusterProperties, BlobRepositoryCloudTest, HdfsBasicDistributedZkTest, TestDocSet, NoCacheHeaderTest, FacetPivotSmallTest, RegexBoostProcessorTest, TestGraphMLResponseWriter, TestPivotHelperCode, DistributedFacetPivotSmallAdvancedTest, TestFieldCacheSanityChecker, SolrGangliaReporterTest, EchoParamsTest, URLClassifyProcessorTest, CoreSorterTest, TestTestInjection, TestManagedSynonymGraphFilterFactory, TestSolr4Spatial, HdfsLockFactoryTest, ClassificationUpdateProcessorIntegrationTest, TestExactSharedStatsCache, VMParamsZkACLAndCredentialsProvidersTest, LoggingHandlerTest, TestReversedWildcardFilterFactory, BasicDistributedZk2Test, TestSolrQueryParser, TestExceedMaxTermLength, TestSolrXml, TestMissingGroups, TestMiniSolrCloudClusterSSL, HdfsSyncSliceTest, PreAnalyzedFieldManagedSchemaCloudTest, BadIndexSchemaTest, UnloadDistributedZkTest, LeaderElectionIntegrationTest, TestRandomFaceting, TestZkChroot, ShardRoutingCustomTest, TestFaceting, TestRecovery, TestHashPartitioner, DistributedSpellCheckComponentTest, ZkControllerTest, TestRealTimeGet, TestStressReorder, TestJoin, TestReload, TestStressVersions, DistributedTermsComponentTest, SolrCoreTest, TestGroupingSearch, SolrCmdDistributorTest, TestFiltering, DirectUpdateHandlerTest, TestBadConfig, HighlighterTest, CurrencyFieldXmlFileTest, SimplePostToolTest, SolrRequestParserTest, DocValuesTest, TestAtomicUpdateErrorCases, StatelessScriptUpdateProcessorFactoryTest, DocValuesMultiTest, SolrInfoMBeanTest, DebugComponentTest, TestSurroundQueryParser, DisMaxRequestHandlerTest, TestQueryUtils, TestWriterPerf, PrimitiveFieldTypeTest, XmlUpdateRequestHandlerTest, TestValueSourceCache, MoreLikeThisHandlerTest, FastVectorHighlighterTest, IndexSchemaTest, UpdateRequestProcessorFactoryTest, TestCSVResponseWriter, QueryParsingTest, JsonLoaderTest, TestPHPSerializedResponseWriter, TestComponentsName, HighlighterConfigTest, TestQuerySenderListener, UpdateParamsTest, SolrIndexConfigTest, BadComponentTest, TestStressRecovery, TestMergePolicyConfig, MultiTermTest, SampleTest, TestSearchPerf, NumericFieldsTest, MinimalSchemaTest, TestElisionMultitermQuery, TestFuzzyAnalyzedSuggestions, TestPostingsSolrHighlighter, TestLuceneMatchVersion, TestCodecSupport, TestLMJelinekMercerSimilarityFactory, PreAnalyzedFieldTest, TestSystemIdResolver, PrimUtilsTest, TestSuggestSpellingConverter, DOMUtilTest, RAMDirectoryFactoryTest, ClusterStateTest, TestUtils, TestDocumentBuilder, ZkNodePropsTest, UUIDFieldTest, FileUtilsTest, TestRTGBase, SolrTestCaseJ4Test, TestCrossCoreJoin, TestCursorMarkWithoutUniqueKey, TestHighlightDedupGrouping, TestEmbeddedSolrServerConstructors, AliasIntegrationTest, AssignTest, BaseCdcrDistributedZkTest, CdcrReplicationDistributedZkTest, CdcrReplicationHandlerTest, CleanupOldIndexTest, CloudExitableDirectoryReaderTest, CollectionStateFormat2Test, CollectionsAPISolrJTest, DistribDocExpirationUpdateProcessorTest, LeaderElectionContextKeyTest, LeaderFailureAfterFreshStartTest, LeaderInitiatedRecoveryOnCommitTest, NodeMutatorTest, OverseerCollectionConfigSetProcessorTest, OverseerModifyCollectionTest, OverseerRolesTest, OverseerStatusTest, OverseerTaskQueueTest, RollingRestartTest, SharedFSAutoReplicaFailoverTest, SolrCloudExampleTest, SolrXmlInZkTest, TestCloudDeleteByQuery, TestCloudPivotFacet, TestCloudPseudoReturnFields, TestCollectionAPI, TestDeleteCollectionOnDownNodes, TestDistribDocBasedVersion, TestDownShardTolerantSearch, TestExclusionRuleCollectionAccess, TestLeaderElectionWithEmptyReplica, TestLocalFSCloudBackupRestore, TestMiniSolrCloudCluster, TestOnReconnectListenerSupport, TestRandomFlRTGCloud, TestRebalanceLeaders, TestReplicaProperties, TestRequestForwarding, TestRequestStatusCollectionAPI, TestSolrCloudWithDelegationTokens, TestStressInPlaceUpdates, TestStressLiveNodes, HdfsChaosMonkeySafeLeaderTest, HdfsCollectionsAPIDistributedZkTest, HdfsNNFailoverTest, HdfsRecoveryZkTest, HdfsThreadLeakTest, HdfsTlogReplayBufferedWhileIndexingTest, StressHdfsTest, TestClusterStateMutator, ZkStateReaderTest, ZkStateWriterTest, ExitableDirectoryReaderTest, HdfsDirectoryFactoryTest, TestBackupRepositoryFactory, TestConfigOverlay, TestConfigSetImmutable, TestDynamicLoading, TestSolrCoreSnapshots, TestReqParamsAPI, TestRestoreCore, TestSQLHandler, TestSolrConfigHandlerConcurrent, V2ApiIntegrationTest, CoreAdminCreateDiscoverTest, CoreAdminRequestStatusTest, InfoHandlerTest, PropertiesRequestHandlerTest, SecurityConfHandlerTest, SegmentsInfoRequestHandlerTest, TestConfigsApi, TestCoreAdminApis, DistributedExpandComponentTest, DistributedFacetPivotLongTailTest, SuggestComponentTest, JavabinLoaderTest, CheckHdfsIndexTest, SolrMetricManagerTest, SolrGraphiteReporterTest, TestMacroExpander, TestMacros, JSONWriterTest, SmileWriterTest, TestBinaryResponseWriter, TestCustomDocTransformer, TestGeoJSONResponseWriter, TestJavabinTupleStreamParser, TestPushWriter, TestRawResponseWriter, TestSubQueryTransformerCrossCore, TestManagedResource, TestManagedResourceStorage, TestRestManager, TestCopyFieldCollectionResource, TestDynamicFieldCollectionResource, TestDynamicFieldResource, TestFieldCollectionResource, TestSchemaNameResource, TestSchemaSimilarityResource, TestSerializedLuceneMatchVersion, TestSolrQueryParserDefaultOperatorResource, TestManagedStopFilterFactory, BooleanFieldTest, ChangedSchemaMergeTest, DocValuesMissingTest, TestCloudManagedSchema, TestCloudSchemaless, TestCustomSort, TestHashQParserPlugin, TestOverriddenPrefixQueryForCustomFieldType, TestPayloadCheckQParserPlugin, TestReRankQParserPlugin, TestRecoveryHdfs, TestReloadDeadlock, TestSearcherReuse, TestSolr4Spatial2, TestSolrFieldCacheMBean, TestStandardQParsers, TestStressUserVersions, TestXmlQParser, TestOrdValues, TestSortByMinMaxFunction, BJQParserTest, BlockJoinFacetDistribTest, TestJsonRequest, TestDFISimilarityFactory, TestNonDefinedSimilarityFactory, TestExactStatsCache, TestAuthorizationFramework, HdfsDirectoryTest, TestFieldCacheSortRandom, TestFieldCacheVsDocValues, TestFieldCacheWithThreads, TestNumericTerms32, AddBlockUpdateTest, CdcrUpdateLogTest, DataDrivenBlockJoinTest, SolrIndexMetricsTest, TestInPlaceUpdatesStandalone, PreAnalyzedUpdateProcessorTest, TemplateUpdateProcessorTest, UUIDUpdateProcessorFallbackTest, JsonValidatorTest, TestMaxTokenLenTokenizer]
   [junit4] Completed [707/715 (1!)] on J1 in 0.42s, 2 tests, 1 error <<< FAILURES!

[...truncated 39471 lines...]

Mime
View raw message