lucene-dev mailing list archives

Site index · List index
Message view « Date » · « Thread »
Top « Date » · « Thread »
From Policeman Jenkins Server <jenk...@thetaphi.de>
Subject [JENKINS] Lucene-Solr-6.x-Linux (64bit/jdk1.8.0_131) - Build # 3645 - Still Unstable!
Date Fri, 02 Jun 2017 15:47:43 GMT
Build: https://jenkins.thetaphi.de/job/Lucene-Solr-6.x-Linux/3645/
Java: 64bit/jdk1.8.0_131 -XX:-UseCompressedOops -XX:+UseSerialGC

2 tests failed.
FAILED:  org.apache.solr.cloud.TestStressCloudBlindAtomicUpdates.test_dv

Error Message:
java.lang.RuntimeException: Error from server at http://127.0.0.1:40255/solr/test_col: Failed synchronous update on shard StdNode: http://127.0.0.1:36309/solr/test_col_shard1_replica2/ update: org.apache.solr.client.solrj.request.UpdateRequest@79e2a1f3

Stack Trace:
java.util.concurrent.ExecutionException: java.lang.RuntimeException: Error from server at http://127.0.0.1:40255/solr/test_col: Failed synchronous update on shard StdNode: http://127.0.0.1:36309/solr/test_col_shard1_replica2/ update: org.apache.solr.client.solrj.request.UpdateRequest@79e2a1f3
	at __randomizedtesting.SeedInfo.seed([4BAFE8412879F788:7DBB8A07A224CD99]:0)
	at java.util.concurrent.FutureTask.report(FutureTask.java:122)
	at java.util.concurrent.FutureTask.get(FutureTask.java:192)
	at org.apache.solr.cloud.TestStressCloudBlindAtomicUpdates.checkField(TestStressCloudBlindAtomicUpdates.java:281)
	at org.apache.solr.cloud.TestStressCloudBlindAtomicUpdates.test_dv(TestStressCloudBlindAtomicUpdates.java:193)
	at sun.reflect.NativeMethodAccessorImpl.invoke0(Native Method)
	at sun.reflect.NativeMethodAccessorImpl.invoke(NativeMethodAccessorImpl.java:62)
	at sun.reflect.DelegatingMethodAccessorImpl.invoke(DelegatingMethodAccessorImpl.java:43)
	at java.lang.reflect.Method.invoke(Method.java:498)
	at com.carrotsearch.randomizedtesting.RandomizedRunner.invoke(RandomizedRunner.java:1713)
	at com.carrotsearch.randomizedtesting.RandomizedRunner$8.evaluate(RandomizedRunner.java:907)
	at com.carrotsearch.randomizedtesting.RandomizedRunner$9.evaluate(RandomizedRunner.java:943)
	at com.carrotsearch.randomizedtesting.RandomizedRunner$10.evaluate(RandomizedRunner.java:957)
	at com.carrotsearch.randomizedtesting.rules.SystemPropertiesRestoreRule$1.evaluate(SystemPropertiesRestoreRule.java:57)
	at org.apache.lucene.util.TestRuleSetupTeardownChained$1.evaluate(TestRuleSetupTeardownChained.java:49)
	at org.apache.lucene.util.AbstractBeforeAfterRule$1.evaluate(AbstractBeforeAfterRule.java:45)
	at org.apache.lucene.util.TestRuleThreadAndTestName$1.evaluate(TestRuleThreadAndTestName.java:48)
	at org.apache.lucene.util.TestRuleIgnoreAfterMaxFailures$1.evaluate(TestRuleIgnoreAfterMaxFailures.java:64)
	at org.apache.lucene.util.TestRuleMarkFailure$1.evaluate(TestRuleMarkFailure.java:47)
	at com.carrotsearch.randomizedtesting.rules.StatementAdapter.evaluate(StatementAdapter.java:36)
	at com.carrotsearch.randomizedtesting.ThreadLeakControl$StatementRunner.run(ThreadLeakControl.java:368)
	at com.carrotsearch.randomizedtesting.ThreadLeakControl.forkTimeoutingTask(ThreadLeakControl.java:817)
	at com.carrotsearch.randomizedtesting.ThreadLeakControl$3.evaluate(ThreadLeakControl.java:468)
	at com.carrotsearch.randomizedtesting.RandomizedRunner.runSingleTest(RandomizedRunner.java:916)
	at com.carrotsearch.randomizedtesting.RandomizedRunner$5.evaluate(RandomizedRunner.java:802)
	at com.carrotsearch.randomizedtesting.RandomizedRunner$6.evaluate(RandomizedRunner.java:852)
	at com.carrotsearch.randomizedtesting.RandomizedRunner$7.evaluate(RandomizedRunner.java:863)
	at com.carrotsearch.randomizedtesting.rules.StatementAdapter.evaluate(StatementAdapter.java:36)
	at com.carrotsearch.randomizedtesting.rules.SystemPropertiesRestoreRule$1.evaluate(SystemPropertiesRestoreRule.java:57)
	at org.apache.lucene.util.AbstractBeforeAfterRule$1.evaluate(AbstractBeforeAfterRule.java:45)
	at com.carrotsearch.randomizedtesting.rules.StatementAdapter.evaluate(StatementAdapter.java:36)
	at org.apache.lucene.util.TestRuleStoreClassName$1.evaluate(TestRuleStoreClassName.java:41)
	at com.carrotsearch.randomizedtesting.rules.NoShadowingOrOverridesOnMethodsRule$1.evaluate(NoShadowingOrOverridesOnMethodsRule.java:40)
	at com.carrotsearch.randomizedtesting.rules.NoShadowingOrOverridesOnMethodsRule$1.evaluate(NoShadowingOrOverridesOnMethodsRule.java:40)
	at com.carrotsearch.randomizedtesting.rules.StatementAdapter.evaluate(StatementAdapter.java:36)
	at com.carrotsearch.randomizedtesting.rules.StatementAdapter.evaluate(StatementAdapter.java:36)
	at com.carrotsearch.randomizedtesting.rules.StatementAdapter.evaluate(StatementAdapter.java:36)
	at org.apache.lucene.util.TestRuleAssertionsRequired$1.evaluate(TestRuleAssertionsRequired.java:53)
	at org.apache.lucene.util.TestRuleMarkFailure$1.evaluate(TestRuleMarkFailure.java:47)
	at org.apache.lucene.util.TestRuleIgnoreAfterMaxFailures$1.evaluate(TestRuleIgnoreAfterMaxFailures.java:64)
	at org.apache.lucene.util.TestRuleIgnoreTestSuites$1.evaluate(TestRuleIgnoreTestSuites.java:54)
	at com.carrotsearch.randomizedtesting.rules.StatementAdapter.evaluate(StatementAdapter.java:36)
	at com.carrotsearch.randomizedtesting.ThreadLeakControl$StatementRunner.run(ThreadLeakControl.java:368)
	at java.lang.Thread.run(Thread.java:748)
Caused by: java.lang.RuntimeException: Error from server at http://127.0.0.1:40255/solr/test_col: Failed synchronous update on shard StdNode: http://127.0.0.1:36309/solr/test_col_shard1_replica2/ update: org.apache.solr.client.solrj.request.UpdateRequest@79e2a1f3
	at org.apache.solr.cloud.TestStressCloudBlindAtomicUpdates$Worker.run(TestStressCloudBlindAtomicUpdates.java:409)
	at java.util.concurrent.Executors$RunnableAdapter.call(Executors.java:511)
	at java.util.concurrent.FutureTask.run(FutureTask.java:266)
	at org.apache.solr.common.util.ExecutorUtil$MDCAwareThreadPoolExecutor.lambda$execute$0(ExecutorUtil.java:229)
	at java.util.concurrent.ThreadPoolExecutor.runWorker(ThreadPoolExecutor.java:1142)
	at java.util.concurrent.ThreadPoolExecutor$Worker.run(ThreadPoolExecutor.java:617)
	... 1 more
Caused by: org.apache.solr.client.solrj.impl.HttpSolrClient$RemoteSolrException: Error from server at http://127.0.0.1:40255/solr/test_col: Failed synchronous update on shard StdNode: http://127.0.0.1:36309/solr/test_col_shard1_replica2/ update: org.apache.solr.client.solrj.request.UpdateRequest@79e2a1f3
	at org.apache.solr.client.solrj.impl.HttpSolrClient.executeMethod(HttpSolrClient.java:612)
	at org.apache.solr.client.solrj.impl.HttpSolrClient.request(HttpSolrClient.java:279)
	at org.apache.solr.client.solrj.impl.HttpSolrClient.request(HttpSolrClient.java:268)
	at org.apache.solr.client.solrj.SolrRequest.process(SolrRequest.java:160)
	at org.apache.solr.client.solrj.SolrRequest.process(SolrRequest.java:177)
	at org.apache.solr.cloud.TestStressCloudBlindAtomicUpdates$Worker.doRandomAtomicUpdate(TestStressCloudBlindAtomicUpdates.java:368)
	at org.apache.solr.cloud.TestStressCloudBlindAtomicUpdates$Worker.run(TestStressCloudBlindAtomicUpdates.java:397)
	... 6 more


FAILED:  org.apache.solr.util.TestMaxTokenLenTokenizer.testSingleFieldSameAnalyzers

Error Message:
Exception during query

Stack Trace:
java.lang.RuntimeException: Exception during query
	at __randomizedtesting.SeedInfo.seed([4BAFE8412879F788:217DD72E709A2747]:0)
	at org.apache.solr.SolrTestCaseJ4.assertQ(SolrTestCaseJ4.java:895)
	at org.apache.solr.util.TestMaxTokenLenTokenizer.testSingleFieldSameAnalyzers(TestMaxTokenLenTokenizer.java:104)
	at sun.reflect.NativeMethodAccessorImpl.invoke0(Native Method)
	at sun.reflect.NativeMethodAccessorImpl.invoke(NativeMethodAccessorImpl.java:62)
	at sun.reflect.DelegatingMethodAccessorImpl.invoke(DelegatingMethodAccessorImpl.java:43)
	at java.lang.reflect.Method.invoke(Method.java:498)
	at com.carrotsearch.randomizedtesting.RandomizedRunner.invoke(RandomizedRunner.java:1713)
	at com.carrotsearch.randomizedtesting.RandomizedRunner$8.evaluate(RandomizedRunner.java:907)
	at com.carrotsearch.randomizedtesting.RandomizedRunner$9.evaluate(RandomizedRunner.java:943)
	at com.carrotsearch.randomizedtesting.RandomizedRunner$10.evaluate(RandomizedRunner.java:957)
	at com.carrotsearch.randomizedtesting.rules.SystemPropertiesRestoreRule$1.evaluate(SystemPropertiesRestoreRule.java:57)
	at org.apache.lucene.util.TestRuleSetupTeardownChained$1.evaluate(TestRuleSetupTeardownChained.java:49)
	at org.apache.lucene.util.AbstractBeforeAfterRule$1.evaluate(AbstractBeforeAfterRule.java:45)
	at org.apache.lucene.util.TestRuleThreadAndTestName$1.evaluate(TestRuleThreadAndTestName.java:48)
	at org.apache.lucene.util.TestRuleIgnoreAfterMaxFailures$1.evaluate(TestRuleIgnoreAfterMaxFailures.java:64)
	at org.apache.lucene.util.TestRuleMarkFailure$1.evaluate(TestRuleMarkFailure.java:47)
	at com.carrotsearch.randomizedtesting.rules.StatementAdapter.evaluate(StatementAdapter.java:36)
	at com.carrotsearch.randomizedtesting.ThreadLeakControl$StatementRunner.run(ThreadLeakControl.java:368)
	at com.carrotsearch.randomizedtesting.ThreadLeakControl.forkTimeoutingTask(ThreadLeakControl.java:817)
	at com.carrotsearch.randomizedtesting.ThreadLeakControl$3.evaluate(ThreadLeakControl.java:468)
	at com.carrotsearch.randomizedtesting.RandomizedRunner.runSingleTest(RandomizedRunner.java:916)
	at com.carrotsearch.randomizedtesting.RandomizedRunner$5.evaluate(RandomizedRunner.java:802)
	at com.carrotsearch.randomizedtesting.RandomizedRunner$6.evaluate(RandomizedRunner.java:852)
	at com.carrotsearch.randomizedtesting.RandomizedRunner$7.evaluate(RandomizedRunner.java:863)
	at com.carrotsearch.randomizedtesting.rules.StatementAdapter.evaluate(StatementAdapter.java:36)
	at com.carrotsearch.randomizedtesting.rules.SystemPropertiesRestoreRule$1.evaluate(SystemPropertiesRestoreRule.java:57)
	at org.apache.lucene.util.AbstractBeforeAfterRule$1.evaluate(AbstractBeforeAfterRule.java:45)
	at com.carrotsearch.randomizedtesting.rules.StatementAdapter.evaluate(StatementAdapter.java:36)
	at org.apache.lucene.util.TestRuleStoreClassName$1.evaluate(TestRuleStoreClassName.java:41)
	at com.carrotsearch.randomizedtesting.rules.NoShadowingOrOverridesOnMethodsRule$1.evaluate(NoShadowingOrOverridesOnMethodsRule.java:40)
	at com.carrotsearch.randomizedtesting.rules.NoShadowingOrOverridesOnMethodsRule$1.evaluate(NoShadowingOrOverridesOnMethodsRule.java:40)
	at com.carrotsearch.randomizedtesting.rules.StatementAdapter.evaluate(StatementAdapter.java:36)
	at com.carrotsearch.randomizedtesting.rules.StatementAdapter.evaluate(StatementAdapter.java:36)
	at com.carrotsearch.randomizedtesting.rules.StatementAdapter.evaluate(StatementAdapter.java:36)
	at org.apache.lucene.util.TestRuleAssertionsRequired$1.evaluate(TestRuleAssertionsRequired.java:53)
	at org.apache.lucene.util.TestRuleMarkFailure$1.evaluate(TestRuleMarkFailure.java:47)
	at org.apache.lucene.util.TestRuleIgnoreAfterMaxFailures$1.evaluate(TestRuleIgnoreAfterMaxFailures.java:64)
	at org.apache.lucene.util.TestRuleIgnoreTestSuites$1.evaluate(TestRuleIgnoreTestSuites.java:54)
	at com.carrotsearch.randomizedtesting.rules.StatementAdapter.evaluate(StatementAdapter.java:36)
	at com.carrotsearch.randomizedtesting.ThreadLeakControl$StatementRunner.run(ThreadLeakControl.java:368)
	at java.lang.Thread.run(Thread.java:748)
Caused by: java.lang.RuntimeException: REQUEST FAILED: xpath=//result[@numFound=1]
	xml response was: <?xml version="1.0" encoding="UTF-8"?>
<response>
<lst name="responseHeader"><int name="status">0</int><int name="QTime">0</int></lst><result name="response" numFound="0" start="0"></result>
</response>

	request was:q=letter0:lett&wt=xml
	at org.apache.solr.SolrTestCaseJ4.assertQ(SolrTestCaseJ4.java:888)
	... 40 more




Build Log:
[...truncated 12711 lines...]
   [junit4] Suite: org.apache.solr.cloud.TestStressCloudBlindAtomicUpdates
   [junit4]   2> Creating dataDir: /home/jenkins/workspace/Lucene-Solr-6.x-Linux/solr/build/solr-core/test/J0/temp/solr.cloud.TestStressCloudBlindAtomicUpdates_4BAFE8412879F788-001/init-core-data-001
   [junit4]   2> 1277158 WARN  (SUITE-TestStressCloudBlindAtomicUpdates-seed#[4BAFE8412879F788]-worker) [    ] o.a.s.SolrTestCaseJ4 startTrackingSearchers: numOpens=146 numCloses=146
   [junit4]   2> 1277158 INFO  (SUITE-TestStressCloudBlindAtomicUpdates-seed#[4BAFE8412879F788]-worker) [    ] o.a.s.SolrTestCaseJ4 Using PointFields
   [junit4]   2> 1277159 INFO  (SUITE-TestStressCloudBlindAtomicUpdates-seed#[4BAFE8412879F788]-worker) [    ] o.a.s.SolrTestCaseJ4 Randomized ssl (false) and clientAuth (false) via: @org.apache.solr.SolrTestCaseJ4$SuppressSSL(bugUrl=SSL overhead seems to cause OutOfMemory when stress testing)
   [junit4]   2> 1277159 INFO  (SUITE-TestStressCloudBlindAtomicUpdates-seed#[4BAFE8412879F788]-worker) [    ] o.a.s.c.MiniSolrCloudCluster Starting cluster of 4 servers in /home/jenkins/workspace/Lucene-Solr-6.x-Linux/solr/build/solr-core/test/J0/temp/solr.cloud.TestStressCloudBlindAtomicUpdates_4BAFE8412879F788-001/tempDir-001
   [junit4]   2> 1277160 INFO  (SUITE-TestStressCloudBlindAtomicUpdates-seed#[4BAFE8412879F788]-worker) [    ] o.a.s.c.ZkTestServer STARTING ZK TEST SERVER
   [junit4]   2> 1277160 INFO  (Thread-3067) [    ] o.a.s.c.ZkTestServer client port:0.0.0.0/0.0.0.0:0
   [junit4]   2> 1277160 INFO  (Thread-3067) [    ] o.a.s.c.ZkTestServer Starting server
   [junit4]   2> 1277161 ERROR (Thread-3067) [    ] o.a.z.s.ZooKeeperServer ZKShutdownHandler is not registered, so ZooKeeper server won't take any action on ERROR or SHUTDOWN server state changes
   [junit4]   2> 1277260 INFO  (SUITE-TestStressCloudBlindAtomicUpdates-seed#[4BAFE8412879F788]-worker) [    ] o.a.s.c.ZkTestServer start zk server on port:45663
   [junit4]   2> 1277266 INFO  (jetty-launcher-2292-thread-2) [    ] o.e.j.s.Server jetty-9.3.14.v20161028
   [junit4]   2> 1277266 INFO  (jetty-launcher-2292-thread-1) [    ] o.e.j.s.Server jetty-9.3.14.v20161028
   [junit4]   2> 1277266 INFO  (jetty-launcher-2292-thread-3) [    ] o.e.j.s.Server jetty-9.3.14.v20161028
   [junit4]   2> 1277266 INFO  (jetty-launcher-2292-thread-4) [    ] o.e.j.s.Server jetty-9.3.14.v20161028
   [junit4]   2> 1277268 INFO  (jetty-launcher-2292-thread-2) [    ] o.e.j.s.h.ContextHandler Started o.e.j.s.ServletContextHandler@4791aab{/solr,null,AVAILABLE}
   [junit4]   2> 1277268 INFO  (jetty-launcher-2292-thread-4) [    ] o.e.j.s.h.ContextHandler Started o.e.j.s.ServletContextHandler@1fdddf0e{/solr,null,AVAILABLE}
   [junit4]   2> 1277269 INFO  (jetty-launcher-2292-thread-2) [    ] o.e.j.s.AbstractConnector Started ServerConnector@21f23a08{HTTP/1.1,[http/1.1]}{127.0.0.1:36309}
   [junit4]   2> 1277269 INFO  (jetty-launcher-2292-thread-4) [    ] o.e.j.s.AbstractConnector Started ServerConnector@35a9f8aa{HTTP/1.1,[http/1.1]}{127.0.0.1:38409}
   [junit4]   2> 1277269 INFO  (jetty-launcher-2292-thread-2) [    ] o.e.j.s.Server Started @1278679ms
   [junit4]   2> 1277269 INFO  (jetty-launcher-2292-thread-1) [    ] o.e.j.s.h.ContextHandler Started o.e.j.s.ServletContextHandler@a14afca{/solr,null,AVAILABLE}
   [junit4]   2> 1277269 INFO  (jetty-launcher-2292-thread-2) [    ] o.a.s.c.s.e.JettySolrRunner Jetty properties: {hostContext=/solr, hostPort=36309}
   [junit4]   2> 1277269 INFO  (jetty-launcher-2292-thread-3) [    ] o.e.j.s.h.ContextHandler Started o.e.j.s.ServletContextHandler@19bf71e1{/solr,null,AVAILABLE}
   [junit4]   2> 1277269 INFO  (jetty-launcher-2292-thread-4) [    ] o.e.j.s.Server Started @1278679ms
   [junit4]   2> 1277269 INFO  (jetty-launcher-2292-thread-4) [    ] o.a.s.c.s.e.JettySolrRunner Jetty properties: {hostContext=/solr, hostPort=38409}
   [junit4]   2> 1277269 ERROR (jetty-launcher-2292-thread-2) [    ] o.a.s.s.StartupLoggingUtils Missing Java Option solr.log.dir. Logging may be missing or incomplete.
   [junit4]   2> 1277269 ERROR (jetty-launcher-2292-thread-4) [    ] o.a.s.s.StartupLoggingUtils Missing Java Option solr.log.dir. Logging may be missing or incomplete.
   [junit4]   2> 1277269 INFO  (jetty-launcher-2292-thread-2) [    ] o.a.s.s.SolrDispatchFilter  ___      _       Welcome to Apache Solr? version 6.7.0
   [junit4]   2> 1277270 INFO  (jetty-launcher-2292-thread-4) [    ] o.a.s.s.SolrDispatchFilter  ___      _       Welcome to Apache Solr? version 6.7.0
   [junit4]   2> 1277270 INFO  (jetty-launcher-2292-thread-2) [    ] o.a.s.s.SolrDispatchFilter / __| ___| |_ _   Starting in cloud mode on port null
   [junit4]   2> 1277270 INFO  (jetty-launcher-2292-thread-4) [    ] o.a.s.s.SolrDispatchFilter / __| ___| |_ _   Starting in cloud mode on port null
   [junit4]   2> 1277270 INFO  (jetty-launcher-2292-thread-2) [    ] o.a.s.s.SolrDispatchFilter \__ \/ _ \ | '_|  Install dir: null
   [junit4]   2> 1277270 INFO  (jetty-launcher-2292-thread-4) [    ] o.a.s.s.SolrDispatchFilter \__ \/ _ \ | '_|  Install dir: null
   [junit4]   2> 1277270 INFO  (jetty-launcher-2292-thread-2) [    ] o.a.s.s.SolrDispatchFilter |___/\___/_|_|    Start time: 2017-06-02T15:30:52.365Z
   [junit4]   2> 1277270 INFO  (jetty-launcher-2292-thread-4) [    ] o.a.s.s.SolrDispatchFilter |___/\___/_|_|    Start time: 2017-06-02T15:30:52.365Z
   [junit4]   2> 1277270 INFO  (jetty-launcher-2292-thread-1) [    ] o.e.j.s.AbstractConnector Started ServerConnector@46f12ab3{HTTP/1.1,[http/1.1]}{127.0.0.1:40255}
   [junit4]   2> 1277270 INFO  (jetty-launcher-2292-thread-3) [    ] o.e.j.s.AbstractConnector Started ServerConnector@1cf70070{HTTP/1.1,[http/1.1]}{127.0.0.1:38163}
   [junit4]   2> 1277270 INFO  (jetty-launcher-2292-thread-1) [    ] o.e.j.s.Server Started @1278680ms
   [junit4]   2> 1277270 INFO  (jetty-launcher-2292-thread-1) [    ] o.a.s.c.s.e.JettySolrRunner Jetty properties: {hostContext=/solr, hostPort=40255}
   [junit4]   2> 1277270 ERROR (jetty-launcher-2292-thread-1) [    ] o.a.s.s.StartupLoggingUtils Missing Java Option solr.log.dir. Logging may be missing or incomplete.
   [junit4]   2> 1277271 INFO  (jetty-launcher-2292-thread-1) [    ] o.a.s.s.SolrDispatchFilter  ___      _       Welcome to Apache Solr? version 6.7.0
   [junit4]   2> 1277271 INFO  (jetty-launcher-2292-thread-1) [    ] o.a.s.s.SolrDispatchFilter / __| ___| |_ _   Starting in cloud mode on port null
   [junit4]   2> 1277271 INFO  (jetty-launcher-2292-thread-3) [    ] o.e.j.s.Server Started @1278681ms
   [junit4]   2> 1277271 INFO  (jetty-launcher-2292-thread-1) [    ] o.a.s.s.SolrDispatchFilter \__ \/ _ \ | '_|  Install dir: null
   [junit4]   2> 1277271 INFO  (jetty-launcher-2292-thread-3) [    ] o.a.s.c.s.e.JettySolrRunner Jetty properties: {hostContext=/solr, hostPort=38163}
   [junit4]   2> 1277271 INFO  (jetty-launcher-2292-thread-1) [    ] o.a.s.s.SolrDispatchFilter |___/\___/_|_|    Start time: 2017-06-02T15:30:52.366Z
   [junit4]   2> 1277271 ERROR (jetty-launcher-2292-thread-3) [    ] o.a.s.s.StartupLoggingUtils Missing Java Option solr.log.dir. Logging may be missing or incomplete.
   [junit4]   2> 1277271 INFO  (jetty-launcher-2292-thread-3) [    ] o.a.s.s.SolrDispatchFilter  ___      _       Welcome to Apache Solr? version 6.7.0
   [junit4]   2> 1277271 INFO  (jetty-launcher-2292-thread-3) [    ] o.a.s.s.SolrDispatchFilter / __| ___| |_ _   Starting in cloud mode on port null
   [junit4]   2> 1277271 INFO  (jetty-launcher-2292-thread-3) [    ] o.a.s.s.SolrDispatchFilter \__ \/ _ \ | '_|  Install dir: null
   [junit4]   2> 1277271 INFO  (jetty-launcher-2292-thread-3) [    ] o.a.s.s.SolrDispatchFilter |___/\___/_|_|    Start time: 2017-06-02T15:30:52.366Z
   [junit4]   2> 1277272 INFO  (jetty-launcher-2292-thread-2) [    ] o.a.s.s.SolrDispatchFilter solr.xml found in ZooKeeper. Loading...
   [junit4]   2> 1277273 INFO  (jetty-launcher-2292-thread-4) [    ] o.a.s.s.SolrDispatchFilter solr.xml found in ZooKeeper. Loading...
   [junit4]   2> 1277301 INFO  (jetty-launcher-2292-thread-1) [    ] o.a.s.s.SolrDispatchFilter solr.xml found in ZooKeeper. Loading...
   [junit4]   2> 1277301 INFO  (jetty-launcher-2292-thread-3) [    ] o.a.s.s.SolrDispatchFilter solr.xml found in ZooKeeper. Loading...
   [junit4]   2> 1277302 INFO  (jetty-launcher-2292-thread-4) [    ] o.a.s.u.UpdateShardHandler Creating UpdateShardHandler HTTP client with params: socketTimeout=340000&connTimeout=45000&retry=true
   [junit4]   2> 1277302 INFO  (jetty-launcher-2292-thread-2) [    ] o.a.s.u.UpdateShardHandler Creating UpdateShardHandler HTTP client with params: socketTimeout=340000&connTimeout=45000&retry=true
   [junit4]   2> 1277302 INFO  (jetty-launcher-2292-thread-4) [    ] o.a.s.c.ZkContainer Zookeeper client=127.0.0.1:45663/solr
   [junit4]   2> 1277302 INFO  (jetty-launcher-2292-thread-2) [    ] o.a.s.c.ZkContainer Zookeeper client=127.0.0.1:45663/solr
   [junit4]   2> 1277305 WARN  (NIOServerCxn.Factory:0.0.0.0/0.0.0.0:0) [    ] o.a.z.s.NIOServerCnxn caught end of stream exception
   [junit4]   2> EndOfStreamException: Unable to read additional data from client sessionid 0x15c696e40df0006, likely client has closed socket
   [junit4]   2> 	at org.apache.zookeeper.server.NIOServerCnxn.doIO(NIOServerCnxn.java:239)
   [junit4]   2> 	at org.apache.zookeeper.server.NIOServerCnxnFactory.run(NIOServerCnxnFactory.java:203)
   [junit4]   2> 	at java.lang.Thread.run(Thread.java:748)
   [junit4]   2> 1277305 INFO  (jetty-launcher-2292-thread-3) [    ] o.a.s.u.UpdateShardHandler Creating UpdateShardHandler HTTP client with params: socketTimeout=340000&connTimeout=45000&retry=true
   [junit4]   2> 1277305 WARN  (NIOServerCxn.Factory:0.0.0.0/0.0.0.0:0) [    ] o.a.z.s.NIOServerCnxn caught end of stream exception
   [junit4]   2> EndOfStreamException: Unable to read additional data from client sessionid 0x15c696e40df0005, likely client has closed socket
   [junit4]   2> 	at org.apache.zookeeper.server.NIOServerCnxn.doIO(NIOServerCnxn.java:239)
   [junit4]   2> 	at org.apache.zookeeper.server.NIOServerCnxnFactory.run(NIOServerCnxnFactory.java:203)
   [junit4]   2> 	at java.lang.Thread.run(Thread.java:748)
   [junit4]   2> 1277305 INFO  (jetty-launcher-2292-thread-1) [    ] o.a.s.u.UpdateShardHandler Creating UpdateShardHandler HTTP client with params: socketTimeout=340000&connTimeout=45000&retry=true
   [junit4]   2> 1277305 INFO  (jetty-launcher-2292-thread-3) [    ] o.a.s.c.ZkContainer Zookeeper client=127.0.0.1:45663/solr
   [junit4]   2> 1277306 INFO  (jetty-launcher-2292-thread-1) [    ] o.a.s.c.ZkContainer Zookeeper client=127.0.0.1:45663/solr
   [junit4]   2> 1277311 INFO  (jetty-launcher-2292-thread-4) [n:127.0.0.1:38409_solr    ] o.a.s.c.Overseer Overseer (id=null) closing
   [junit4]   2> 1277311 INFO  (jetty-launcher-2292-thread-3) [n:127.0.0.1:38163_solr    ] o.a.s.c.Overseer Overseer (id=null) closing
   [junit4]   2> 1277311 INFO  (jetty-launcher-2292-thread-1) [n:127.0.0.1:40255_solr    ] o.a.s.c.Overseer Overseer (id=null) closing
   [junit4]   2> 1277311 INFO  (jetty-launcher-2292-thread-2) [n:127.0.0.1:36309_solr    ] o.a.s.c.Overseer Overseer (id=null) closing
   [junit4]   2> 1277311 INFO  (jetty-launcher-2292-thread-3) [n:127.0.0.1:38163_solr    ] o.a.s.c.OverseerElectionContext I am going to be the leader 127.0.0.1:38163_solr
   [junit4]   2> 1277311 INFO  (jetty-launcher-2292-thread-4) [n:127.0.0.1:38409_solr    ] o.a.s.c.ZkController Register node as live in ZooKeeper:/live_nodes/127.0.0.1:38409_solr
   [junit4]   2> 1277311 INFO  (jetty-launcher-2292-thread-2) [n:127.0.0.1:36309_solr    ] o.a.s.c.ZkController Register node as live in ZooKeeper:/live_nodes/127.0.0.1:36309_solr
   [junit4]   2> 1277311 INFO  (jetty-launcher-2292-thread-1) [n:127.0.0.1:40255_solr    ] o.a.s.c.ZkController Register node as live in ZooKeeper:/live_nodes/127.0.0.1:40255_solr
   [junit4]   2> 1277312 INFO  (jetty-launcher-2292-thread-3) [n:127.0.0.1:38163_solr    ] o.a.s.c.Overseer Overseer (id=98069214150983691-127.0.0.1:38163_solr-n_0000000000) starting
   [junit4]   2> 1277312 INFO  (zkCallback-2313-thread-1-processing-n:127.0.0.1:38163_solr) [n:127.0.0.1:38163_solr    ] o.a.s.c.c.ZkStateReader Updated live nodes from ZooKeeper... (0) -> (2)
   [junit4]   2> 1277312 INFO  (zkCallback-2305-thread-1-processing-n:127.0.0.1:36309_solr) [n:127.0.0.1:36309_solr    ] o.a.s.c.c.ZkStateReader Updated live nodes from ZooKeeper... (0) -> (2)
   [junit4]   2> 1277312 INFO  (zkCallback-2314-thread-1-processing-n:127.0.0.1:40255_solr) [n:127.0.0.1:40255_solr    ] o.a.s.c.c.ZkStateReader Updated live nodes from ZooKeeper... (0) -> (3)
   [junit4]   2> 1277312 INFO  (zkCallback-2309-thread-1-processing-n:127.0.0.1:38409_solr) [n:127.0.0.1:38409_solr    ] o.a.s.c.c.ZkStateReader Updated live nodes from ZooKeeper... (0) -> (3)
   [junit4]   2> 1277313 INFO  (zkCallback-2305-thread-2-processing-n:127.0.0.1:36309_solr) [n:127.0.0.1:36309_solr    ] o.a.s.c.c.ZkStateReader Updated live nodes from ZooKeeper... (2) -> (3)
   [junit4]   2> 1277313 INFO  (zkCallback-2313-thread-1-processing-n:127.0.0.1:38163_solr) [n:127.0.0.1:38163_solr    ] o.a.s.c.c.ZkStateReader Updated live nodes from ZooKeeper... (2) -> (3)
   [junit4]   2> 1277331 INFO  (jetty-launcher-2292-thread-3) [n:127.0.0.1:38163_solr    ] o.a.s.c.ZkController Register node as live in ZooKeeper:/live_nodes/127.0.0.1:38163_solr
   [junit4]   2> 1277332 INFO  (zkCallback-2313-thread-1-processing-n:127.0.0.1:38163_solr) [n:127.0.0.1:38163_solr    ] o.a.s.c.c.ZkStateReader Updated live nodes from ZooKeeper... (3) -> (4)
   [junit4]   2> 1277332 INFO  (zkCallback-2309-thread-1-processing-n:127.0.0.1:38409_solr) [n:127.0.0.1:38409_solr    ] o.a.s.c.c.ZkStateReader Updated live nodes from ZooKeeper... (3) -> (4)
   [junit4]   2> 1277332 INFO  (zkCallback-2305-thread-2-processing-n:127.0.0.1:36309_solr) [n:127.0.0.1:36309_solr    ] o.a.s.c.c.ZkStateReader Updated live nodes from ZooKeeper... (3) -> (4)
   [junit4]   2> 1277332 INFO  (zkCallback-2314-thread-1-processing-n:127.0.0.1:40255_solr) [n:127.0.0.1:40255_solr    ] o.a.s.c.c.ZkStateReader Updated live nodes from ZooKeeper... (3) -> (4)
   [junit4]   2> 1277347 INFO  (jetty-launcher-2292-thread-4) [n:127.0.0.1:38409_solr    ] o.a.s.c.CorePropertiesLocator Found 0 core definitions underneath /home/jenkins/workspace/Lucene-Solr-6.x-Linux/solr/build/solr-core/test/J0/temp/solr.cloud.TestStressCloudBlindAtomicUpdates_4BAFE8412879F788-001/tempDir-001/node4/.
   [junit4]   2> 1277347 INFO  (jetty-launcher-2292-thread-2) [n:127.0.0.1:36309_solr    ] o.a.s.c.CorePropertiesLocator Found 0 core definitions underneath /home/jenkins/workspace/Lucene-Solr-6.x-Linux/solr/build/solr-core/test/J0/temp/solr.cloud.TestStressCloudBlindAtomicUpdates_4BAFE8412879F788-001/tempDir-001/node2/.
   [junit4]   2> 1277356 INFO  (jetty-launcher-2292-thread-1) [n:127.0.0.1:40255_solr    ] o.a.s.c.CorePropertiesLocator Found 0 core definitions underneath /home/jenkins/workspace/Lucene-Solr-6.x-Linux/solr/build/solr-core/test/J0/temp/solr.cloud.TestStressCloudBlindAtomicUpdates_4BAFE8412879F788-001/tempDir-001/node1/.
   [junit4]   2> 1277385 INFO  (jetty-launcher-2292-thread-3) [n:127.0.0.1:38163_solr    ] o.a.s.c.CorePropertiesLocator Found 0 core definitions underneath /home/jenkins/workspace/Lucene-Solr-6.x-Linux/solr/build/solr-core/test/J0/temp/solr.cloud.TestStressCloudBlindAtomicUpdates_4BAFE8412879F788-001/tempDir-001/node3/.
   [junit4]   2> 1277391 INFO  (SUITE-TestStressCloudBlindAtomicUpdates-seed#[4BAFE8412879F788]-worker) [    ] o.a.s.c.c.ZkStateReader Updated live nodes from ZooKeeper... (0) -> (4)
   [junit4]   2> 1277392 INFO  (SUITE-TestStressCloudBlindAtomicUpdates-seed#[4BAFE8412879F788]-worker) [    ] o.a.s.c.s.i.ZkClientClusterStateProvider Cluster at 127.0.0.1:45663/solr ready
   [junit4]   2> 1277476 INFO  (qtp1394058215-13188) [n:127.0.0.1:38409_solr    ] o.a.s.h.a.CollectionsHandler Invoked Collection Action :create with params replicationFactor=2&property.config=solrconfig-tlog.xml&property.schema=schema-minimal-atomic-stress.xml&collection.configName=org.apache.solr.cloud.TestStressCloudBlindAtomicUpdates_config-set&name=test_col&action=CREATE&numShards=2&wt=javabin&version=2 and sendToOCPQueue=true
   [junit4]   2> 1277476 INFO  (OverseerThreadFactory-6353-thread-1-processing-n:127.0.0.1:38163_solr) [n:127.0.0.1:38163_solr    ] o.a.s.c.CreateCollectionCmd Create collection test_col
   [junit4]   2> 1277580 INFO  (qtp1394058215-13172) [n:127.0.0.1:38409_solr    ] o.a.s.h.a.CoreAdminOperation core create command property.config=solrconfig-tlog.xml&property.schema=schema-minimal-atomic-stress.xml&qt=/admin/cores&collection.configName=org.apache.solr.cloud.TestStressCloudBlindAtomicUpdates_config-set&newCollection=true&name=test_col_shard2_replica1&action=CREATE&numShards=2&collection=test_col&shard=shard2&wt=javabin&version=2
   [junit4]   2> 1277580 INFO  (qtp813092282-13189) [n:127.0.0.1:40255_solr    ] o.a.s.h.a.CoreAdminOperation core create command property.config=solrconfig-tlog.xml&property.schema=schema-minimal-atomic-stress.xml&qt=/admin/cores&collection.configName=org.apache.solr.cloud.TestStressCloudBlindAtomicUpdates_config-set&newCollection=true&name=test_col_shard1_replica1&action=CREATE&numShards=2&collection=test_col&shard=shard1&wt=javabin&version=2
   [junit4]   2> 1277580 INFO  (qtp1923014939-13184) [n:127.0.0.1:38163_solr    ] o.a.s.h.a.CoreAdminOperation core create command property.config=solrconfig-tlog.xml&property.schema=schema-minimal-atomic-stress.xml&qt=/admin/cores&collection.configName=org.apache.solr.cloud.TestStressCloudBlindAtomicUpdates_config-set&newCollection=true&name=test_col_shard2_replica2&action=CREATE&numShards=2&collection=test_col&shard=shard2&wt=javabin&version=2
   [junit4]   2> 1277580 INFO  (qtp599823787-13181) [n:127.0.0.1:36309_solr    ] o.a.s.h.a.CoreAdminOperation core create command property.config=solrconfig-tlog.xml&property.schema=schema-minimal-atomic-stress.xml&qt=/admin/cores&collection.configName=org.apache.solr.cloud.TestStressCloudBlindAtomicUpdates_config-set&newCollection=true&name=test_col_shard1_replica2&action=CREATE&numShards=2&collection=test_col&shard=shard1&wt=javabin&version=2
   [junit4]   2> 1277581 INFO  (qtp1394058215-13172) [n:127.0.0.1:38409_solr    ] o.a.s.c.TransientSolrCoreCacheDefault Allocating transient cache for 2147483647 transient cores
   [junit4]   2> 1277581 INFO  (qtp813092282-13189) [n:127.0.0.1:40255_solr    ] o.a.s.c.TransientSolrCoreCacheDefault Allocating transient cache for 2147483647 transient cores
   [junit4]   2> 1277581 INFO  (qtp1923014939-13184) [n:127.0.0.1:38163_solr    ] o.a.s.c.TransientSolrCoreCacheDefault Allocating transient cache for 2147483647 transient cores
   [junit4]   2> 1277581 INFO  (qtp599823787-13181) [n:127.0.0.1:36309_solr    ] o.a.s.c.TransientSolrCoreCacheDefault Allocating transient cache for 2147483647 transient cores
   [junit4]   2> 1277685 INFO  (zkCallback-2313-thread-2-processing-n:127.0.0.1:38163_solr) [n:127.0.0.1:38163_solr    ] o.a.s.c.c.ZkStateReader A cluster state change: [WatchedEvent state:SyncConnected type:NodeDataChanged path:/collections/test_col/state.json] for collection [test_col] has occurred - updating... (live nodes size: [4])
   [junit4]   2> 1277685 INFO  (zkCallback-2305-thread-2-processing-n:127.0.0.1:36309_solr) [n:127.0.0.1:36309_solr    ] o.a.s.c.c.ZkStateReader A cluster state change: [WatchedEvent state:SyncConnected type:NodeDataChanged path:/collections/test_col/state.json] for collection [test_col] has occurred - updating... (live nodes size: [4])
   [junit4]   2> 1277685 INFO  (zkCallback-2309-thread-1-processing-n:127.0.0.1:38409_solr) [n:127.0.0.1:38409_solr    ] o.a.s.c.c.ZkStateReader A cluster state change: [WatchedEvent state:SyncConnected type:NodeDataChanged path:/collections/test_col/state.json] for collection [test_col] has occurred - updating... (live nodes size: [4])
   [junit4]   2> 1277685 INFO  (zkCallback-2314-thread-1-processing-n:127.0.0.1:40255_solr) [n:127.0.0.1:40255_solr    ] o.a.s.c.c.ZkStateReader A cluster state change: [WatchedEvent state:SyncConnected type:NodeDataChanged path:/collections/test_col/state.json] for collection [test_col] has occurred - updating... (live nodes size: [4])
   [junit4]   2> 1278599 INFO  (qtp1394058215-13172) [n:127.0.0.1:38409_solr c:test_col s:shard2  x:test_col_shard2_replica1] o.a.s.c.SolrConfig Using Lucene MatchVersion: 6.7.0
   [junit4]   2> 1278600 INFO  (qtp813092282-13189) [n:127.0.0.1:40255_solr c:test_col s:shard1  x:test_col_shard1_replica1] o.a.s.c.SolrConfig Using Lucene MatchVersion: 6.7.0
   [junit4]   2> 1278601 INFO  (qtp1923014939-13184) [n:127.0.0.1:38163_solr c:test_col s:shard2  x:test_col_shard2_replica2] o.a.s.c.SolrConfig Using Lucene MatchVersion: 6.7.0
   [junit4]   2> 1278603 INFO  (qtp599823787-13181) [n:127.0.0.1:36309_solr c:test_col s:shard1  x:test_col_shard1_replica2] o.a.s.c.SolrConfig Using Lucene MatchVersion: 6.7.0
   [junit4]   2> 1278619 INFO  (qtp813092282-13189) [n:127.0.0.1:40255_solr c:test_col s:shard1  x:test_col_shard1_replica1] o.a.s.s.IndexSchema [test_col_shard1_replica1] Schema name=minimal-atomic-stress
   [junit4]   2> 1278621 INFO  (qtp813092282-13189) [n:127.0.0.1:40255_solr c:test_col s:shard1  x:test_col_shard1_replica1] o.a.s.s.IndexSchema Loaded schema minimal-atomic-stress/1.6 with uniqueid field id
   [junit4]   2> 1278621 INFO  (qtp813092282-13189) [n:127.0.0.1:40255_solr c:test_col s:shard1  x:test_col_shard1_replica1] o.a.s.c.CoreContainer Creating SolrCore 'test_col_shard1_replica1' using configuration from collection test_col, trusted=true
   [junit4]   2> 1278621 INFO  (qtp813092282-13189) [n:127.0.0.1:40255_solr c:test_col s:shard1  x:test_col_shard1_replica1] o.a.s.c.SolrCore solr.RecoveryStrategy.Builder
   [junit4]   2> 1278621 INFO  (qtp813092282-13189) [n:127.0.0.1:40255_solr c:test_col s:shard1  x:test_col_shard1_replica1] o.a.s.c.SolrCore [[test_col_shard1_replica1] ] Opening new SolrCore at [/home/jenkins/workspace/Lucene-Solr-6.x-Linux/solr/build/solr-core/test/J0/temp/solr.cloud.TestStressCloudBlindAtomicUpdates_4BAFE8412879F788-001/tempDir-001/node1/test_col_shard1_replica1], dataDir=[/home/jenkins/workspace/Lucene-Solr-6.x-Linux/solr/build/solr-core/test/J0/temp/solr.cloud.TestStressCloudBlindAtomicUpdates_4BAFE8412879F788-001/tempDir-001/node1/./test_col_shard1_replica1/data/]
   [junit4]   2> 1278622 INFO  (qtp813092282-13189) [n:127.0.0.1:40255_solr c:test_col s:shard1  x:test_col_shard1_replica1] o.a.s.c.JmxMonitoredMap JMX monitoring is enabled. Adding Solr mbeans to JMX Server: com.sun.jmx.mbeanserver.JmxMBeanServer@4a98223c
   [junit4]   2> 1278622 INFO  (qtp1394058215-13172) [n:127.0.0.1:38409_solr c:test_col s:shard2  x:test_col_shard2_replica1] o.a.s.s.IndexSchema [test_col_shard2_replica1] Schema name=minimal-atomic-stress
   [junit4]   2> 1278623 INFO  (qtp1923014939-13184) [n:127.0.0.1:38163_solr c:test_col s:shard2  x:test_col_shard2_replica2] o.a.s.s.IndexSchema [test_col_shard2_replica2] Schema name=minimal-atomic-stress
   [junit4]   2> 1278623 INFO  (qtp813092282-13189) [n:127.0.0.1:40255_solr c:test_col s:shard1  x:test_col_shard1_replica1] o.a.s.u.RandomMergePolicy RandomMergePolicy wrapping class org.apache.lucene.index.LogDocMergePolicy: [LogDocMergePolicy: minMergeSize=1000, mergeFactor=29, maxMergeSize=9223372036854775807, maxMergeSizeForForcedMerge=9223372036854775807, calibrateSizeByDeletes=true, maxMergeDocs=2147483647, maxCFSSegmentSizeMB=8.796093022207999E12, noCFSRatio=0.5939340685986021]
   [junit4]   2> 1278624 INFO  (qtp1394058215-13172) [n:127.0.0.1:38409_solr c:test_col s:shard2  x:test_col_shard2_replica1] o.a.s.s.IndexSchema Loaded schema minimal-atomic-stress/1.6 with uniqueid field id
   [junit4]   2> 1278624 INFO  (qtp1394058215-13172) [n:127.0.0.1:38409_solr c:test_col s:shard2  x:test_col_shard2_replica1] o.a.s.c.CoreContainer Creating SolrCore 'test_col_shard2_replica1' using configuration from collection test_col, trusted=true
   [junit4]   2> 1278624 INFO  (qtp1394058215-13172) [n:127.0.0.1:38409_solr c:test_col s:shard2  x:test_col_shard2_replica1] o.a.s.c.SolrCore solr.RecoveryStrategy.Builder
   [junit4]   2> 1278624 INFO  (qtp1923014939-13184) [n:127.0.0.1:38163_solr c:test_col s:shard2  x:test_col_shard2_replica2] o.a.s.s.IndexSchema Loaded schema minimal-atomic-stress/1.6 with uniqueid field id
   [junit4]   2> 1278624 INFO  (qtp1394058215-13172) [n:127.0.0.1:38409_solr c:test_col s:shard2  x:test_col_shard2_replica1] o.a.s.c.SolrCore [[test_col_shard2_replica1] ] Opening new SolrCore at [/home/jenkins/workspace/Lucene-Solr-6.x-Linux/solr/build/solr-core/test/J0/temp/solr.cloud.TestStressCloudBlindAtomicUpdates_4BAFE8412879F788-001/tempDir-001/node4/test_col_shard2_replica1], dataDir=[/home/jenkins/workspace/Lucene-Solr-6.x-Linux/solr/build/solr-core/test/J0/temp/solr.cloud.TestStressCloudBlindAtomicUpdates_4BAFE8412879F788-001/tempDir-001/node4/./test_col_shard2_replica1/data/]
   [junit4]   2> 1278624 INFO  (qtp1923014939-13184) [n:127.0.0.1:38163_solr c:test_col s:shard2  x:test_col_shard2_replica2] o.a.s.c.CoreContainer Creating SolrCore 'test_col_shard2_replica2' using configuration from collection test_col, trusted=true
   [junit4]   2> 1278625 INFO  (qtp1923014939-13184) [n:127.0.0.1:38163_solr c:test_col s:shard2  x:test_col_shard2_replica2] o.a.s.c.SolrCore solr.RecoveryStrategy.Builder
   [junit4]   2> 1278625 INFO  (qtp1394058215-13172) [n:127.0.0.1:38409_solr c:test_col s:shard2  x:test_col_shard2_replica1] o.a.s.c.JmxMonitoredMap JMX monitoring is enabled. Adding Solr mbeans to JMX Server: com.sun.jmx.mbeanserver.JmxMBeanServer@4a98223c
   [junit4]   2> 1278625 INFO  (qtp1923014939-13184) [n:127.0.0.1:38163_solr c:test_col s:shard2  x:test_col_shard2_replica2] o.a.s.c.SolrCore [[test_col_shard2_replica2] ] Opening new SolrCore at [/home/jenkins/workspace/Lucene-Solr-6.x-Linux/solr/build/solr-core/test/J0/temp/solr.cloud.TestStressCloudBlindAtomicUpdates_4BAFE8412879F788-001/tempDir-001/node3/test_col_shard2_replica2], dataDir=[/home/jenkins/workspace/Lucene-Solr-6.x-Linux/solr/build/solr-core/test/J0/temp/solr.cloud.TestStressCloudBlindAtomicUpdates_4BAFE8412879F788-001/tempDir-001/node3/./test_col_shard2_replica2/data/]
   [junit4]   2> 1278625 INFO  (qtp1923014939-13184) [n:127.0.0.1:38163_solr c:test_col s:shard2  x:test_col_shard2_replica2] o.a.s.c.JmxMonitoredMap JMX monitoring is enabled. Adding Solr mbeans to JMX Server: com.sun.jmx.mbeanserver.JmxMBeanServer@4a98223c
   [junit4]   2> 1278627 WARN  (qtp813092282-13189) [n:127.0.0.1:40255_solr c:test_col s:shard1  x:test_col_shard1_replica1] o.a.s.c.RequestHandlers INVALID paramSet a in requestHandler {type = requestHandler,name = /dump,class = DumpRequestHandler,attributes = {initParams=a, name=/dump, class=DumpRequestHandler},args = {defaults={a=A,b=B}}}
   [junit4]   2> 1278627 INFO  (qtp599823787-13181) [n:127.0.0.1:36309_solr c:test_col s:shard1  x:test_col_shard1_replica2] o.a.s.s.IndexSchema [test_col_shard1_replica2] Schema name=minimal-atomic-stress
   [junit4]   2> 1278628 INFO  (qtp599823787-13181) [n:127.0.0.1:36309_solr c:test_col s:shard1  x:test_col_shard1_replica2] o.a.s.s.IndexSchema Loaded schema minimal-atomic-stress/1.6 with uniqueid field id
   [junit4]   2> 1278628 INFO  (qtp599823787-13181) [n:127.0.0.1:36309_solr c:test_col s:shard1  x:test_col_shard1_replica2] o.a.s.c.CoreContainer Creating SolrCore 'test_col_shard1_replica2' using configuration from collection test_col, trusted=true
   [junit4]   2> 1278629 INFO  (qtp599823787-13181) [n:127.0.0.1:36309_solr c:test_col s:shard1  x:test_col_shard1_replica2] o.a.s.c.SolrCore solr.RecoveryStrategy.Builder
   [junit4]   2> 1278629 INFO  (qtp599823787-13181) [n:127.0.0.1:36309_solr c:test_col s:shard1  x:test_col_shard1_replica2] o.a.s.c.SolrCore [[test_col_shard1_replica2] ] Opening new SolrCore at [/home/jenkins/workspace/Lucene-Solr-6.x-Linux/solr/build/solr-core/test/J0/temp/solr.cloud.TestStressCloudBlindAtomicUpdates_4BAFE8412879F788-001/tempDir-001/node2/test_col_shard1_replica2], dataDir=[/home/jenkins/workspace/Lucene-Solr-6.x-Linux/solr/build/solr-core/test/J0/temp/solr.cloud.TestStressCloudBlindAtomicUpdates_4BAFE8412879F788-001/tempDir-001/node2/./test_col_shard1_replica2/data/]
   [junit4]   2> 1278629 INFO  (qtp1394058215-13172) [n:127.0.0.1:38409_solr c:test_col s:shard2  x:test_col_shard2_replica1] o.a.s.u.RandomMergePolicy RandomMergePolicy wrapping class org.apache.lucene.index.LogDocMergePolicy: [LogDocMergePolicy: minMergeSize=1000, mergeFactor=29, maxMergeSize=9223372036854775807, maxMergeSizeForForcedMerge=9223372036854775807, calibrateSizeByDeletes=true, maxMergeDocs=2147483647, maxCFSSegmentSizeMB=8.796093022207999E12, noCFSRatio=0.5939340685986021]
   [junit4]   2> 1278629 INFO  (qtp599823787-13181) [n:127.0.0.1:36309_solr c:test_col s:shard1  x:test_col_shard1_replica2] o.a.s.c.JmxMonitoredMap JMX monitoring is enabled. Adding Solr mbeans to JMX Server: com.sun.jmx.mbeanserver.JmxMBeanServer@4a98223c
   [junit4]   2> 1278630 INFO  (qtp1923014939-13184) [n:127.0.0.1:38163_solr c:test_col s:shard2  x:test_col_shard2_replica2] o.a.s.u.RandomMergePolicy RandomMergePolicy wrapping class org.apache.lucene.index.LogDocMergePolicy: [LogDocMergePolicy: minMergeSize=1000, mergeFactor=29, maxMergeSize=9223372036854775807, maxMergeSizeForForcedMerge=9223372036854775807, calibrateSizeByDeletes=true, maxMergeDocs=2147483647, maxCFSSegmentSizeMB=8.796093022207999E12, noCFSRatio=0.5939340685986021]
   [junit4]   2> 1278630 INFO  (qtp599823787-13181) [n:127.0.0.1:36309_solr c:test_col s:shard1  x:test_col_shard1_replica2] o.a.s.u.RandomMergePolicy RandomMergePolicy wrapping class org.apache.lucene.index.LogDocMergePolicy: [LogDocMergePolicy: minMergeSize=1000, mergeFactor=29, maxMergeSize=9223372036854775807, maxMergeSizeForForcedMerge=9223372036854775807, calibrateSizeByDeletes=true, maxMergeDocs=2147483647, maxCFSSegmentSizeMB=8.796093022207999E12, noCFSRatio=0.5939340685986021]
   [junit4]   2> 1278636 WARN  (qtp1394058215-13172) [n:127.0.0.1:38409_solr c:test_col s:shard2  x:test_col_shard2_replica1] o.a.s.c.RequestHandlers INVALID paramSet a in requestHandler {type = requestHandler,name = /dump,class = DumpRequestHandler,attributes = {initParams=a, name=/dump, class=DumpRequestHandler},args = {defaults={a=A,b=B}}}
   [junit4]   2> 1278636 WARN  (qtp599823787-13181) [n:127.0.0.1:36309_solr c:test_col s:shard1  x:test_col_shard1_replica2] o.a.s.c.RequestHandlers INVALID paramSet a in requestHandler {type = requestHandler,name = /dump,class = DumpRequestHandler,attributes = {initParams=a, name=/dump, class=DumpRequestHandler},args = {defaults={a=A,b=B}}}
   [junit4]   2> 1278637 WARN  (qtp1923014939-13184) [n:127.0.0.1:38163_solr c:test_col s:shard2  x:test_col_shard2_replica2] o.a.s.c.RequestHandlers INVALID paramSet a in requestHandler {type = requestHandler,name = /dump,class = DumpRequestHandler,attributes = {initParams=a, name=/dump, class=DumpRequestHandler},args = {defaults={a=A,b=B}}}
   [junit4]   2> 1278649 INFO  (qtp813092282-13189) [n:127.0.0.1:40255_solr c:test_col s:shard1  x:test_col_shard1_replica1] o.a.s.u.UpdateHandler Using UpdateLog implementation: org.apache.solr.update.UpdateLog
   [junit4]   2> 1278649 INFO  (qtp813092282-13189) [n:127.0.0.1:40255_solr c:test_col s:shard1  x:test_col_shard1_replica1] o.a.s.u.UpdateLog Initializing UpdateLog: dataDir= defaultSyncLevel=FLUSH numRecordsToKeep=100 maxNumLogsToKeep=10 numVersionBuckets=65536
   [junit4]   2> 1278650 INFO  (qtp813092282-13189) [n:127.0.0.1:40255_solr c:test_col s:shard1  x:test_col_shard1_replica1] o.a.s.u.CommitTracker Hard AutoCommit: disabled
   [junit4]   2> 1278650 INFO  (qtp813092282-13189) [n:127.0.0.1:40255_solr c:test_col s:shard1  x:test_col_shard1_replica1] o.a.s.u.CommitTracker Soft AutoCommit: disabled
   [junit4]   2> 1278651 INFO  (qtp813092282-13189) [n:127.0.0.1:40255_solr c:test_col s:shard1  x:test_col_shard1_replica1] o.a.s.u.RandomMergePolicy RandomMergePolicy wrapping class org.apache.lucene.index.TieredMergePolicy: [TieredMergePolicy: maxMergeAtOnce=34, maxMergeAtOnceExplicit=18, maxMergedSegmentMB=58.0234375, floorSegmentMB=2.1220703125, forceMergeDeletesPctAllowed=14.42570622883699, segmentsPerTier=35.0, maxCFSSegmentSizeMB=8.796093022207999E12, noCFSRatio=1.0
   [junit4]   2> 1278651 INFO  (qtp813092282-13189) [n:127.0.0.1:40255_solr c:test_col s:shard1  x:test_col_shard1_replica1] o.a.s.s.SolrIndexSearcher Opening [Searcher@2a3a4662[test_col_shard1_replica1] main]
   [junit4]   2> 1278651 INFO  (qtp813092282-13189) [n:127.0.0.1:40255_solr c:test_col s:shard1  x:test_col_shard1_replica1] o.a.s.r.ManagedResourceStorage Configured ZooKeeperStorageIO with znodeBase: /configs/org.apache.solr.cloud.TestStressCloudBlindAtomicUpdates_config-set
   [junit4]   2> 1278652 INFO  (qtp813092282-13189) [n:127.0.0.1:40255_solr c:test_col s:shard1  x:test_col_shard1_replica1] o.a.s.r.ManagedResourceStorage Loaded null at path _rest_managed.json using ZooKeeperStorageIO:path=/configs/org.apache.solr.cloud.TestStressCloudBlindAtomicUpdates_config-set
   [junit4]   2> 1278652 INFO  (qtp813092282-13189) [n:127.0.0.1:40255_solr c:test_col s:shard1  x:test_col_shard1_replica1] o.a.s.h.ReplicationHandler Commits will be reserved for  10000
   [junit4]   2> 1278652 INFO  (qtp813092282-13189) [n:127.0.0.1:40255_solr c:test_col s:shard1  x:test_col_shard1_replica1] o.a.s.u.UpdateLog Could not find max version in index or recent updates, using new clock 1569107427980214272
   [junit4]   2> 1278664 INFO  (searcherExecutor-6362-thread-1-processing-n:127.0.0.1:40255_solr x:test_col_shard1_replica1 s:shard1 c:test_col) [n:127.0.0.1:40255_solr c:test_col s:shard1  x:test_col_shard1_replica1] o.a.s.c.SolrCore [test_col_shard1_replica1] Registered new searcher Searcher@2a3a4662[test_col_shard1_replica1] main{ExitableDirectoryReader(UninvertingDirectoryReader())}
   [junit4]   2> 1278666 INFO  (qtp813092282-13189) [n:127.0.0.1:40255_solr c:test_col s:shard1  x:test_col_shard1_replica1] o.a.s.c.ShardLeaderElectionContext Waiting until we see more replicas up for shard shard1: total=2 found=1 timeoutin=9999ms
   [junit4]   2> 1278673 INFO  (qtp1923014939-13184) [n:127.0.0.1:38163_solr c:test_col s:shard2  x:test_col_shard2_replica2] o.a.s.u.UpdateHandler Using UpdateLog implementation: org.apache.solr.update.UpdateLog
   [junit4]   2> 1278673 INFO  (qtp1923014939-13184) [n:127.0.0.1:38163_solr c:test_col s:shard2  x:test_col_shard2_replica2] o.a.s.u.UpdateLog Initializing UpdateLog: dataDir= defaultSyncLevel=FLUSH numRecordsToKeep=100 maxNumLogsToKeep=10 numVersionBuckets=65536
   [junit4]   2> 1278674 INFO  (qtp1923014939-13184) [n:127.0.0.1:38163_solr c:test_col s:shard2  x:test_col_shard2_replica2] o.a.s.u.CommitTracker Hard AutoCommit: disabled
   [junit4]   2> 1278674 INFO  (qtp1394058215-13172) [n:127.0.0.1:38409_solr c:test_col s:shard2  x:test_col_shard2_replica1] o.a.s.u.UpdateHandler Using UpdateLog implementation: org.apache.solr.update.UpdateLog
   [junit4]   2> 1278674 INFO  (qtp1923014939-13184) [n:127.0.0.1:38163_solr c:test_col s:shard2  x:test_col_shard2_replica2] o.a.s.u.CommitTracker Soft AutoCommit: disabled
   [junit4]   2> 1278674 INFO  (qtp1394058215-13172) [n:127.0.0.1:38409_solr c:test_col s:shard2  x:test_col_shard2_replica1] o.a.s.u.UpdateLog Initializing UpdateLog: dataDir= defaultSyncLevel=FLUSH numRecordsToKeep=100 maxNumLogsToKeep=10 numVersionBuckets=65536
   [junit4]   2> 1278674 INFO  (qtp599823787-13181) [n:127.0.0.1:36309_solr c:test_col s:shard1  x:test_col_shard1_replica2] o.a.s.u.UpdateHandler Using UpdateLog implementation: org.apache.solr.update.UpdateLog
   [junit4]   2> 1278674 INFO  (qtp599823787-13181) [n:127.0.0.1:36309_solr c:test_col s:shard1  x:test_col_shard1_replica2] o.a.s.u.UpdateLog Initializing UpdateLog: dataDir= defaultSyncLevel=FLUSH numRecordsToKeep=100 maxNumLogsToKeep=10 numVersionBuckets=65536
   [junit4]   2> 1278674 INFO  (qtp1923014939-13184) [n:127.0.0.1:38163_solr c:test_col s:shard2  x:test_col_shard2_replica2] o.a.s.u.RandomMergePolicy RandomMergePolicy wrapping class org.apache.lucene.index.TieredMergePolicy: [TieredMergePolicy: maxMergeAtOnce=34, maxMergeAtOnceExplicit=18, maxMergedSegmentMB=58.0234375, floorSegmentMB=2.1220703125, forceMergeDeletesPctAllowed=14.42570622883699, segmentsPerTier=35.0, maxCFSSegmentSizeMB=8.796093022207999E12, noCFSRatio=1.0
   [junit4]   2> 1278675 INFO  (qtp1923014939-13184) [n:127.0.0.1:38163_solr c:test_col s:shard2  x:test_col_shard2_replica2] o.a.s.s.SolrIndexSearcher Opening [Searcher@f6cd57[test_col_shard2_replica2] main]
   [junit4]   2> 1278675 INFO  (qtp1394058215-13172) [n:127.0.0.1:38409_solr c:test_col s:shard2  x:test_col_shard2_replica1] o.a.s.u.CommitTracker Hard AutoCommit: disabled
   [junit4]   2> 1278675 INFO  (qtp1394058215-13172) [n:127.0.0.1:38409_solr c:test_col s:shard2  x:test_col_shard2_replica1] o.a.s.u.CommitTracker Soft AutoCommit: disabled
   [junit4]   2> 1278675 INFO  (qtp599823787-13181) [n:127.0.0.1:36309_solr c:test_col s:shard1  x:test_col_shard1_replica2] o.a.s.u.CommitTracker Hard AutoCommit: disabled
   [junit4]   2> 1278675 INFO  (qtp599823787-13181) [n:127.0.0.1:36309_solr c:test_col s:shard1  x:test_col_shard1_replica2] o.a.s.u.CommitTracker Soft AutoCommit: disabled
   [junit4]   2> 1278675 INFO  (qtp1923014939-13184) [n:127.0.0.1:38163_solr c:test_col s:shard2  x:test_col_shard2_replica2] o.a.s.r.ManagedResourceStorage Configured ZooKeeperStorageIO with znodeBase: /configs/org.apache.solr.cloud.TestStressCloudBlindAtomicUpdates_config-set
   [junit4]   2> 1278675 INFO  (qtp1394058215-13172) [n:127.0.0.1:38409_solr c:test_col s:shard2  x:test_col_shard2_replica1] o.a.s.u.RandomMergePolicy RandomMergePolicy wrapping class org.apache.lucene.index.TieredMergePolicy: [TieredMergePolicy: maxMergeAtOnce=34, maxMergeAtOnceExplicit=18, maxMergedSegmentMB=58.0234375, floorSegmentMB=2.1220703125, forceMergeDeletesPctAllowed=14.42570622883699, segmentsPerTier=35.0, maxCFSSegmentSizeMB=8.796093022207999E12, noCFSRatio=1.0
   [junit4]   2> 1278675 INFO  (qtp1394058215-13172) [n:127.0.0.1:38409_solr c:test_col s:shard2  x:test_col_shard2_replica1] o.a.s.s.SolrIndexSearcher Opening [Searcher@4a4ae40a[test_col_shard2_replica1] main]
   [junit4]   2> 1278676 INFO  (qtp1923014939-13184) [n:127.0.0.1:38163_solr c:test_col s:shard2  x:test_col_shard2_replica2] o.a.s.r.ManagedResourceStorage Loaded null at path _rest_managed.json using ZooKeeperStorageIO:path=/configs/org.apache.solr.cloud.TestStressCloudBlindAtomicUpdates_config-set
   [junit4]   2> 1278676 INFO  (qtp599823787-13181) [n:127.0.0.1:36309_solr c:test_col s:shard1  x:test_col_shard1_replica2] o.a.s.u.RandomMergePolicy RandomMergePolicy wrapping class org.apache.lucene.index.TieredMergePolicy: [TieredMergePolicy: maxMergeAtOnce=34, maxMergeAtOnceExplicit=18, maxMergedSegmentMB=58.0234375, floorSegmentMB=2.1220703125, forceMergeDeletesPctAllowed=14.42570622883699, segmentsPerTier=35.0, maxCFSSegmentSizeMB=8.796093022207999E12, noCFSRatio=1.0
   [junit4]   2> 1278676 INFO  (qtp1923014939-13184) [n:127.0.0.1:38163_solr c:test_col s:shard2  x:test_col_shard2_replica2] o.a.s.h.ReplicationHandler Commits will be reserved for  10000
   [junit4]   2> 1278676 INFO  (qtp599823787-13181) [n:127.0.0.1:36309_solr c:test_col s:shard1  x:test_col_shard1_replica2] o.a.s.s.SolrIndexSearcher Opening [Searcher@3e9a7318[test_col_shard1_replica2] main]
   [junit4]   2> 1278676 INFO  (searcherExecutor-6364-thread-1-processing-n:127.0.0.1:38163_solr x:test_col_shard2_replica2 s:shard2 c:test_col) [n:127.0.0.1:38163_solr c:test_col s:shard2  x:test_col_shard2_replica2] o.a.s.c.SolrCore [test_col_shard2_replica2] Registered new searcher Searcher@f6cd57[test_col_shard2_replica2] main{ExitableDirectoryReader(UninvertingDirectoryReader())}
   [junit4]   2> 1278677 INFO  (qtp1923014939-13184) [n:127.0.0.1:38163_solr c:test_col s:shard2  x:test_col_shard2_replica2] o.a.s.u.UpdateLog Could not find max version in index or recent updates, using new clock 1569107428006428672
   [junit4]   2> 1278677 INFO  (qtp599823787-13181) [n:127.0.0.1:36309_solr c:test_col s:shard1  x:test_col_shard1_replica2] o.a.s.r.ManagedResourceStorage Configured ZooKeeperStorageIO with znodeBase: /configs/org.apache.solr.cloud.TestStressCloudBlindAtomicUpdates_config-set
   [junit4]   2> 1278677 INFO  (qtp1394058215-13172) [n:127.0.0.1:38409_solr c:test_col s:shard2  x:test_col_shard2_replica1] o.a.s.r.ManagedResourceStorage Configured ZooKeeperStorageIO with znodeBase: /configs/org.apache.solr.cloud.TestStressCloudBlindAtomicUpdates_config-set
   [junit4]   2> 1278677 INFO  (qtp599823787-13181) [n:127.0.0.1:36309_solr c:test_col s:shard1  x:test_col_shard1_replica2] o.a.s.r.ManagedResourceStorage Loaded null at path _rest_managed.json using ZooKeeperStorageIO:path=/configs/org.apache.solr.cloud.TestStressCloudBlindAtomicUpdates_config-set
   [junit4]   2> 1278677 INFO  (qtp1394058215-13172) [n:127.0.0.1:38409_solr c:test_col s:shard2  x:test_col_shard2_replica1] o.a.s.r.ManagedResourceStorage Loaded null at path _rest_managed.json using ZooKeeperStorageIO:path=/configs/org.apache.solr.cloud.TestStressCloudBlindAtomicUpdates_config-set
   [junit4]   2> 1278677 INFO  (qtp599823787-13181) [n:127.0.0.1:36309_solr c:test_col s:shard1  x:test_col_shard1_replica2] o.a.s.h.ReplicationHandler Commits will be reserved for  10000
   [junit4]   2> 1278677 INFO  (qtp1394058215-13172) [n:127.0.0.1:38409_solr c:test_col s:shard2  x:test_col_shard2_replica1] o.a.s.h.ReplicationHandler Commits will be reserved for  10000
   [junit4]   2> 1278678 INFO  (searcherExecutor-6365-thread-1-processing-n:127.0.0.1:36309_solr x:test_col_shard1_replica2 s:shard1 c:test_col) [n:127.0.0.1:36309_solr c:test_col s:shard1  x:test_col_shard1_replica2] o.a.s.c.SolrCore [test_col_shard1_replica2] Registered new searcher Searcher@3e9a7318[test_col_shard1_replica2] main{ExitableDirectoryReader(UninvertingDirectoryReader())}
   [junit4]   2> 1278678 INFO  (searcherExecutor-6363-thread-1-processing-n:127.0.0.1:38409_solr x:test_col_shard2_replica1 s:shard2 c:test_col) [n:127.0.0.1:38409_solr c:test_col s:shard2  x:test_col_shard2_replica1] o.a.s.c.SolrCore [test_col_shard2_replica1] Registered new searcher Searcher@4a4ae40a[test_col_shard2_replica1] main{ExitableDirectoryReader(UninvertingDirectoryReader())}
   [junit4]   2> 1278678 INFO  (qtp599823787-13181) [n:127.0.0.1:36309_solr c:test_col s:shard1  x:test_col_shard1_replica2] o.a.s.u.UpdateLog Could not find max version in index or recent updates, using new clock 1569107428007477248
   [junit4]   2> 1278678 INFO  (qtp1394058215-13172) [n:127.0.0.1:38409_solr c:test_col s:shard2  x:test_col_shard2_replica1] o.a.s.u.UpdateLog Could not find max version in index or recent updates, using new clock 1569107428007477248
   [junit4]   2> 1278679 INFO  (qtp1923014939-13184) [n:127.0.0.1:38163_solr c:test_col s:shard2  x:test_col_shard2_replica2] o.a.s.c.ShardLeaderElectionContext Waiting until we see more replicas up for shard shard2: total=2 found=1 timeoutin=9999ms
   [junit4]   2> 1278781 INFO  (zkCallback-2309-thread-1-processing-n:127.0.0.1:38409_solr) [n:127.0.0.1:38409_solr    ] o.a.s.c.c.ZkStateReader A cluster state change: [WatchedEvent state:SyncConnected type:NodeDataChanged path:/collections/test_col/state.json] for collection [test_col] has occurred - updating... (live nodes size: [4])
   [junit4]   2> 1278781 INFO  (zkCallback-2314-thread-1-processing-n:127.0.0.1:40255_solr) [n:127.0.0.1:40255_solr    ] o.a.s.c.c.ZkStateReader A cluster state change: [WatchedEvent state:SyncConnected type:NodeDataChanged path:/collections/test_col/state.json] for collection [test_col] has occurred - updating... (live nodes size: [4])
   [junit4]   2> 1278781 INFO  (zkCallback-2305-thread-2-processing-n:127.0.0.1:36309_solr) [n:127.0.0.1:36309_solr    ] o.a.s.c.c.ZkStateReader A cluster state change: [WatchedEvent state:SyncConnected type:NodeDataChanged path:/collections/test_col/state.json] for collection [test_col] has occurred - updating... (live nodes size: [4])
   [junit4]   2> 1278781 INFO  (zkCallback-2313-thread-2-processing-n:127.0.0.1:38163_solr) [n:127.0.0.1:38163_solr    ] o.a.s.c.c.ZkStateReader A cluster state change: [WatchedEvent state:SyncConnected type:NodeDataChanged path:/collections/test_col/state.json] for collection [test_col] has occurred - updating... (live nodes size: [4])
   [junit4]   2> 1279166 INFO  (qtp813092282-13189) [n:127.0.0.1:40255_solr c:test_col s:shard1  x:test_col_shard1_replica1] o.a.s.c.ShardLeaderElectionContext Enough replicas found to continue.
   [junit4]   2> 1279166 INFO  (qtp813092282-13189) [n:127.0.0.1:40255_solr c:test_col s:shard1  x:test_col_shard1_replica1] o.a.s.c.ShardLeaderElectionContext I may be the new leader - try and sync
   [junit4]   2> 1279166 INFO  (qtp813092282-13189) [n:127.0.0.1:40255_solr c:test_col s:shard1  x:test_col_shard1_replica1] o.a.s.c.SyncStrategy Sync replicas to http://127.0.0.1:40255/solr/test_col_shard1_replica1/
   [junit4]   2> 1279166 INFO  (qtp813092282-13189) [n:127.0.0.1:40255_solr c:test_col s:shard1  x:test_col_shard1_replica1] o.a.s.u.PeerSync PeerSync: core=test_col_shard1_replica1 url=http://127.0.0.1:40255/solr START replicas=[http://127.0.0.1:36309/solr/test_col_shard1_replica2/] nUpdates=100
   [junit4]   2> 1279166 INFO  (qtp813092282-13189) [n:127.0.0.1:40255_solr c:test_col s:shard1  x:test_col_shard1_replica1] o.a.s.u.PeerSync PeerSync: core=test_col_shard1_replica1 url=http://127.0.0.1:40255/solr DONE.  We have no versions.  sync failed.
   [junit4]   2> 1279167 INFO  (qtp599823787-13190) [n:127.0.0.1:36309_solr c:test_col s:shard1 r:core_node4 x:test_col_shard1_replica2] o.a.s.c.S.Request [test_col_shard1_replica2]  webapp=/solr path=/get params={distrib=false&qt=/get&fingerprint=false&getVersions=100&wt=javabin&version=2} status=0 QTime=0
   [junit4]   2> 1279167 INFO  (qtp813092282-13189) [n:127.0.0.1:40255_solr c:test_col s:shard1  x:test_col_shard1_replica1] o.a.s.c.SyncStrategy Leader's attempt to sync with shard failed, moving to the next candidate
   [junit4]   2> 1279167 INFO  (qtp813092282-13189) [n:127.0.0.1:40255_solr c:test_col s:shard1  x:test_col_shard1_replica1] o.a.s.c.ShardLeaderElectionContext We failed sync, but we have no versions - we can't sync in that case - we were active before, so become leader anyway
   [junit4]   2> 1279167 INFO  (qtp813092282-13189) [n:127.0.0.1:40255_solr c:test_col s:shard1  x:test_col_shard1_replica1] o.a.s.c.ShardLeaderElectionContext Found all replicas participating in election, clear LIR
   [junit4]   2> 1279169 INFO  (qtp813092282-13189) [n:127.0.0.1:40255_solr c:test_col s:shard1  x:test_col_shard1_replica1] o.a.s.c.ShardLeaderElectionContext I am the new leader: http://127.0.0.1:40255/solr/test_col_shard1_replica1/ shard1
   [junit4]   2> 1279180 INFO  (qtp1923014939-13184) [n:127.0.0.1:38163_solr c:test_col s:shard2  x:test_col_shard2_replica2] o.a.s.c.ShardLeaderElectionContext Enough replicas found to continue.
   [junit4]   2> 1279180 INFO  (qtp1923014939-13184) [n:127.0.0.1:38163_solr c:test_col s:shard2  x:test_col_shard2_replica2] o.a.s.c.ShardLeaderElectionContext I may be the new leader - try and sync
   [junit4]   2> 1279180 INFO  (qtp1923014939-13184) [n:127.0.0.1:38163_solr c:test_col s:shard2  x:test_col_shard2_replica2] o.a.s.c.SyncStrategy Sync replicas to http://127.0.0.1:38163/solr/test_col_shard2_replica2/
   [junit4]   2> 1279180 INFO  (qtp1923014939-13184) [n:127.0.0.1:38163_solr c:test_col s:shard2  x:test_col_shard2_replica2] o.a.s.u.PeerSync PeerSync: core=test_col_shard2_replica2 url=http://127.0.0.1:38163/solr START replicas=[http://127.0.0.1:38409/solr/test_col_shard2_replica1/] nUpdates=100
   [junit4]   2> 1279180 INFO  (qtp1923014939-13184) [n:127.0.0.1:38163_solr c:test_col s:shard2  x:test_col_shard2_replica2] o.a.s.u.PeerSync PeerSync: core=test_col_shard2_replica2 url=http://127.0.0.1:38163/solr DONE.  We have no versions.  sync failed.
   [junit4]   2> 1279181 INFO  (qtp1394058215-13173) [n:127.0.0.1:38409_solr c:test_col s:shard2 r:core_node3 x:test_col_shard2_replica1] o.a.s.c.S.Request [test_col_shard2_replica1]  webapp=/solr path=/get params={distrib=false&qt=/get&fingerprint=false&getVersions=100&wt=javabin&version=2} status=0 QTime=0
   [junit4]   2> 1279181 INFO  (qtp1923014939-13184) [n:127.0.0.1:38163_solr c:test_col s:shard2  x:test_col_shard2_replica2] o.a.s.c.SyncStrategy Leader's attempt to sync with shard failed, moving to the next candidate
   [junit4]   2> 1279181 INFO  (qtp1923014939-13184) [n:127.0.0.1:38163_solr c:test_col s:shard2  x:test_col_shard2_replica2] o.a.s.c.ShardLeaderElectionContext We failed sync, but we have no versions - we can't sync in that case - we were active before, so become leader anyway
   [junit4]   2> 1279181 INFO  (qtp1923014939-13184) [n:127.0.0.1:38163_solr c:test_col s:shard2  x:test_col_shard2_replica2] o.a.s.c.ShardLeaderElectionContext Found all replicas participating in election, clear LIR
   [junit4]   2> 1279183 INFO  (qtp1923014939-13184) [n:127.0.0.1:38163_solr c:test_col s:shard2  x:test_col_shard2_replica2] o.a.s.c.ShardLeaderElectionContext I am the new leader: http://127.0.0.1:38163/solr/test_col_shard2_replica2/ shard2
   [junit4]   2> 1279284 INFO  (zkCallback-2309-thread-1-processing-n:127.0.0.1:38409_solr) [n:127.0.0.1:38409_solr    ] o.a.s.c.c.ZkStateReader A cluster state change: [WatchedEvent state:SyncConnected type:NodeDataChanged path:/collections/test_col/state.json] for collection [test_col] has occurred - updating... (live nodes size: [4])
   [junit4]   2> 1279284 INFO  (zkCallback-2313-thread-2-processing-n:127.0.0.1:38163_solr) [n:127.0.0.1:38163_solr    ] o.a.s.c.c.ZkStateReader A cluster state change: [WatchedEvent state:SyncConnected type:NodeDataChanged path:/collections/test_col/state.json] for collection [test_col] has occurred - updating... (live nodes size: [4])
   [junit4]   2> 1279284 INFO  (zkCallback-2305-thread-2-processing-n:127.0.0.1:36309_solr) [n:127.0.0.1:36309_solr    ] o.a.s.c.c.ZkStateReader A cluster state change: [WatchedEvent state:SyncConnected type:NodeDataChanged path:/collections/test_col/state.json] for collection [test_col] has occurred - updating... (live nodes size: [4])
   [junit4]   2> 1279284 INFO  (zkCallback-2314-thread-1-processing-n:127.0.0.1:40255_solr) [n:127.0.0.1:40255_solr    ] o.a.s.c.c.ZkStateReader A cluster state change: [WatchedEvent state:SyncConnected type:NodeDataChanged path:/collections/test_col/state.json] for collection [test_col] has occurred - updating... (live nodes size: [4])
   [junit4]   2> 1279320 INFO  (qtp813092282-13189) [n:127.0.0.1:40255_solr c:test_col s:shard1  x:test_col_shard1_replica1] o.a.s.c.ZkController I am the leader, no recovery necessary
   [junit4]   2> 1279321 INFO  (qtp813092282-13189) [n:127.0.0.1:40255_solr c:test_col s:shard1  x:test_col_shard1_replica1] o.a.s.s.HttpSolrCall [admin] webapp=null path=/admin/cores params={property.config=solrconfig-tlog.xml&property.schema=schema-minimal-atomic-stress.xml&qt=/admin/cores&collection.configName=org.apache.solr.cloud.TestStressCloudBlindAtomicUpdates_config-set&newCollection=true&name=test_col_shard1_replica1&action=CREATE&numShards=2&collection=test_col&shard=shard1&wt=javabin&version=2} status=0 QTime=1740
   [junit4]   2> 1279333 INFO  (qtp1923014939-13184) [n:127.0.0.1:38163_solr c:test_col s:shard2  x:test_col_shard2_replica2] o.a.s.c.ZkController I am the leader, no recovery necessary
   [junit4]   2> 1279334 INFO  (qtp1923014939-13184) [n:127.0.0.1:38163_solr c:test_col s:shard2  x:test_col_shard2_replica2] o.a.s.s.HttpSolrCall [admin] webapp=null path=/admin/cores params={property.config=solrconfig-tlog.xml&property.schema=schema-minimal-atomic-stress.xml&qt=/admin/cores&collection.configName=org.apache.solr.cloud.TestStressCloudBlindAtomicUpdates_config-set&newCollection=true&name=test_col_shard2_replica2&action=CREATE&numShards=2&collection=test_col&shard=shard2&wt=javabin&version=2} status=0 QTime=1753
   [junit4]   2> 1279435 INFO  (zkCallback-2309-thread-1-processing-n:127.0.0.1:38409_solr) [n:127.0.0.1:38409_solr    ] o.a.s.c.c.ZkStateReader A cluster state change: [WatchedEvent state:SyncConnected type:NodeDataChanged path:/collections/test_col/state.json] for collection [test_col] has occurred - updating... (live nodes size: [4])
   [junit4]   2> 1279435 INFO  (zkCallback-2313-thread-2-processing-n:127.0.0.1:38163_solr) [n:127.0.0.1:38163_solr    ] o.a.s.c.c.ZkStateReader A cluster state change: [WatchedEvent state:SyncConnected type:NodeDataChanged path:/collections/test_col/state.json] for collection [test_col] has occurred - updating... (live nodes size: [4])
   [junit4]   2> 1279435 INFO  (zkCallback-2305-thread-2-processing-n:127.0.0.1:36309_solr) [n:127.0.0.1:36309_solr    ] o.a.s.c.c.ZkStateReader A cluster state change: [WatchedEvent state:SyncConnected type:NodeDataChanged path:/collections/test_col/state.json] for collection [test_col] has occurred - updating... (live nodes size: [4])
   [junit4]   2> 1279435 INFO  (zkCallback-2314-thread-1-processing-n:127.0.0.1:40255_solr) [n:127.0.0.1:40255_solr    ] o.a.s.c.c.ZkStateReader A cluster state change: [WatchedEvent state:SyncConnected type:NodeDataChanged path:/collections/test_col/state.json] for collection [test_col] has occurred - updating... (live nodes size: [4])
   [junit4]   2> 1279682 INFO  (qtp599823787-13181) [n:127.0.0.1:36309_solr c:test_col s:shard1  x:test_col_shard1_replica2] o.a.s.s.HttpSolrCall [admin] webapp=null path=/admin/cores params={property.config=solrconfig-tlog.xml&property.schema=schema-minimal-atomic-stress.xml&qt=/admin/cores&collection.configName=org.apache.solr.cloud.TestStressCloudBlindAtomicUpdates_config-set&newCollection=true&name=test_col_shard1_replica2&action=CREATE&numShards=2&collection=test_col&shard=shard1&wt=javabin&version=2} status=0 QTime=2101
   [junit4]   2> 1279682 INFO  (qtp1394058215-13172) [n:127.0.0.1:38409_solr c:test_col s:shard2  x:test_col_shard2_replica1] o.a.s.s.HttpSolrCall [admin] webapp=null path=/admin/cores params={property.config=solrconfig-tlog.xml&property.schema=schema-minimal-atomic-stress.xml&qt=/admin/cores&collection.configName=org.apache.solr.cloud.TestStressCloudBlindAtomicUpdates_config-set&newCollection=true&name=test_col_shard2_replica1&action=CREATE&numShards=2&collection=test_col&shard=shard2&wt=javabin&version=2} status=0 QTime=2101
   [junit4]   2> 1279683 INFO  (qtp1394058215-13188) [n:127.0.0.1:38409_solr    ] o.a.s.h.a.CollectionsHandler Wait for new collection to be active for at most 30 seconds. Check all shard replicas
   [junit4]   2> 1279783 INFO  (zkCallback-2305-thread-2-processing-n:127.0.0.1:36309_solr) [n:127.0.0.1:36309_solr    ] o.a.s.c.c.ZkStateReader A cluster state change: [WatchedEvent state:SyncConnected type:NodeDataChanged path:/collections/test_col/state.json] for collection [test_col] has occurred - updating... (live nodes size: [4])
   [junit4]   2> 1279783 INFO  (zkCallback-2313-thread-2-processing-n:127.0.0.1:38163_solr) [n:127.0.0.1:38163_solr    ] o.a.s.c.c.ZkStateReader A cluster state change: [WatchedEvent state:SyncConnected type:NodeDataChanged path:/collections/test_col/state.json] for collection [test_col] has occurred - updating... (live nodes size: [4])
   [junit4]   2> 1279783 INFO  (zkCallback-2309-thread-1-processing-n:127.0.0.1:38409_solr) [n:127.0.0.1:38409_solr    ] o.a.s.c.c.ZkStateReader A cluster state change: [WatchedEvent state:SyncConnected type:NodeDataChanged path:/collections/test_col/state.json] for collection [test_col] has occurred - updating... (live nodes size: [4])
   [junit4]   2> 1279783 INFO  (zkCallback-2314-thread-1-processing-n:127.0.0.1:40255_solr) [n:127.0.0.1:40255_solr    ] o.a.s.c.c.ZkStateReader A cluster state change: [WatchedEvent state:SyncConnected type:NodeDataChanged path:/collections/test_col/state.json] for collection [test_col] has occurred - updating... (live nodes size: [4])
   [junit4]   2> 1280683 INFO  (qtp1394058215-13188) [n:127.0.0.1:38409_solr    ] o.a.s.s.HttpSolrCall [admin] webapp=null path=/admin/collections params={replicationFactor=2&property.config=solrconfig-tlog.xml&property.schema=schema-minimal-atomic-stress.xml&collection.configName=org.apache.solr.cloud.TestStressCloudBlindAtomicUpdates_config-set&name=test_col&action=CREATE&numShards=2&wt=javabin&version=2} status=0 QTime=3207
   [junit4]   2> 1280684 INFO  (SUITE-TestStressCloudBlindAtomicUpdates-seed#[4BAFE8412879F788]-worker) [    ] o.a.s.c.AbstractDistribZkTestBase Wait for recoveries to finish - collection: test_col failOnTimeout:true timeout (sec):330
   [junit4]   1> -
   [junit4]   1> replica:core_node2 rstate:active live:true
   [junit4]   1> replica:core_node4 rstate:active live:true
   [junit4]   1> replica:core_node1 rstate:active live:true
   [junit4]   1> replica:core_node3 rstate:active live:true
   [junit4]   1> no one is recoverying
   [junit4]   2> 1280684 INFO  (SUITE-TestStressCloudBlindAtomicUpdates-seed#[4BAFE8412879F788]-worker) [    ] o.a.s.c.AbstractDistribZkTestBase Recoveries finished - collection: test_col
   [junit4]   2> 1280691 INFO  (qtp1394058215-13193) [n:127.0.0.1:38409_solr c:test_col s:shard2 r:core_node3 x:test_col_shard2_replica1] o.a.s.c.S.Request [test_col_shard2_replica1]  webapp=/solr path=/schema/fieldtypes/long params={wt=javabin&version=2} status=0 QTime=0
   [junit4]   2> 1280718 INFO  (TEST-TestStressCloudBlindAtomicUpdates.test_dv_stored-seed#[4BAFE8412879F788]) [    ] o.a.s.SolrTestCaseJ4 ###Starting test_dv_stored
   [junit4]   2> 1280724 INFO  (qtp599823787-13164) [n:127.0.0.1:36309_solr c:test_col s:shard1 r:core_node4 x:test_col_shard1_replica2] o.a.s.u.p.LogUpdateProcessorFactory [test_col_shard1_replica2]  webapp=/solr path=/update params={update.distrib=FROMLEADER&_version_=-1569107430148669440&distrib.from=http://127.0.0.1:40255/solr/test_col_shard1_replica1/&wt=javabin&version=2}{deleteByQuery=*:* (-1569107430148669440)} 0 1
   [junit4]   2> 1280724 INFO  (qtp1394058215-13169) [n:127.0.0.1:38409_solr c:test_col s:shard2 r:core_node3 x:test_col_shard2_replica1] o.a.s.u.p.LogUpdateProcessorFactory [test_col_shard2_replica1]  webapp=/solr path=/update params={update.distrib=FROMLEADER&_version_=-1569107430147620864&distrib.from=http://127.0.0.1:38163/solr/test_col_shard2_replica2/&wt=javabin&version=2}{deleteByQuery=*:* (-1569107430147620864)} 0 1
   [junit4]   2> 1280724 INFO  (qtp813092282-13197) [n:127.0.0.1:40255_solr c:test_col s:shard1 r:core_node2 x:test_col_shard1_replica1] o.a.s.u.p.LogUpdateProcessorFactory [test_col_shard1_replica1]  webapp=/solr path=/update params={update.distrib=TOLEADER&distrib.from=http://127.0.0.1:38163/solr/test_col_shard2_replica2/&wt=javabin&version=2}{deleteByQuery=*:* (-1569107430148669440)} 0 4
   [junit4]   2> 1280724 INFO  (qtp1923014939-13192) [n:127.0.0.1:38163_solr c:test_col s:shard2 r:core_node1 x:test_col_shard2_replica2] o.a.s.u.p.LogUpdateProcessorFactory [test_col_shard2_replica2]  webapp=/solr path=/update params={wt=javabin&version=2}{deleteByQuery=*:* (-1569107430147620864)} 0 5
   [junit4]   2> 1280726 INFO  (qtp599823787-13190) [n:127.0.0.1:36309_solr c:test_col s:shard1 r:core_node4 x:test_col_shard1_replica2] o.a.s.u.DirectUpdateHandler2 start commit{,optimize=true,openSearcher=true,waitSearcher=true,expungeDeletes=false,softCommit=false,prepareCommit=false}
   [junit4]   2> 1280726 INFO  (qtp1923014939-13171) [n:127.0.0.1:38163_solr c:test_col s:shard2 r:core_node1 x:test_col_shard2_replica2] o.a.s.u.DirectUpdateHandler2 start commit{,optimize=true,openSearcher=true,waitSearcher=true,expungeDeletes=false,softCommit=false,prepareCommit=false}
   [junit4]   2> 1280727 WARN  (qtp1923014939-13171) [n:127.0.0.1:38163_solr c:test_col s:shard2 r:core_node1 x:test_col_shard2_replica2] o.a.s.u.DirectUpdateHandler2 Starting optimize... Reading and rewriting the entire index! Use with care.
   [junit4]   2> 1280726 WARN  (qtp599823787-13190) [n:127.0.0.1:36309_solr c:test_col s:shard1 r:core_node4 x:test_col_shard1_replica2] o.a.s.u.DirectUpdateHandler2 Starting optimize... Reading and rewriting the entire index! Use with care.
   [junit4]   2> 1280727 INFO  (qtp1923014939-13171) [n:127.0.0.1:38163_solr c:test_col s:shard2 r:core_node1 x:test_col_shard2_replica2] o.a.s.u.DirectUpdateHandler2 No uncommitted changes. Skipping IW.commit.
   [junit4]   2> 1280727 INFO  (qtp599823787-13190) [n:127.0.0.1:36309_solr c:test_col s:shard1 r:core_node4 x:test_col_shard1_replica2] o.a.s.u.DirectUpdateHandler2 No uncommitted changes. Skipping IW.commit.
   [junit4]   2> 1280727 INFO  (qtp1923014939-13171) [n:127.0.0.1:38163_solr c:test_col s:shard2 r:core_node1 x:test_col_shard2_replica2] o.a.s.u.DirectUpdateHandler2 end_commit_flush
   [junit4]   2> 1280727 INFO  (qtp599823787-13190) [n:127.0.0.1:36309_solr c:test_col s:shard1 r:core_node4 x:test_col_shard1_replica2] o.a.s.u.DirectUpdateHandler2 end_commit_flush
   [junit4]   2> 1280727 INFO  (qtp1923014939-13171) [n:127.0.0.1:38163_solr c:test_col s:shard2 r:core_node1 x:test_col_shard2_replica2] o.a.s.u.p.LogUpdateProcessorFactory [test_col_shard2_replica2]  webapp=/solr path=/update params={update.distrib=FROMLEADER&optimize=true&maxSegments=1&waitSearcher=true&openSearcher=true&distrib.from=http://127.0.0.1:38163/solr/test_col_shard2_replica2/&commit_end_point=true&wt=javabin&version=2&expungeDeletes=false}{optimize=} 0 0
   [junit4]   2> 1280727 INFO  (qtp599823787-13190) [n:127.0.0.1:36309_solr c:test_col s:shard1 r:core_node4 x:test_col_shard1_replica2] o.a.s.u.p.LogUpdateProcessorFactory [test_col_shard1_replica2]  webapp=/solr path=/update params={update.distrib=FROMLEADER&optimize=true&maxSegments=1&waitSearcher=true&openSearcher=true&distrib.from=http://127.0.0.1:38163/solr/test_col_shard2_replica2/&commit_end_point=true&wt=javabin&version=2&expungeDeletes=false}{optimize=} 0 0
   [junit4]   2> 1280727 INFO  (qtp813092282-13165) [n:127.0.0.1:40255_solr c:test_col s:shard1 r:core_node2 x:test_col_shard1_replica1] o.a.s.u.DirectUpdateHandler2 start commit{,optimize=true,openSearcher=true,waitSearcher=true,expungeDeletes=false,softCommit=false,prepareCommit=false}
   [junit4]   2> 1280727 WARN  (qtp813092282-13165) [n:127.0.0.1:40255_solr c:test_col s:shard1 r:core_node2 x:test_col_shard1_replica1] o.a.s.u.DirectUpdateHandler2 Starting optimize... Reading and rewriting the entire index! Use with care.
   [junit4]   2> 1280728 INFO  (qtp813092282-13165) [n:127.0.0.1:40255_solr c:test_col s:shard1 r:core_node2 x:test_col_shard1_replica1] o.a.s.u.DirectUpdateHandler2 No uncommitted changes. Skipping IW.commit.
   [junit4]   2> 1280728 INFO  (qtp1394058215-13173) [n:127.0.0.1:38409_solr c:test_col s:shard2 r:core_node3 x:test_col_shard2_replica1] o.a.s.u.DirectUpdateHandler2 start commit{,optimize=true,openSearcher=true,waitSearcher=true,expungeDeletes=false,softCommit=false,prepareCommit=false}
   [junit4]   2> 1280728 INFO  (qtp813092282-13165) [n:127.0.0.1:40255_solr c:test_col s:shard1 r:core_node2 x:test_col_shard1_replica1] o.a.s.u.DirectUpdateHandler2 end_commit_flush
   [junit4]   2> 1280728 WARN  (qtp1394058215-13173) [n:127.0.0.1:38409_solr c:test_col s:shard2 r:core_node3 x:test_col_shard2_replica1] o.a.s.u.DirectUpdateHandler2 Starting optimize... Reading and rewriting the entire index! Use with care.
   [junit4]   2> 1280728 INFO  (qtp813092282-13165) [n:127.0.0.1:40255_solr c:test_col s:shard1 r:core_node2 x:test_col_shard1_replica1] o.a.s.u.p.LogUpdateProcessorFactory [test_col_shard1_replica1]  webapp=/solr path=/update params={update.distrib=FROMLEADER&optimize=true&maxSegments=1&waitSearcher=true&openSearcher=true&distrib.from=http://127.0.0.1:38163/solr/test_col_shard2_replica2/&commit_end_point=true&wt=javabin&version=2&expungeDeletes=false}{optimize=} 0 0
   [junit4]   2> 1280728 INFO  (qtp1394058215-13173) [n:127.0.0.1:38409_solr c:test_col s:shard2 r:core_node3 x:test_col_shard2_replica1] o.a.s.u.DirectUpdateHandler2 No uncommitted changes. Skipping IW.commit.
   [junit4]   2> 1280728 INFO  (qtp1394058215-13173) [n:127.0.0.1:38409_solr c:test_col s:shard2 r:core_node3 x:test_col_shard2_replica1] o.a.s.u.DirectUpdateHandler2 end_commit_flush
   [junit4]   2> 1280728 INFO  (qtp1394058215-13173) [n:127.0.0.1:38409_solr c:test_col s:shard2 r:core_node3 x:test_col_shard2_replica1] o.a.s.u.p.LogUpdateProcessorFactory [test_col_shard2_replica1]  webapp=/solr path=/update params={update.distrib=FROMLEADER&optimize=true&maxSegments=1&waitSearcher=true&openSearcher=true&distrib.from=http://127.0.0.1:38163/solr/test_col_shard2_replica2/&commit_end_point=true&wt=javabin&version=2&expungeDeletes=false}{optimize=} 0 0
   [junit4]   2> 1280728 INFO  (qtp1923014939-13166) [n:127.0.0.1:38163_solr c:test_col s:shard2 r:core_node1 x:test_col_shard2_replica2] o.a.s.u.p.LogUpdateProcessorFactory [test_col_shard2_replica2]  webapp=/solr path=/update params={_stateVer_=test_col:5&optimize=true&maxSegments=1&waitSearcher=true&wt=javabin&version=2}{optimize=} 0 2
   [junit4]   2> 1280729 INFO  (qtp599823787-13164) [n:127.0.0.1:36309_solr c:test_col s:shard1 r:core_node4 x:test_col_shard1_replica2] o.a.s.c.S.Request [test_col_shard1_replica2]  webapp=/solr path=/schema/fields/long_dv_stored params={wt=javabin&version=2} status=0 QTime=0
   [junit4]   2> 1280729 INFO  (TEST-TestStressCloudBlindAtomicUpdates.test_dv_stored-seed#[4BAFE8412879F788]) [    ] o.a.s.c.TestStressCloudBlindAtomicUpdates Testing long_dv_stored: numDocsToCheck=139, numDocsInIndex=834, incr=6
   [junit4]   2> 1280733 INFO  (qtp599823787-13167) [n:127.0.0.1:36309_solr c:test_col s:shard1 r:core_node4 x:test_col_shard1_replica2] o.a.s.u.p.LogUpdateProcessorFactory [test_col_shard1_replica2]  webapp=/solr path=/update params={update.distrib=FROMLEADER&distrib.from=http://127.0.0.1:40255/solr/test_col_shard1_replica1/&wt=javabin&version=2}{add=[0 (1569107430160203776)]} 0 0
   [junit4]   2> 1280733 INFO  (qtp813092282-13168) [n:127.0.0.1:40255_solr c:test_col s:shard1 r:core_node2 x:test_col_shard1_replica1] o.a.s.u.p.LogUpdateProcessorFactory [test_col_shard1_replica1]  webapp=/solr path=/update params={wt=javabin&version=2}{add=[0 (1569107430160203776)]} 0 2
   [junit4]   2> 1280737 INFO  (qtp599823787-13190) [n:127.0.0.1:36309_solr c:test_col s:shard1 r:core_node4 x:test_col_shard1_replica2] o.a.s.u.p.LogUpdateProcessorFactory [test_col_shard1_replica2]  webapp=/solr path=/update params={update.distrib=FROMLEADER&distrib.from=http://127.0.0.1:40255/solr/test_col_shard1_replica1/&wt=javabin&version=2}{add=[1 (1569107430164398080)]} 0 0
   [junit4]   2> 1280737 INFO  (qtp813092282-13197) [n:127.0.0.1:40255_solr c:test_col s:shard1 r:core_node2 x:test_col_shard1_replica1] o.a.s.u.p.LogUpdateProcessorFactory [test_col_shard1_replica1]  webapp=/solr path=/update params={wt=javabin&version=2}{add=[1 (1569107430164398080)]} 0 2
   [junit4]   2> 1280741 INFO  (qtp1394058215-13172) [n:127.0.0.1:38409_solr c:test_col s:shard2 r:core_node3 x:test_col_shard2_replica1] o.a.s.u.p.LogUpdateProcessorFactory [test_col_shard2_replica1]  webapp=/solr path=/update params={update.distrib=FROMLEADER&distrib.from=http://127.0.0.1:38163/solr/test_col_shard2_replica2/&wt=javabin&version=2}{add=[2 (1569107430168592384)]} 0 0
   [junit4]   2> 1280741 INFO  (qtp1923014939-13184) [n:127.0.0.1:38163_solr c:test_col s:shard2 r:core_node1 x:test_col_shard2_replica2] o.a.s.u.p.LogUpdateProcessorFactory [test_col_shard2_replica2]  webapp=/solr path=/update params={wt=javabin&version=2}{add=[2 (1569107430168592384)]} 0 2
   [junit4]   2> 1280744 INFO  (qtp1394058215-13188) [n:127.0.0.1:38409_solr c:test_col s:shard2 r:core_node3 x:test_col_shard2_replica1] o.a.s.u.p.LogUpdateProcessorFactory [test_col_shard2_replica1]  webapp=/solr path=/update params={update.distrib=FROMLEADER&distrib.from=http://127.0.0.1:38163/solr/test_col_shard2_replica2/&wt=javabin&version=2}{add=[3 (1569107430172786688)]} 0 0
   [junit4]   2> 1280745 INFO  (qtp1923014939-13178) [n:127.0.0.1:38163_solr c:test_col s:shard2 r:core_node1 x:test_col_shard2_replica2] o.a.s.u.p.LogUpdateProcessorFactory [test_col_shard2_replica2]  webapp=/solr path=/update params={wt=javabin&version=2}{add=[3 (1569107430172786688)]} 0 1
   [junit4]   2> 1280748 INFO  (qtp599823787-13174) [n:127.0.0.1:36309_solr c:test_col s:shard1 r:core_node4 x:test_col_shard1_replica2] o.a.s.u.p.LogUpdateProcessorFactory [test_col_shard1_replica2]  webapp=/solr path=/update params={update.distrib=FROMLEADER&distrib.from=http://127.0.0.1:40255/solr/test_col_shard1_replica1/&wt=javabin&version=2}{add=[4 (1569107430175932416)]} 0 0
   [junit4]   2> 1280748 INFO  (qtp813092282-13165) [n:127.0.0.1:40255_solr c:test_col s:shard1 r:core_node2 x:test_col_shard1_replica1] o.a.s.u.p.LogUpdateProcessorFactory [test_col_shard1_replica1]  webapp=/solr path=/update params={wt=javabin&version=2}{add=[4 (1569107430175932416)]} 0 1
   [junit4]   2> 1280751 INFO  (qtp1394058215-13193) [n:127.0.0.1:38409_solr c:test_col s:shard2 r:core_node3 x:test_col_shard2_replica1] o.a.s.u.p.LogUpdateProcessorFactory [test_col_shard2_replica1]  webapp=/solr path=/update params={update.distrib=FROMLEADER&distrib.from=http://127.0.0.1:38163/solr/test_col_shard2_replica2/&wt=javabin&version=2}{add=[5 (1569107430179078144)]} 0 0
   [junit4]   2> 1280751 INFO  (qtp1923014939-13171) [n:127.0.0.1:38163_solr c:test_col s:shard2 r:core_node1 x:test_col_shard2_replica2] o.a.s.u.p.LogUpdateProcessorFactory [test_col_shard2_replica2]  webapp=/solr path=/update params={wt=javabin&version=2}{add=[5 (1569107430179078144)]} 0 1
   [junit4]   2> 1280754 INFO  (qtp1394058215-13169) [n:127.0.0.1:38409_solr c:test_col s:shard2 r:core_node3 x:test_col_shard2_replica1] o.a.s.u.p.LogUpdateProcessorFactory [test_col_shard2_replica1]  webapp=/solr path=/update params={update.distrib=FROMLEADER&distrib.from=http://127.0.0.1:38163/solr/test_col_shard2_replica2/&wt=javabin&version=2}{add=[6 (1569107430183272448)]} 0 0
   [junit4]   2> 1280754 INFO  (qtp1923014939-13166) [n:127.0.0.1:38163_solr c:test_col s:shard2 r:core_node1 x:test_col_shard2_replica2] o.a.s.u.p.LogUpdateProcessorFactory [test_col_shard2_replica2]  webapp=/solr path=/update params={wt=javabin&version=2}{add=[6 (1569107430183272448)]} 0 1
   [junit4]   2> 1280757 INFO  (qtp1394058215-13173) [n:127.0.0.1:38409_solr c:test_col s:shard2 r:core_node3 x:test_col_shard2_replica1] o.a.s.u.p.LogUpdateProcessorFactory [test_col_shard2_replica1]  webapp=/solr path=/update params={update.distrib=FROMLEADER&distrib.from=http://127.0.0.1:38163/solr/test_col_shard2_replica2/&wt=javabin&version=2}{add=[7 (1569107430186418176)]} 0 0
   [junit4]   2> 1280757 INFO  (qtp1923014939-13184) [n:127.0.0.1:38163_solr c:test_col s:shard2 r:core_node1 x:test_col_shard2_replica2] o.a.s.u.p.LogUpdateProcessorFactory [test_col_shard2_replica2]  webapp=/solr path=/update params={wt=javabin&version=2}{add=[7 (1569107430186418176)]} 0 1
   [junit4]   2> 1280760 INFO  (qtp599823787-13164) [n:127.0.0.1:36309_solr c:test_col s:shard1 r:core_node4 x:test_col_shard1_replica2] o.a.s.u.p.LogUpdateProcessorFactory [test_col_shard1_replica2]  webapp=/solr path=/update params={update.distrib=FROMLEADER&distrib.from=http://127.0.0.1:40255/solr/test_col_shard1_replica1/&wt=javabin&version=2}{add=[8 (1569107430189563904)]} 0 0
   [junit4]   2> 1280761 INFO  (qtp813092282-13176) [n:127.0.0.1:40255_solr c:test_col s:shard1 r:core_node2 x:test_col_shard1_replica1] o.a.s.u.p.LogUpdateProcessorFactory [test_col_shard1_replica1]  webapp=/solr path=/update params={wt=javabin&version=2}{add=[8 (1569107430189563904)]} 0 1
   [junit4]   2> 1280764 INFO  (qtp1394058215-13172) [n:127.0.0.1:38409_solr c:test_col s:shard2 r:core_node3 x:test_col_shard2_replica1] o.a.s.u.p.LogUpdateProcessorFactory [test_col_shard2_replica1]  webapp=/solr path=/update params={update.distrib=FROMLEADER&distrib.from=http://127.0.0.1:38163/solr/test_col_shard2_replica2/&wt=javabin&version=2}{add=[9 (1569107430192709632)]} 0 0
   [junit4]   2> 1280764 INFO  (qtp1923014939-13178) [n:127.0.0.1:38163_solr c:test_col s:shard2 r:core_node1 x:test_col_shard2_replica2] o.a.s.u.p.LogUpdateProcessorFactory [test_col_shard2_replica2]  webapp=/solr path=/update params={wt=javabin&version=2}{add=[9 (1569107430192709632)]} 0 1
   [junit4]   2> 1280767 INFO  (qtp599823787-13167) [n:127.0.0.1:36309_solr c:test_col s:shard1 r:core_node4 x:test_col_shard1_replica2] o.a.s.u.p.LogUpdateProcessorFactory [test_col_shard1_replica2]  webapp=/solr path=/update params={update.distrib=FROMLEADER&distrib.from=http://127.0.0.1:40255/solr/test_col_shard1_replica1/&wt=javabin&version=2}{add=[10 (1569107430195855360)]} 0 0
   [junit4]   2> 1280767 INFO  (qtp813092282-13168) [n:127.0.0.1:40255_solr c:test_col s:shard1 r:core_node2 x:test_col_shard1_replica1] o.a.s.u.p.LogUpdateProcessorFactory [test_col_shard1_replica1]  webapp=/solr path=/update params={wt=javabin&version=2}{add=[10 (1569107430195855360)]} 0 1
   [junit4]   2> 1280770 INFO  (qtp599823787-13190) [n:127.0.0.1:36309_solr c:test_col s:shard1 r:core_node4 x:test_col_shard1_replica2] o.a.s.u.p.LogUpdateProcessorFactory [test_col_shard1_replica2]  webapp=/solr path=/update params={update.distrib=FROMLEADER&distrib.from=http://127.0.0.1:40255/solr/test_col_shard1_replica1/&wt=javabin&version=2}{add=[11 (1569107430200049664)]} 0 0
   [junit4]   2> 1280770 INFO  (qtp813092282-13197) [n:127.0.0.1:40255_solr c:test_col s:shard1 r:core_node2 x:test_col_shard1_replica1] o.a.s.u.p.LogUpdateProcessorFactory [test_col_shard1_replica1]  webapp=/solr path=/update params={wt=javabin&version=2}{add=[11 (1569107430200049664)]} 0 1
   [junit4]   2> 1280773 INFO  (qtp599823787-13174) [n:127.0.0.1:36309_solr c:test_col s:shard1 r:core_node4 x:test_col_shard1_replica2] o.a.s.u.p.LogUpdateProcessorFactory [test_col_shard1_replica2]  webapp=/solr path=/update params={update.distrib=FROMLEADER&distrib.from=http://127.0.0.1:40255/solr/test_col_shard1_replica1/&wt=javabin&version=2}{add=[12 (1569107430203195392)]} 0 0
   [junit4]   2> 1280773 INFO  (qtp813092282-13165) [n:127.0.0.1:40255_solr c:test_col s:shard1 r:core_node2 x:test_col_shard1_replica1] o.a.s.u.p.LogUpdateProcessorFactory [test_col_shard1_replica1]  webapp=/solr path=/update params={wt=javabin&version=2}{add=[12 (1569107430203195392)]} 0 1
   [junit4]   2> 1280777 INFO  (qtp599823787-13164) [n:127.0.0.1:36309_solr c:test_col s:shard1 r:core_node4 x:test_col_shard1_replica2] o.a.s.u.p.LogUpdateProcessorFactory [test_col_shard1_replica2]  webapp=/solr path=/update params={update.distrib=FROMLEADER&distrib.from=http://127.0.0.1:40255/solr/test_col_shard1_replica1/&wt=javabin&version=2}{add=[13 (1569107430206341120)]} 0 0
   [junit4]   2> 1280777 INFO  (qtp813092282-13176) [n:127.0.0.1:40255_solr c:test_col s:shard1 r:core_node2 x:test_col_shard1_replica1] o.a.s.u.p.LogUpdateProcessorFactory [test_col_shard1_replica1]  webapp=/solr path=/update params={wt=javabin&version=2}{add=[13 (1569107430206341120)]} 0 1
   [junit4]   2> 1280780 INFO  (qtp599823787-13167) [n:127.0.0.1:36309_solr c:test_col s:shard1 r:core_node4 x:test_col_shard1_replica2] o.a.s.u.p.LogUpdateProcessorFactory [test_col_shard1_replica2]  webapp=/solr path=/update params={update.distrib=FROMLEADER&distrib.from=http://127.0.0.1:40255/solr/test_col_shard1_replica1/&wt=javabin&version=2}{add=[14 (1569107430209486848)]} 0 0
   [junit4]   2> 1280780 INFO  (qtp813092282-13168) [n:127.0.0.1:40255_solr c:test_col s:shard1 r:core_node2 x:test_col_shard1_replica1] o.a.s.u.p.LogUpdateProcessorFactory [test_col_shard1_replica1]  webapp=/solr path=/update params={wt=javabin&version=2}{add=[14 (1569107430209486848)]} 0 1
   [junit4]   2> 1280783 INFO  (qtp599823787-13190) [n:127.0.0.1:36309_solr c:test_col s:shard1 r:core_node4 x:test_col_shard1_replica2] o.a.s.u.p.LogUpdateProcessorFactory [test_col_shard1_replica2]  webapp=/solr path=/update params={update.distrib=FROMLEADER&distrib.from=http://127.0.0.1:40255/solr/test_col_shard1_replica1/&wt=javabin&version=2}{add=[15 (1569107430212632576)]} 0 0
   [junit4]   2> 1280783 INFO  (qtp813092282-13197) [n:127.0.0.1:40255_solr c:test_col s:shard1 r:core_node2 x:test_col_shard1_replica1] o.a.s.u.p.LogUpdateProcessorFactory [test_col_shard1_replica1]  webapp=/solr path=/update params={wt=javabin&version=2}{add=[15 (1569107430212632576)]} 0 1
   [junit4]   2> 1280786 INFO  (qtp599823787-13174) [n:127.0.0.1:36309_solr c:test_col s:shard1 r:core_node4 x:test_col_shard1_replica2] o.a.s.u.p.LogUpdateProcessorFactory [test_col_shard1_replica2]  webapp=/solr path=/update params={update.distrib=FROMLEADER&distrib.from=http://127.0.0.1:40255/solr/test_col_shard1_replica1/&wt=javabin&version=2}{add=[16 (1569107430215778304)]} 0 0
   [junit4]   2> 1280786 INFO  (qtp813092282-13165) [n:127.0.0.1:40255_solr c:test_col s:shard1 r:core_node2 x:test_col_shard1_replica1] o.a.s.u.p.LogUpdateProcessorFactory [test_col_shard1_replica1]  webapp=/solr path=/update params={wt=javabin&version=2}{add=[16 (1569107430215778304)]} 0 1
   [junit4]   2> 1280789 INFO  (qtp1394058215-13188) [n:127.0.0.1:38409_solr c:test_col s:shard2 r:core_node3 x:test_col_shard2_replica1] o.a.s.u.p.LogUpdateProcessorFactory [test_col_shard2_replica1]  webapp=/solr path=/update params={update.distrib=FROMLEADER&distrib.from=http://127.0.0.1:38163/solr/test_col_shard2_replica2/&wt=javabin&version=2}{add=[17 (1569107430218924032)]} 0 0
   [junit4]   2> 1280789 INFO  (qtp1923014939-13171) [n:127.0.0.1:38163_solr c:test_col s:shard2 r:core_node1 x:test_col_shard2_replica2] o.a.s.u.p.LogUpdateProcessorFactory [test_col_shard2_replica2]  webapp=/solr path=/update params={wt=javabin&version=2}{add=[17 (1569107430218924032)]} 0 1
   [junit4]   2> 1280791 INFO  (qtp1394058215-13193) [n:127.0.0.1:38409_solr c:test_col s:shard2 r:core_node3 x:test_col_shard2_replica1] o.a.s.u.p.LogUpdateProcessorFactory [test_col_shard2_replica1]  webapp=/solr path=/update params={update.distrib=FROMLEADER&distrib.from=http://127.0.0.1:38163/solr/test_col_shard2_replica2/&wt=javabin&version=2}{add=[18 (1569107430222069760)]} 0 0
   [junit4]   2> 1280792 INFO  (qtp1923014939-13166) [n:127.0.0.1:38163_solr c:

[...truncated too long message...]

tests.multiplier=3 -Dtests.slow=true -Dtests.locale=ru -Dtests.timezone=Asia/Thimbu -Dtests.asserts=true -Dtests.file.encoding=US-ASCII
   [junit4] ERROR   0.03s J2 | TestMaxTokenLenTokenizer.testSingleFieldSameAnalyzers <<<
   [junit4]    > Throwable #1: java.lang.RuntimeException: Exception during query
   [junit4]    > 	at __randomizedtesting.SeedInfo.seed([4BAFE8412879F788:217DD72E709A2747]:0)
   [junit4]    > 	at org.apache.solr.SolrTestCaseJ4.assertQ(SolrTestCaseJ4.java:895)
   [junit4]    > 	at org.apache.solr.util.TestMaxTokenLenTokenizer.testSingleFieldSameAnalyzers(TestMaxTokenLenTokenizer.java:104)
   [junit4]    > 	at java.lang.Thread.run(Thread.java:748)
   [junit4]    > Caused by: java.lang.RuntimeException: REQUEST FAILED: xpath=//result[@numFound=1]
   [junit4]    > 	xml response was: <?xml version="1.0" encoding="UTF-8"?>
   [junit4]    > <response>
   [junit4]    > <lst name="responseHeader"><int name="status">0</int><int name="QTime">0</int></lst><result name="response" numFound="0" start="0"></result>
   [junit4]    > </response>
   [junit4]    > 	request was:q=letter0:lett&wt=xml
   [junit4]    > 	at org.apache.solr.SolrTestCaseJ4.assertQ(SolrTestCaseJ4.java:888)
   [junit4]    > 	... 40 more
   [junit4]   2> 1657408 INFO  (SUITE-TestMaxTokenLenTokenizer-seed#[4BAFE8412879F788]-worker) [    ] o.a.s.SolrTestCaseJ4 ###deleteCore
   [junit4]   2> 1657408 INFO  (SUITE-TestMaxTokenLenTokenizer-seed#[4BAFE8412879F788]-worker) [    ] o.a.s.c.CoreContainer Shutting down CoreContainer instance=1847302083
   [junit4]   2> 1657408 INFO  (SUITE-TestMaxTokenLenTokenizer-seed#[4BAFE8412879F788]-worker) [    ] o.a.s.m.SolrMetricManager Closing metric reporters for: solr.node
   [junit4]   2> 1657409 INFO  (SUITE-TestMaxTokenLenTokenizer-seed#[4BAFE8412879F788]-worker) [    ] o.a.s.m.SolrMetricManager Closing metric reporters for: solr.jvm
   [junit4]   2> 1657409 INFO  (SUITE-TestMaxTokenLenTokenizer-seed#[4BAFE8412879F788]-worker) [    ] o.a.s.m.SolrMetricManager Closing metric reporters for: solr.jetty
   [junit4]   2> 1657409 INFO  (SUITE-TestMaxTokenLenTokenizer-seed#[4BAFE8412879F788]-worker) [    ] o.a.s.c.TransientSolrCoreCacheDefault Allocating transient cache for 2147483647 transient cores
   [junit4]   2> 1657409 INFO  (coreCloseExecutor-8980-thread-1) [    x:collection1] o.a.s.c.SolrCore [collection1]  CLOSING SolrCore org.apache.solr.core.SolrCore@16a9370b
   [junit4]   2> 1657410 INFO  (coreCloseExecutor-8980-thread-1) [    x:collection1] o.a.s.m.SolrMetricManager Closing metric reporters for: solr.core.collection1
   [junit4]   2> NOTE: leaving temporary files on disk at: /home/jenkins/workspace/Lucene-Solr-6.x-Linux/solr/build/solr-core/test/J2/temp/solr.util.TestMaxTokenLenTokenizer_4BAFE8412879F788-001
   [junit4]   2> NOTE: test params are: codec=Asserting(Lucene62): {lowerCase0=TestBloomFilteredLucenePostings(BloomFilteringPostingsFormat(Lucene50(blocksize=128))), whiteSpace=PostingsFormat(name=Memory doPackFST= true), letter=Lucene50(blocksize=128), lowerCase=TestBloomFilteredLucenePostings(BloomFilteringPostingsFormat(Lucene50(blocksize=128))), unicodeWhiteSpace=Lucene50(blocksize=128), letter0=Lucene50(blocksize=128), unicodeWhiteSpace0=Lucene50(blocksize=128), keyword0=TestBloomFilteredLucenePostings(BloomFilteringPostingsFormat(Lucene50(blocksize=128))), id=TestBloomFilteredLucenePostings(BloomFilteringPostingsFormat(Lucene50(blocksize=128))), keyword=TestBloomFilteredLucenePostings(BloomFilteringPostingsFormat(Lucene50(blocksize=128))), whiteSpace0=PostingsFormat(name=Memory doPackFST= true)}, docValues:{}, maxPointsInLeafNode=34, maxMBSortInHeap=6.183378065883887, sim=RandomSimilarity(queryNorm=false,coord=crazy): {}, locale=ru, timezone=Asia/Thimbu
   [junit4]   2> NOTE: Linux 4.10.0-21-generic amd64/Oracle Corporation 1.8.0_131 (64-bit)/cpus=8,threads=1,free=222001968,total=518979584
   [junit4]   2> NOTE: All tests run in this JVM: [CircularListTest, JSONWriterTest, DistributedFacetPivotLongTailTest, TestSolrCloudWithKerberosAlt, TestFieldCacheReopen, TestGroupingSearch, TestGraphTermsQParserPlugin, PingRequestHandlerTest, TestTrieFacet, V2ApiIntegrationTest, TestSolrConfigHandlerCloud, TestImpersonationWithHadoopAuth, TestRecovery, FullSolrCloudDistribCmdsTest, SuggesterTSTTest, CloudExitableDirectoryReaderTest, TestConfig, TestPostingsSolrHighlighter, PluginInfoTest, TestJsonFacetRefinement, TermVectorComponentDistributedTest, TestLeaderInitiatedRecoveryThread, CdcrReplicationDistributedZkTest, TestSolrFieldCacheMBean, HdfsLockFactoryTest, ExplicitHLLTest, SolrIndexMetricsTest, TestObjectReleaseTracker, CheckHdfsIndexTest, AtomicUpdateProcessorFactoryTest, SolrXmlInZkTest, TestCloudManagedSchema, TestMiniSolrCloudCluster, TestHdfsCloudBackupRestore, TestSimpleTextCodec, TestCollationField, ClassificationUpdateProcessorIntegrationTest, TestDFRSimilarityFactory, TestEmbeddedSolrServerSchemaAPI, PreAnalyzedFieldTest, TestSolrXml, TestHdfsUpdateLog, HdfsNNFailoverTest, ZkStateWriterTest, TimeZoneUtilsTest, TestReload, RankQueryTest, ReplicaListTransformerTest, HttpPartitionTest, TestLRUStatsCache, TestCloudPseudoReturnFields, PreAnalyzedUpdateProcessorTest, TestScoreJoinQPNoScore, TestSolrQueryParser, TestSchemaManager, BlockJoinFacetDistribTest, TestFieldResource, HdfsTlogReplayBufferedWhileIndexingTest, TestRequestStatusCollectionAPI, RequestHandlersTest, TestManagedSynonymFilterFactory, TestLegacyFieldCache, TestNoOpRegenerator, OverriddenZkACLAndCredentialsProvidersTest, RollingRestartTest, TestCollectionAPI, TestWriterPerf, CdcrVersionReplicationTest, UnloadDistributedZkTest, UpdateLogTest, LukeRequestHandlerTest, TestLMJelinekMercerSimilarityFactory, SpellPossibilityIteratorTest, DebugComponentTest, SolrPluginUtilsTest, TestUtils, TestPerFieldSimilarityWithDefaultOverride, TestManagedSchemaAPI, TestXIncludeConfig, SolrCoreMetricManagerTest, TestConfigSetsAPIZkFailure, XmlUpdateRequestHandlerTest, FieldMutatingUpdateProcessorTest, BadComponentTest, TestCollationFieldDocValues, VMParamsZkACLAndCredentialsProvidersTest, DirectUpdateHandlerOptimizeTest, ResponseLogComponentTest, TestCustomSort, TestExpandComponent, DirectoryFactoryTest, SimpleFacetsTest, MultiThreadedOCPTest, SimpleCollectionCreateDeleteTest, TestOrdValues, StatsReloadRaceTest, TestSubQueryTransformer, TestJmxMonitoredMap, TestPhraseSuggestions, TestMergePolicyConfig, TestBinaryField, QueryResultKeyTest, TestUseDocValuesAsStored2, TestCoreDiscovery, TestMaxScoreQueryParser, RequestLoggingTest, BooleanFieldTest, DocValuesMissingTest, PropertiesRequestHandlerTest, SmileWriterTest, TestCollapseQParserPlugin, TestUnifiedSolrHighlighter, DistributedFacetPivotWhiteBoxTest, TestRuleBasedAuthorizationPlugin, SOLR749Test, DirectUpdateHandlerTest, ActionThrottleTest, TestSchemaVersionResource, BasicDistributedZkTest, BasicDistributedZk2Test, OpenCloseCoreStressTest, LeaderElectionIntegrationTest, BasicZkTest, RecoveryZkTest, LeaderElectionTest, ZkSolrClientTest, TestZkChroot, ShardRoutingCustomTest, AutoCommitTest, TestFaceting, TestHashPartitioner, TestRealTimeGet, TestStressReorder, TestJoin, HardAutoCommitTest, SpellCheckComponentTest, TestSort, HighlighterTest, DistributedQueryElevationComponentTest, CoreAdminHandlerTest, WordBreakSolrSpellCheckerTest, TestPseudoReturnFields, DefaultValueUpdateProcessorTest, TestRemoteStreaming, IndexBasedSpellCheckerTest, TestQueryTypes, FileBasedSpellCheckerTest, PathHierarchyTokenizerFactoryTest, FieldAnalysisRequestHandlerTest, RegexBoostProcessorTest, ReturnFieldsTest, QueryParsingTest, BinaryUpdateRequestHandlerTest, TestPartialUpdateDeduplication, TestComponentsName, TestLFUCache, TestTolerantSearch, TestPathTrie, AsyncCallRequestStatusResponseTest, CollectionStateFormat2Test, CollectionTooManyReplicasTest, DeleteLastCustomShardedReplicaTest, DeleteShardTest, DistributedVersionInfoTest, LeaderFailureAfterFreshStartTest, OverseerCollectionConfigSetProcessorTest, OverseerRolesTest, PeerSyncReplicationTest, RecoveryAfterSoftCommitTest, SharedFSAutoReplicaFailoverTest, SharedFSAutoReplicaFailoverUtilsTest, TestAuthenticationFramework, TestConfigSetsAPIExclusivity, TestDeleteCollectionOnDownNodes, TestMiniSolrCloudClusterSSL, TestRandomFlRTGCloud, TestShortCircuitedRequests, TestStressInPlaceUpdates, CachingDirectoryFactoryTest, CoreSorterTest, TestConfigSetImmutable, TestConfigSetProperties, TestConfigSets, TestCorePropertiesReload, TestCustomStream, TestImplicitCoreProperties, TestInfoStreamLogging, TestNRTOpen, TestReloadAndDeleteDocs, TestSolrCloudSnapshots, TestHdfsBackupRestoreCore, TestReplicationHandlerBackup, TestReqParamsAPI, TestRestoreCore, TestSQLHandlerNonCloud, TestSystemCollAutoCreate, TestConfigsApi, TestCoreAdminApis, DistributedExpandComponentTest, DistributedFacetPivotSmallAdvancedTest, DistributedQueryComponentOptimizationTest, FacetPivotSmallTest, InfixSuggestersTest, ShufflingReplicaListTransformerTest, SpatialHeatmapFacetsTest, SolrMetricReporterTest, SolrJmxReporterTest, TestMacroExpander, TestMacros, JSONWriterTest, TestRawTransformer, TestBulkSchemaAPI, TestBulkSchemaConcurrent, AnalyticsMergeStrategyTest, CursorMarkTest, SortSpecParsingTest, TestAddFieldRealTimeGet, TestComplexPhraseQParserPlugin, TestFieldSortValues, TestInitQParser, TestOverriddenPrefixQueryForCustomFieldType, TestPayloadScoreQParserPlugin, TestRecoveryHdfs, TestReloadDeadlock, TestSimpleQParserPlugin, TestSmileRequest, TestStandardQParsers, TestJsonFacets, ResponseHeaderTest, TestAnalyzeInfixSuggestions, TestFileDictionaryLookup, TestFreeTextSuggestions, BlockCacheTest, BlockDirectoryTest, TestNumericTerms64, VersionInfoTest, AtomicUpdatesTest, ClassificationUpdateProcessorTest, DocExpirationUpdateProcessorFactoryTest, IgnoreCommitOptimizeUpdateProcessorFactoryTest, TestNamedUpdateProcessors, UUIDUpdateProcessorFallbackTest, DistanceUnitsTest, TestMaxTokenLenTokenizer]
   [junit4] Completed [708/715 (2!)] on J2 in 0.19s, 2 tests, 1 error <<< FAILURES!

[...truncated 43464 lines...]

Mime
View raw message