lucene-dev mailing list archives

Site index · List index
Message view « Date » · « Thread »
Top « Date » · « Thread »
From Policeman Jenkins Server <jenk...@thetaphi.de>
Subject [JENKINS-EA] Lucene-Solr-6.x-Linux (32bit/jdk-9-ea+171) - Build # 3640 - Still Unstable!
Date Thu, 01 Jun 2017 21:40:55 GMT
Build: https://jenkins.thetaphi.de/job/Lucene-Solr-6.x-Linux/3640/
Java: 32bit/jdk-9-ea+171 -client -XX:+UseSerialGC

1 tests failed.
FAILED:  org.apache.solr.util.TestMaxTokenLenTokenizer.testSingleFieldSameAnalyzers

Error Message:
Exception during query

Stack Trace:
java.lang.RuntimeException: Exception during query
	at __randomizedtesting.SeedInfo.seed([3A59F308DE6DF91:6977A05FD5050F5E]:0)
	at org.apache.solr.SolrTestCaseJ4.assertQ(SolrTestCaseJ4.java:895)
	at org.apache.solr.util.TestMaxTokenLenTokenizer.testSingleFieldSameAnalyzers(TestMaxTokenLenTokenizer.java:104)
	at java.base/jdk.internal.reflect.NativeMethodAccessorImpl.invoke0(Native Method)
	at java.base/jdk.internal.reflect.NativeMethodAccessorImpl.invoke(NativeMethodAccessorImpl.java:62)
	at java.base/jdk.internal.reflect.DelegatingMethodAccessorImpl.invoke(DelegatingMethodAccessorImpl.java:43)
	at java.base/java.lang.reflect.Method.invoke(Method.java:563)
	at com.carrotsearch.randomizedtesting.RandomizedRunner.invoke(RandomizedRunner.java:1713)
	at com.carrotsearch.randomizedtesting.RandomizedRunner$8.evaluate(RandomizedRunner.java:907)
	at com.carrotsearch.randomizedtesting.RandomizedRunner$9.evaluate(RandomizedRunner.java:943)
	at com.carrotsearch.randomizedtesting.RandomizedRunner$10.evaluate(RandomizedRunner.java:957)
	at com.carrotsearch.randomizedtesting.rules.SystemPropertiesRestoreRule$1.evaluate(SystemPropertiesRestoreRule.java:57)
	at org.apache.lucene.util.TestRuleSetupTeardownChained$1.evaluate(TestRuleSetupTeardownChained.java:49)
	at org.apache.lucene.util.AbstractBeforeAfterRule$1.evaluate(AbstractBeforeAfterRule.java:45)
	at org.apache.lucene.util.TestRuleThreadAndTestName$1.evaluate(TestRuleThreadAndTestName.java:48)
	at org.apache.lucene.util.TestRuleIgnoreAfterMaxFailures$1.evaluate(TestRuleIgnoreAfterMaxFailures.java:64)
	at org.apache.lucene.util.TestRuleMarkFailure$1.evaluate(TestRuleMarkFailure.java:47)
	at com.carrotsearch.randomizedtesting.rules.StatementAdapter.evaluate(StatementAdapter.java:36)
	at com.carrotsearch.randomizedtesting.ThreadLeakControl$StatementRunner.run(ThreadLeakControl.java:368)
	at com.carrotsearch.randomizedtesting.ThreadLeakControl.forkTimeoutingTask(ThreadLeakControl.java:817)
	at com.carrotsearch.randomizedtesting.ThreadLeakControl$3.evaluate(ThreadLeakControl.java:468)
	at com.carrotsearch.randomizedtesting.RandomizedRunner.runSingleTest(RandomizedRunner.java:916)
	at com.carrotsearch.randomizedtesting.RandomizedRunner$5.evaluate(RandomizedRunner.java:802)
	at com.carrotsearch.randomizedtesting.RandomizedRunner$6.evaluate(RandomizedRunner.java:852)
	at com.carrotsearch.randomizedtesting.RandomizedRunner$7.evaluate(RandomizedRunner.java:863)
	at com.carrotsearch.randomizedtesting.rules.StatementAdapter.evaluate(StatementAdapter.java:36)
	at com.carrotsearch.randomizedtesting.rules.SystemPropertiesRestoreRule$1.evaluate(SystemPropertiesRestoreRule.java:57)
	at org.apache.lucene.util.AbstractBeforeAfterRule$1.evaluate(AbstractBeforeAfterRule.java:45)
	at com.carrotsearch.randomizedtesting.rules.StatementAdapter.evaluate(StatementAdapter.java:36)
	at org.apache.lucene.util.TestRuleStoreClassName$1.evaluate(TestRuleStoreClassName.java:41)
	at com.carrotsearch.randomizedtesting.rules.NoShadowingOrOverridesOnMethodsRule$1.evaluate(NoShadowingOrOverridesOnMethodsRule.java:40)
	at com.carrotsearch.randomizedtesting.rules.NoShadowingOrOverridesOnMethodsRule$1.evaluate(NoShadowingOrOverridesOnMethodsRule.java:40)
	at com.carrotsearch.randomizedtesting.rules.StatementAdapter.evaluate(StatementAdapter.java:36)
	at com.carrotsearch.randomizedtesting.rules.StatementAdapter.evaluate(StatementAdapter.java:36)
	at org.apache.lucene.util.TestRuleAssertionsRequired$1.evaluate(TestRuleAssertionsRequired.java:53)
	at org.apache.lucene.util.TestRuleMarkFailure$1.evaluate(TestRuleMarkFailure.java:47)
	at org.apache.lucene.util.TestRuleIgnoreAfterMaxFailures$1.evaluate(TestRuleIgnoreAfterMaxFailures.java:64)
	at org.apache.lucene.util.TestRuleIgnoreTestSuites$1.evaluate(TestRuleIgnoreTestSuites.java:54)
	at com.carrotsearch.randomizedtesting.rules.StatementAdapter.evaluate(StatementAdapter.java:36)
	at com.carrotsearch.randomizedtesting.ThreadLeakControl$StatementRunner.run(ThreadLeakControl.java:368)
	at java.base/java.lang.Thread.run(Thread.java:844)
Caused by: java.lang.RuntimeException: REQUEST FAILED: xpath=//result[@numFound=1]
	xml response was: <?xml version="1.0" encoding="UTF-8"?>
<response>
<lst name="responseHeader"><int name="status">0</int><int name="QTime">0</int></lst><result
name="response" numFound="0" start="0"></result>
</response>

	request was:q=letter0:lett&wt=xml
	at org.apache.solr.SolrTestCaseJ4.assertQ(SolrTestCaseJ4.java:888)
	... 39 more




Build Log:
[...truncated 11473 lines...]
   [junit4] Suite: org.apache.solr.util.TestMaxTokenLenTokenizer
   [junit4]   2> Creating dataDir: /home/jenkins/workspace/Lucene-Solr-6.x-Linux/solr/build/solr-core/test/J1/temp/solr.util.TestMaxTokenLenTokenizer_3A59F308DE6DF91-001/init-core-data-001
   [junit4]   2> 283708 WARN  (SUITE-TestMaxTokenLenTokenizer-seed#[3A59F308DE6DF91]-worker)
[    ] o.a.s.SolrTestCaseJ4 startTrackingSearchers: numOpens=1 numCloses=1
   [junit4]   2> 283708 INFO  (SUITE-TestMaxTokenLenTokenizer-seed#[3A59F308DE6DF91]-worker)
[    ] o.a.s.SolrTestCaseJ4 Using PointFields
   [junit4]   2> 283709 INFO  (SUITE-TestMaxTokenLenTokenizer-seed#[3A59F308DE6DF91]-worker)
[    ] o.a.s.SolrTestCaseJ4 Randomized ssl (true) and clientAuth (true) via: @org.apache.solr.util.RandomizeSSL(reason="",
ssl=0.0/0.0, value=0.0/0.0, clientAuth=0.0/0.0)
   [junit4]   2> 283710 INFO  (SUITE-TestMaxTokenLenTokenizer-seed#[3A59F308DE6DF91]-worker)
[    ] o.a.s.SolrTestCaseJ4 ####initCore
   [junit4]   2> 283710 INFO  (SUITE-TestMaxTokenLenTokenizer-seed#[3A59F308DE6DF91]-worker)
[    ] o.a.s.c.SolrResourceLoader [null] Added 2 libs to classloader, from paths: [/home/jenkins/workspace/Lucene-Solr-6.x-Linux/solr/core/src/test-files/solr/collection1/lib,
/home/jenkins/workspace/Lucene-Solr-6.x-Linux/solr/core/src/test-files/solr/collection1/lib/classes]
   [junit4]   2> 283730 INFO  (SUITE-TestMaxTokenLenTokenizer-seed#[3A59F308DE6DF91]-worker)
[    ] o.a.s.c.SolrConfig Using Lucene MatchVersion: 6.7.0
   [junit4]   2> 283759 INFO  (SUITE-TestMaxTokenLenTokenizer-seed#[3A59F308DE6DF91]-worker)
[    ] o.a.s.s.IndexSchema [null] Schema name=test
   [junit4]   2> 283764 INFO  (SUITE-TestMaxTokenLenTokenizer-seed#[3A59F308DE6DF91]-worker)
[    ] o.a.s.s.IndexSchema Loaded schema test/1.0 with uniqueid field id
   [junit4]   2> 283768 INFO  (SUITE-TestMaxTokenLenTokenizer-seed#[3A59F308DE6DF91]-worker)
[    ] o.a.s.u.UpdateShardHandler Creating UpdateShardHandler HTTP client with params: socketTimeout=30000&connTimeout=30000&retry=true
   [junit4]   2> 283789 INFO  (SUITE-TestMaxTokenLenTokenizer-seed#[3A59F308DE6DF91]-worker)
[    ] o.a.s.m.r.SolrJmxReporter JMX monitoring for 'solr.node' (registry 'solr.node') enabled
at server: com.sun.jmx.mbeanserver.JmxMBeanServer@a7c99c
   [junit4]   2> 283792 INFO  (SUITE-TestMaxTokenLenTokenizer-seed#[3A59F308DE6DF91]-worker)
[    ] o.a.s.m.r.SolrJmxReporter JMX monitoring for 'solr.jvm' (registry 'solr.jvm') enabled
at server: com.sun.jmx.mbeanserver.JmxMBeanServer@a7c99c
   [junit4]   2> 283792 INFO  (SUITE-TestMaxTokenLenTokenizer-seed#[3A59F308DE6DF91]-worker)
[    ] o.a.s.m.r.SolrJmxReporter JMX monitoring for 'solr.jetty' (registry 'solr.jetty') enabled
at server: com.sun.jmx.mbeanserver.JmxMBeanServer@a7c99c
   [junit4]   2> 283793 INFO  (coreLoadExecutor-1797-thread-1) [    ] o.a.s.c.SolrResourceLoader
[null] Added 2 libs to classloader, from paths: [/home/jenkins/workspace/Lucene-Solr-6.x-Linux/solr/core/src/test-files/solr/collection1/lib,
/home/jenkins/workspace/Lucene-Solr-6.x-Linux/solr/core/src/test-files/solr/collection1/lib/classes]
   [junit4]   2> 283826 INFO  (coreLoadExecutor-1797-thread-1) [    ] o.a.s.c.SolrConfig
Using Lucene MatchVersion: 6.7.0
   [junit4]   2> 283840 INFO  (coreLoadExecutor-1797-thread-1) [    ] o.a.s.s.IndexSchema
[collection1] Schema name=test
   [junit4]   2> 283851 INFO  (coreLoadExecutor-1797-thread-1) [    ] o.a.s.s.IndexSchema
Loaded schema test/1.0 with uniqueid field id
   [junit4]   2> 283851 INFO  (coreLoadExecutor-1797-thread-1) [    ] o.a.s.c.CoreContainer
Creating SolrCore 'collection1' using configuration from instancedir /home/jenkins/workspace/Lucene-Solr-6.x-Linux/solr/core/src/test-files/solr/collection1,
trusted=true
   [junit4]   2> 283851 INFO  (coreLoadExecutor-1797-thread-1) [    ] o.a.s.m.r.SolrJmxReporter
JMX monitoring for 'solr.core.collection1' (registry 'solr.core.collection1') enabled at server:
com.sun.jmx.mbeanserver.JmxMBeanServer@a7c99c
   [junit4]   2> 283851 INFO  (coreLoadExecutor-1797-thread-1) [    ] o.a.s.c.SolrCore
solr.RecoveryStrategy.Builder
   [junit4]   2> 283851 INFO  (coreLoadExecutor-1797-thread-1) [    ] o.a.s.c.SolrCore
[[collection1] ] Opening new SolrCore at [/home/jenkins/workspace/Lucene-Solr-6.x-Linux/solr/core/src/test-files/solr/collection1],
dataDir=[/home/jenkins/workspace/Lucene-Solr-6.x-Linux/solr/build/solr-core/test/J1/temp/solr.util.TestMaxTokenLenTokenizer_3A59F308DE6DF91-001/init-core-data-001/]
   [junit4]   2> 283852 INFO  (coreLoadExecutor-1797-thread-1) [    ] o.a.s.u.RandomMergePolicy
RandomMergePolicy wrapping class org.apache.lucene.index.TieredMergePolicy: [TieredMergePolicy:
maxMergeAtOnce=48, maxMergeAtOnceExplicit=41, maxMergedSegmentMB=52.455078125, floorSegmentMB=1.0869140625,
forceMergeDeletesPctAllowed=1.0868761006020256, segmentsPerTier=24.0, maxCFSSegmentSizeMB=8.796093022207999E12,
noCFSRatio=0.47007671490056147
   [junit4]   2> 283958 INFO  (coreLoadExecutor-1797-thread-1) [    ] o.a.s.u.CommitTracker
Hard AutoCommit: disabled
   [junit4]   2> 283958 INFO  (coreLoadExecutor-1797-thread-1) [    ] o.a.s.u.CommitTracker
Soft AutoCommit: disabled
   [junit4]   2> 283958 INFO  (coreLoadExecutor-1797-thread-1) [    ] o.a.s.u.RandomMergePolicy
RandomMergePolicy wrapping class org.apache.lucene.index.AlcoholicMergePolicy: [AlcoholicMergePolicy:
minMergeSize=0, mergeFactor=10, maxMergeSize=1830004057, maxMergeSizeForForcedMerge=9223372036854775807,
calibrateSizeByDeletes=true, maxMergeDocs=2147483647, maxCFSSegmentSizeMB=8.796093022207999E12,
noCFSRatio=0.1]
   [junit4]   2> 283958 INFO  (coreLoadExecutor-1797-thread-1) [    ] o.a.s.s.SolrIndexSearcher
Opening [Searcher@1d35e89[collection1] main]
   [junit4]   2> 283959 WARN  (coreLoadExecutor-1797-thread-1) [    ] o.a.s.r.ManagedResourceStorage
Cannot write to config directory /home/jenkins/workspace/Lucene-Solr-6.x-Linux/solr/core/src/test-files/solr/collection1/conf;
switching to use InMemory storage instead.
   [junit4]   2> 283966 INFO  (coreLoadExecutor-1797-thread-1) [    ] o.a.s.h.ReplicationHandler
Commits will be reserved for  10000
   [junit4]   2> 283967 INFO  (searcherExecutor-1798-thread-1) [    ] o.a.s.c.SolrCore
[collection1] Registered new searcher Searcher@1d35e89[collection1] main{ExitableDirectoryReader(UninvertingDirectoryReader())}
   [junit4]   2> 283967 INFO  (SUITE-TestMaxTokenLenTokenizer-seed#[3A59F308DE6DF91]-worker)
[    ] o.a.s.SolrTestCaseJ4 ####initCore end
   [junit4]   2> 283969 INFO  (TEST-TestMaxTokenLenTokenizer.testSingleFieldSameAnalyzers-seed#[3A59F308DE6DF91])
[    ] o.a.s.SolrTestCaseJ4 ###Starting testSingleFieldSameAnalyzers
   [junit4]   2> 283969 INFO  (TEST-TestMaxTokenLenTokenizer.testSingleFieldSameAnalyzers-seed#[3A59F308DE6DF91])
[    ] o.a.s.u.DirectUpdateHandler2 [collection1] REMOVING ALL DOCUMENTS FROM INDEX
   [junit4]   2> 283969 INFO  (TEST-TestMaxTokenLenTokenizer.testSingleFieldSameAnalyzers-seed#[3A59F308DE6DF91])
[    ] o.a.s.u.p.LogUpdateProcessorFactory [collection1]  webapp=null path=null params={_version_=-9223372036854775807&update.distrib=FROMLEADER&versions=true&wt=json&indent=true}{deleteByQuery=*:*}
0 0
   [junit4]   2> 283970 INFO  (TEST-TestMaxTokenLenTokenizer.testSingleFieldSameAnalyzers-seed#[3A59F308DE6DF91])
[    ] o.a.s.u.DirectUpdateHandler2 start commit{,optimize=false,openSearcher=true,waitSearcher=true,expungeDeletes=false,softCommit=false,prepareCommit=false}
   [junit4]   2> 283970 INFO  (TEST-TestMaxTokenLenTokenizer.testSingleFieldSameAnalyzers-seed#[3A59F308DE6DF91])
[    ] o.a.s.u.SolrIndexWriter Calling setCommitData with IW:org.apache.solr.update.SolrIndexWriter@18f9154
   [junit4]   2> 283972 INFO  (TEST-TestMaxTokenLenTokenizer.testSingleFieldSameAnalyzers-seed#[3A59F308DE6DF91])
[    ] o.a.s.s.SolrIndexSearcher Opening [Searcher@ac346f[collection1] main]
   [junit4]   2> 283972 INFO  (TEST-TestMaxTokenLenTokenizer.testSingleFieldSameAnalyzers-seed#[3A59F308DE6DF91])
[    ] o.a.s.u.DirectUpdateHandler2 end_commit_flush
   [junit4]   2> 283973 INFO  (searcherExecutor-1798-thread-1) [    ] o.a.s.c.SolrCore
[collection1] Registered new searcher Searcher@ac346f[collection1] main{ExitableDirectoryReader(UninvertingDirectoryReader(Uninverting(_0(6.7.0):C1)))}
   [junit4]   2> 283973 INFO  (TEST-TestMaxTokenLenTokenizer.testSingleFieldSameAnalyzers-seed#[3A59F308DE6DF91])
[    ] o.a.s.u.p.LogUpdateProcessorFactory [collection1]  webapp=null path=null params={wt=json&indent=true}{add=[1],commit=}
0 3
   [junit4]   2> 283973 INFO  (TEST-TestMaxTokenLenTokenizer.testSingleFieldSameAnalyzers-seed#[3A59F308DE6DF91])
[    ] o.a.s.u.DirectUpdateHandler2 start commit{,optimize=false,openSearcher=true,waitSearcher=true,expungeDeletes=false,softCommit=false,prepareCommit=false}
   [junit4]   2> 283973 INFO  (TEST-TestMaxTokenLenTokenizer.testSingleFieldSameAnalyzers-seed#[3A59F308DE6DF91])
[    ] o.a.s.u.SolrIndexWriter Calling setCommitData with IW:org.apache.solr.update.SolrIndexWriter@18f9154
   [junit4]   2> 283974 INFO  (TEST-TestMaxTokenLenTokenizer.testSingleFieldSameAnalyzers-seed#[3A59F308DE6DF91])
[    ] o.a.s.s.SolrIndexSearcher Opening [Searcher@120afc[collection1] main]
   [junit4]   2> 283975 INFO  (TEST-TestMaxTokenLenTokenizer.testSingleFieldSameAnalyzers-seed#[3A59F308DE6DF91])
[    ] o.a.s.u.DirectUpdateHandler2 end_commit_flush
   [junit4]   2> 283975 INFO  (searcherExecutor-1798-thread-1) [    ] o.a.s.c.SolrCore
[collection1] Registered new searcher Searcher@120afc[collection1] main{ExitableDirectoryReader(UninvertingDirectoryReader(Uninverting(_0(6.7.0):C1)
Uninverting(_1(6.7.0):C1)))}
   [junit4]   2> 283975 INFO  (TEST-TestMaxTokenLenTokenizer.testSingleFieldSameAnalyzers-seed#[3A59F308DE6DF91])
[    ] o.a.s.u.p.LogUpdateProcessorFactory [collection1]  webapp=null path=null params={wt=json&indent=true}{add=[2],commit=}
0 2
   [junit4]   2> 283976 INFO  (TEST-TestMaxTokenLenTokenizer.testSingleFieldSameAnalyzers-seed#[3A59F308DE6DF91])
[    ] o.a.s.u.DirectUpdateHandler2 start commit{,optimize=false,openSearcher=true,waitSearcher=true,expungeDeletes=false,softCommit=false,prepareCommit=false}
   [junit4]   2> 283976 INFO  (TEST-TestMaxTokenLenTokenizer.testSingleFieldSameAnalyzers-seed#[3A59F308DE6DF91])
[    ] o.a.s.u.SolrIndexWriter Calling setCommitData with IW:org.apache.solr.update.SolrIndexWriter@18f9154
   [junit4]   2> 283977 INFO  (TEST-TestMaxTokenLenTokenizer.testSingleFieldSameAnalyzers-seed#[3A59F308DE6DF91])
[    ] o.a.s.s.SolrIndexSearcher Opening [Searcher@1c2cd06[collection1] main]
   [junit4]   2> 283978 INFO  (TEST-TestMaxTokenLenTokenizer.testSingleFieldSameAnalyzers-seed#[3A59F308DE6DF91])
[    ] o.a.s.u.DirectUpdateHandler2 end_commit_flush
   [junit4]   2> 283978 INFO  (searcherExecutor-1798-thread-1) [    ] o.a.s.c.SolrCore
[collection1] Registered new searcher Searcher@1c2cd06[collection1] main{ExitableDirectoryReader(UninvertingDirectoryReader(Uninverting(_0(6.7.0):C1)
Uninverting(_1(6.7.0):C1) Uninverting(_2(6.7.0):C1)))}
   [junit4]   2> 283978 INFO  (TEST-TestMaxTokenLenTokenizer.testSingleFieldSameAnalyzers-seed#[3A59F308DE6DF91])
[    ] o.a.s.u.p.LogUpdateProcessorFactory [collection1]  webapp=null path=null params={wt=json&indent=true}{add=[3],commit=}
0 2
   [junit4]   2> 283978 INFO  (TEST-TestMaxTokenLenTokenizer.testSingleFieldSameAnalyzers-seed#[3A59F308DE6DF91])
[    ] o.a.s.u.DirectUpdateHandler2 start commit{,optimize=false,openSearcher=true,waitSearcher=true,expungeDeletes=false,softCommit=false,prepareCommit=false}
   [junit4]   2> 283978 INFO  (TEST-TestMaxTokenLenTokenizer.testSingleFieldSameAnalyzers-seed#[3A59F308DE6DF91])
[    ] o.a.s.u.SolrIndexWriter Calling setCommitData with IW:org.apache.solr.update.SolrIndexWriter@18f9154
   [junit4]   2> 283980 INFO  (TEST-TestMaxTokenLenTokenizer.testSingleFieldSameAnalyzers-seed#[3A59F308DE6DF91])
[    ] o.a.s.s.SolrIndexSearcher Opening [Searcher@70a08[collection1] main]
   [junit4]   2> 283980 INFO  (TEST-TestMaxTokenLenTokenizer.testSingleFieldSameAnalyzers-seed#[3A59F308DE6DF91])
[    ] o.a.s.u.DirectUpdateHandler2 end_commit_flush
   [junit4]   2> 283980 INFO  (searcherExecutor-1798-thread-1) [    ] o.a.s.c.SolrCore
[collection1] Registered new searcher Searcher@70a08[collection1] main{ExitableDirectoryReader(UninvertingDirectoryReader(Uninverting(_0(6.7.0):C1)
Uninverting(_1(6.7.0):C1) Uninverting(_2(6.7.0):C1) Uninverting(_3(6.7.0):C1)))}
   [junit4]   2> 283980 INFO  (TEST-TestMaxTokenLenTokenizer.testSingleFieldSameAnalyzers-seed#[3A59F308DE6DF91])
[    ] o.a.s.u.p.LogUpdateProcessorFactory [collection1]  webapp=null path=null params={wt=json&indent=true}{add=[4],commit=}
0 2
   [junit4]   2> 283981 INFO  (TEST-TestMaxTokenLenTokenizer.testSingleFieldSameAnalyzers-seed#[3A59F308DE6DF91])
[    ] o.a.s.u.DirectUpdateHandler2 start commit{,optimize=false,openSearcher=true,waitSearcher=true,expungeDeletes=false,softCommit=false,prepareCommit=false}
   [junit4]   2> 283981 INFO  (TEST-TestMaxTokenLenTokenizer.testSingleFieldSameAnalyzers-seed#[3A59F308DE6DF91])
[    ] o.a.s.u.SolrIndexWriter Calling setCommitData with IW:org.apache.solr.update.SolrIndexWriter@18f9154
   [junit4]   2> 283982 INFO  (TEST-TestMaxTokenLenTokenizer.testSingleFieldSameAnalyzers-seed#[3A59F308DE6DF91])
[    ] o.a.s.s.SolrIndexSearcher Opening [Searcher@1e907f7[collection1] main]
   [junit4]   2> 283983 INFO  (TEST-TestMaxTokenLenTokenizer.testSingleFieldSameAnalyzers-seed#[3A59F308DE6DF91])
[    ] o.a.s.u.DirectUpdateHandler2 end_commit_flush
   [junit4]   2> 283983 INFO  (searcherExecutor-1798-thread-1) [    ] o.a.s.c.SolrCore
[collection1] Registered new searcher Searcher@1e907f7[collection1] main{ExitableDirectoryReader(UninvertingDirectoryReader(Uninverting(_0(6.7.0):C1)
Uninverting(_1(6.7.0):C1) Uninverting(_2(6.7.0):C1) Uninverting(_3(6.7.0):C1) Uninverting(_4(6.7.0):C1)))}
   [junit4]   2> 283983 INFO  (TEST-TestMaxTokenLenTokenizer.testSingleFieldSameAnalyzers-seed#[3A59F308DE6DF91])
[    ] o.a.s.u.p.LogUpdateProcessorFactory [collection1]  webapp=null path=null params={wt=json&indent=true}{add=[5],commit=}
0 2
   [junit4]   2> 283983 INFO  (TEST-TestMaxTokenLenTokenizer.testSingleFieldSameAnalyzers-seed#[3A59F308DE6DF91])
[    ] o.a.s.u.DirectUpdateHandler2 start commit{,optimize=false,openSearcher=true,waitSearcher=true,expungeDeletes=false,softCommit=false,prepareCommit=false}
   [junit4]   2> 283983 INFO  (TEST-TestMaxTokenLenTokenizer.testSingleFieldSameAnalyzers-seed#[3A59F308DE6DF91])
[    ] o.a.s.u.DirectUpdateHandler2 No uncommitted changes. Skipping IW.commit.
   [junit4]   2> 283983 INFO  (TEST-TestMaxTokenLenTokenizer.testSingleFieldSameAnalyzers-seed#[3A59F308DE6DF91])
[    ] o.a.s.u.DirectUpdateHandler2 end_commit_flush
   [junit4]   2> 283983 INFO  (TEST-TestMaxTokenLenTokenizer.testSingleFieldSameAnalyzers-seed#[3A59F308DE6DF91])
[    ] o.a.s.u.p.LogUpdateProcessorFactory [collection1]  webapp=null path=null params={}{commit=}
0 0
   [junit4]   2> 283985 INFO  (TEST-TestMaxTokenLenTokenizer.testSingleFieldSameAnalyzers-seed#[3A59F308DE6DF91])
[    ] o.a.s.c.S.Request [collection1]  webapp=null path=null params={q=*:*&wt=xml} hits=5
status=0 QTime=0
   [junit4]   2> 283986 INFO  (TEST-TestMaxTokenLenTokenizer.testSingleFieldSameAnalyzers-seed#[3A59F308DE6DF91])
[    ] o.a.s.c.S.Request [collection1]  webapp=null path=null params={q=letter0:l&wt=xml}
hits=0 status=0 QTime=0
   [junit4]   2> 283987 INFO  (TEST-TestMaxTokenLenTokenizer.testSingleFieldSameAnalyzers-seed#[3A59F308DE6DF91])
[    ] o.a.s.c.S.Request [collection1]  webapp=null path=null params={q=letter0:let&wt=xml}
hits=1 status=0 QTime=0
   [junit4]   2> 283987 INFO  (TEST-TestMaxTokenLenTokenizer.testSingleFieldSameAnalyzers-seed#[3A59F308DE6DF91])
[    ] o.a.s.c.S.Request [collection1]  webapp=null path=null params={q=letter0:lett&wt=xml}
hits=0 status=0 QTime=0
   [junit4]   2> 283988 ERROR (TEST-TestMaxTokenLenTokenizer.testSingleFieldSameAnalyzers-seed#[3A59F308DE6DF91])
[    ] o.a.s.SolrTestCaseJ4 REQUEST FAILED: xpath=//result[@numFound=1]
   [junit4]   2> 	xml response was: <?xml version="1.0" encoding="UTF-8"?>
   [junit4]   2> <response>
   [junit4]   2> <lst name="responseHeader"><int name="status">0</int><int
name="QTime">0</int></lst><result name="response" numFound="0" start="0"></result>
   [junit4]   2> </response>
   [junit4]   2> 
   [junit4]   2> 	request was:q=letter0:lett&wt=xml
   [junit4]   2> 283988 ERROR (TEST-TestMaxTokenLenTokenizer.testSingleFieldSameAnalyzers-seed#[3A59F308DE6DF91])
[    ] o.a.s.SolrTestCaseJ4 REQUEST FAILED: q=letter0:lett&wt=xml:java.lang.RuntimeException:
REQUEST FAILED: xpath=//result[@numFound=1]
   [junit4]   2> 	xml response was: <?xml version="1.0" encoding="UTF-8"?>
   [junit4]   2> <response>
   [junit4]   2> <lst name="responseHeader"><int name="status">0</int><int
name="QTime">0</int></lst><result name="response" numFound="0" start="0"></result>
   [junit4]   2> </response>
   [junit4]   2> 
   [junit4]   2> 	request was:q=letter0:lett&wt=xml
   [junit4]   2> 	at org.apache.solr.SolrTestCaseJ4.assertQ(SolrTestCaseJ4.java:888)
   [junit4]   2> 	at org.apache.solr.util.TestMaxTokenLenTokenizer.testSingleFieldSameAnalyzers(TestMaxTokenLenTokenizer.java:104)
   [junit4]   2> 	at java.base/jdk.internal.reflect.NativeMethodAccessorImpl.invoke0(Native
Method)
   [junit4]   2> 	at java.base/jdk.internal.reflect.NativeMethodAccessorImpl.invoke(NativeMethodAccessorImpl.java:62)
   [junit4]   2> 	at java.base/jdk.internal.reflect.DelegatingMethodAccessorImpl.invoke(DelegatingMethodAccessorImpl.java:43)
   [junit4]   2> 	at java.base/java.lang.reflect.Method.invoke(Method.java:563)
   [junit4]   2> 	at com.carrotsearch.randomizedtesting.RandomizedRunner.invoke(RandomizedRunner.java:1713)
   [junit4]   2> 	at com.carrotsearch.randomizedtesting.RandomizedRunner$8.evaluate(RandomizedRunner.java:907)
   [junit4]   2> 	at com.carrotsearch.randomizedtesting.RandomizedRunner$9.evaluate(RandomizedRunner.java:943)
   [junit4]   2> 	at com.carrotsearch.randomizedtesting.RandomizedRunner$10.evaluate(RandomizedRunner.java:957)
   [junit4]   2> 	at com.carrotsearch.randomizedtesting.rules.SystemPropertiesRestoreRule$1.evaluate(SystemPropertiesRestoreRule.java:57)
   [junit4]   2> 	at org.apache.lucene.util.TestRuleSetupTeardownChained$1.evaluate(TestRuleSetupTeardownChained.java:49)
   [junit4]   2> 	at org.apache.lucene.util.AbstractBeforeAfterRule$1.evaluate(AbstractBeforeAfterRule.java:45)
   [junit4]   2> 	at org.apache.lucene.util.TestRuleThreadAndTestName$1.evaluate(TestRuleThreadAndTestName.java:48)
   [junit4]   2> 	at org.apache.lucene.util.TestRuleIgnoreAfterMaxFailures$1.evaluate(TestRuleIgnoreAfterMaxFailures.java:64)
   [junit4]   2> 	at org.apache.lucene.util.TestRuleMarkFailure$1.evaluate(TestRuleMarkFailure.java:47)
   [junit4]   2> 	at com.carrotsearch.randomizedtesting.rules.StatementAdapter.evaluate(StatementAdapter.java:36)
   [junit4]   2> 	at com.carrotsearch.randomizedtesting.ThreadLeakControl$StatementRunner.run(ThreadLeakControl.java:368)
   [junit4]   2> 	at com.carrotsearch.randomizedtesting.ThreadLeakControl.forkTimeoutingTask(ThreadLeakControl.java:817)
   [junit4]   2> 	at com.carrotsearch.randomizedtesting.ThreadLeakControl$3.evaluate(ThreadLeakControl.java:468)
   [junit4]   2> 	at com.carrotsearch.randomizedtesting.RandomizedRunner.runSingleTest(RandomizedRunner.java:916)
   [junit4]   2> 	at com.carrotsearch.randomizedtesting.RandomizedRunner$5.evaluate(RandomizedRunner.java:802)
   [junit4]   2> 	at com.carrotsearch.randomizedtesting.RandomizedRunner$6.evaluate(RandomizedRunner.java:852)
   [junit4]   2> 	at com.carrotsearch.randomizedtesting.RandomizedRunner$7.evaluate(RandomizedRunner.java:863)
   [junit4]   2> 	at com.carrotsearch.randomizedtesting.rules.StatementAdapter.evaluate(StatementAdapter.java:36)
   [junit4]   2> 	at com.carrotsearch.randomizedtesting.rules.SystemPropertiesRestoreRule$1.evaluate(SystemPropertiesRestoreRule.java:57)
   [junit4]   2> 	at org.apache.lucene.util.AbstractBeforeAfterRule$1.evaluate(AbstractBeforeAfterRule.java:45)
   [junit4]   2> 	at com.carrotsearch.randomizedtesting.rules.StatementAdapter.evaluate(StatementAdapter.java:36)
   [junit4]   2> 	at org.apache.lucene.util.TestRuleStoreClassName$1.evaluate(TestRuleStoreClassName.java:41)
   [junit4]   2> 	at com.carrotsearch.randomizedtesting.rules.NoShadowingOrOverridesOnMethodsRule$1.evaluate(NoShadowingOrOverridesOnMethodsRule.java:40)
   [junit4]   2> 	at com.carrotsearch.randomizedtesting.rules.NoShadowingOrOverridesOnMethodsRule$1.evaluate(NoShadowingOrOverridesOnMethodsRule.java:40)
   [junit4]   2> 	at com.carrotsearch.randomizedtesting.rules.StatementAdapter.evaluate(StatementAdapter.java:36)
   [junit4]   2> 	at com.carrotsearch.randomizedtesting.rules.StatementAdapter.evaluate(StatementAdapter.java:36)
   [junit4]   2> 	at org.apache.lucene.util.TestRuleAssertionsRequired$1.evaluate(TestRuleAssertionsRequired.java:53)
   [junit4]   2> 	at org.apache.lucene.util.TestRuleMarkFailure$1.evaluate(TestRuleMarkFailure.java:47)
   [junit4]   2> 	at org.apache.lucene.util.TestRuleIgnoreAfterMaxFailures$1.evaluate(TestRuleIgnoreAfterMaxFailures.java:64)
   [junit4]   2> 	at org.apache.lucene.util.TestRuleIgnoreTestSuites$1.evaluate(TestRuleIgnoreTestSuites.java:54)
   [junit4]   2> 	at com.carrotsearch.randomizedtesting.rules.StatementAdapter.evaluate(StatementAdapter.java:36)
   [junit4]   2> 	at com.carrotsearch.randomizedtesting.ThreadLeakControl$StatementRunner.run(ThreadLeakControl.java:368)
   [junit4]   2> 	at java.base/java.lang.Thread.run(Thread.java:844)
   [junit4]   2> 
   [junit4]   2> 283988 INFO  (TEST-TestMaxTokenLenTokenizer.testSingleFieldSameAnalyzers-seed#[3A59F308DE6DF91])
[    ] o.a.s.SolrTestCaseJ4 ###Ending testSingleFieldSameAnalyzers
   [junit4]   2> NOTE: reproduce with: ant test  -Dtestcase=TestMaxTokenLenTokenizer -Dtests.method=testSingleFieldSameAnalyzers
-Dtests.seed=3A59F308DE6DF91 -Dtests.multiplier=3 -Dtests.slow=true -Dtests.locale=de-CH -Dtests.timezone=Africa/Mogadishu
-Dtests.asserts=true -Dtests.file.encoding=UTF-8
   [junit4] ERROR   0.02s J1 | TestMaxTokenLenTokenizer.testSingleFieldSameAnalyzers <<<
   [junit4]    > Throwable #1: java.lang.RuntimeException: Exception during query
   [junit4]    > 	at __randomizedtesting.SeedInfo.seed([3A59F308DE6DF91:6977A05FD5050F5E]:0)
   [junit4]    > 	at org.apache.solr.SolrTestCaseJ4.assertQ(SolrTestCaseJ4.java:895)
   [junit4]    > 	at org.apache.solr.util.TestMaxTokenLenTokenizer.testSingleFieldSameAnalyzers(TestMaxTokenLenTokenizer.java:104)
   [junit4]    > 	at java.base/jdk.internal.reflect.NativeMethodAccessorImpl.invoke0(Native
Method)
   [junit4]    > 	at java.base/jdk.internal.reflect.NativeMethodAccessorImpl.invoke(NativeMethodAccessorImpl.java:62)
   [junit4]    > 	at java.base/jdk.internal.reflect.DelegatingMethodAccessorImpl.invoke(DelegatingMethodAccessorImpl.java:43)
   [junit4]    > 	at java.base/java.lang.reflect.Method.invoke(Method.java:563)
   [junit4]    > 	at java.base/java.lang.Thread.run(Thread.java:844)
   [junit4]    > Caused by: java.lang.RuntimeException: REQUEST FAILED: xpath=//result[@numFound=1]
   [junit4]    > 	xml response was: <?xml version="1.0" encoding="UTF-8"?>
   [junit4]    > <response>
   [junit4]    > <lst name="responseHeader"><int name="status">0</int><int
name="QTime">0</int></lst><result name="response" numFound="0" start="0"></result>
   [junit4]    > </response>
   [junit4]    > 	request was:q=letter0:lett&wt=xml
   [junit4]    > 	at org.apache.solr.SolrTestCaseJ4.assertQ(SolrTestCaseJ4.java:888)
   [junit4]    > 	... 39 more
   [junit4]   2> 283992 INFO  (TEST-TestMaxTokenLenTokenizer.testSingleFieldDiffAnalyzers-seed#[3A59F308DE6DF91])
[    ] o.a.s.SolrTestCaseJ4 ###Starting testSingleFieldDiffAnalyzers
   [junit4]   2> 283992 INFO  (TEST-TestMaxTokenLenTokenizer.testSingleFieldDiffAnalyzers-seed#[3A59F308DE6DF91])
[    ] o.a.s.u.DirectUpdateHandler2 [collection1] REMOVING ALL DOCUMENTS FROM INDEX
   [junit4]   2> 283992 INFO  (TEST-TestMaxTokenLenTokenizer.testSingleFieldDiffAnalyzers-seed#[3A59F308DE6DF91])
[    ] o.a.s.u.p.LogUpdateProcessorFactory [collection1]  webapp=null path=null params={_version_=-9223372036854775807&update.distrib=FROMLEADER&versions=true&wt=json&indent=true}{deleteByQuery=*:*}
0 0
   [junit4]   2> 283992 INFO  (TEST-TestMaxTokenLenTokenizer.testSingleFieldDiffAnalyzers-seed#[3A59F308DE6DF91])
[    ] o.a.s.u.DirectUpdateHandler2 start commit{,optimize=false,openSearcher=true,waitSearcher=true,expungeDeletes=false,softCommit=false,prepareCommit=false}
   [junit4]   2> 283992 INFO  (TEST-TestMaxTokenLenTokenizer.testSingleFieldDiffAnalyzers-seed#[3A59F308DE6DF91])
[    ] o.a.s.u.SolrIndexWriter Calling setCommitData with IW:org.apache.solr.update.SolrIndexWriter@18f9154
   [junit4]   2> 284017 INFO  (TEST-TestMaxTokenLenTokenizer.testSingleFieldDiffAnalyzers-seed#[3A59F308DE6DF91])
[    ] o.a.s.s.SolrIndexSearcher Opening [Searcher@141a5fd[collection1] main]
   [junit4]   2> 284017 INFO  (TEST-TestMaxTokenLenTokenizer.testSingleFieldDiffAnalyzers-seed#[3A59F308DE6DF91])
[    ] o.a.s.u.DirectUpdateHandler2 end_commit_flush
   [junit4]   2> 284021 INFO  (searcherExecutor-1798-thread-1) [    ] o.a.s.c.SolrCore
[collection1] Registered new searcher Searcher@141a5fd[collection1] main{ExitableDirectoryReader(UninvertingDirectoryReader(Uninverting(_5(6.7.0):C1)))}
   [junit4]   2> 284023 INFO  (TEST-TestMaxTokenLenTokenizer.testSingleFieldDiffAnalyzers-seed#[3A59F308DE6DF91])
[    ] o.a.s.u.p.LogUpdateProcessorFactory [collection1]  webapp=null path=null params={wt=json&indent=true}{add=[1],commit=}
0 31
   [junit4]   2> 284023 INFO  (TEST-TestMaxTokenLenTokenizer.testSingleFieldDiffAnalyzers-seed#[3A59F308DE6DF91])
[    ] o.a.s.u.DirectUpdateHandler2 start commit{,optimize=false,openSearcher=true,waitSearcher=true,expungeDeletes=false,softCommit=false,prepareCommit=false}
   [junit4]   2> 284024 INFO  (TEST-TestMaxTokenLenTokenizer.testSingleFieldDiffAnalyzers-seed#[3A59F308DE6DF91])
[    ] o.a.s.u.SolrIndexWriter Calling setCommitData with IW:org.apache.solr.update.SolrIndexWriter@18f9154
   [junit4]   2> 284026 INFO  (TEST-TestMaxTokenLenTokenizer.testSingleFieldDiffAnalyzers-seed#[3A59F308DE6DF91])
[    ] o.a.s.s.SolrIndexSearcher Opening [Searcher@c352c7[collection1] main]
   [junit4]   2> 284026 INFO  (TEST-TestMaxTokenLenTokenizer.testSingleFieldDiffAnalyzers-seed#[3A59F308DE6DF91])
[    ] o.a.s.u.DirectUpdateHandler2 end_commit_flush
   [junit4]   2> 284027 INFO  (searcherExecutor-1798-thread-1) [    ] o.a.s.c.SolrCore
[collection1] Registered new searcher Searcher@c352c7[collection1] main{ExitableDirectoryReader(UninvertingDirectoryReader(Uninverting(_5(6.7.0):C1)
Uninverting(_6(6.7.0):C1)))}
   [junit4]   2> 284027 INFO  (TEST-TestMaxTokenLenTokenizer.testSingleFieldDiffAnalyzers-seed#[3A59F308DE6DF91])
[    ] o.a.s.u.p.LogUpdateProcessorFactory [collection1]  webapp=null path=null params={wt=json&indent=true}{add=[2],commit=}
0 3
   [junit4]   2> 284027 INFO  (TEST-TestMaxTokenLenTokenizer.testSingleFieldDiffAnalyzers-seed#[3A59F308DE6DF91])
[    ] o.a.s.u.DirectUpdateHandler2 start commit{,optimize=false,openSearcher=true,waitSearcher=true,expungeDeletes=false,softCommit=false,prepareCommit=false}
   [junit4]   2> 284027 INFO  (TEST-TestMaxTokenLenTokenizer.testSingleFieldDiffAnalyzers-seed#[3A59F308DE6DF91])
[    ] o.a.s.u.SolrIndexWriter Calling setCommitData with IW:org.apache.solr.update.SolrIndexWriter@18f9154
   [junit4]   2> 284028 INFO  (TEST-TestMaxTokenLenTokenizer.testSingleFieldDiffAnalyzers-seed#[3A59F308DE6DF91])
[    ] o.a.s.s.SolrIndexSearcher Opening [Searcher@1052c15[collection1] main]
   [junit4]   2> 284029 INFO  (TEST-TestMaxTokenLenTokenizer.testSingleFieldDiffAnalyzers-seed#[3A59F308DE6DF91])
[    ] o.a.s.u.DirectUpdateHandler2 end_commit_flush
   [junit4]   2> 284029 INFO  (searcherExecutor-1798-thread-1) [    ] o.a.s.c.SolrCore
[collection1] Registered new searcher Searcher@1052c15[collection1] main{ExitableDirectoryReader(UninvertingDirectoryReader(Uninverting(_5(6.7.0):C1)
Uninverting(_6(6.7.0):C1) Uninverting(_7(6.7.0):C1)))}
   [junit4]   2> 284029 INFO  (TEST-TestMaxTokenLenTokenizer.testSingleFieldDiffAnalyzers-seed#[3A59F308DE6DF91])
[    ] o.a.s.u.p.LogUpdateProcessorFactory [collection1]  webapp=null path=null params={wt=json&indent=true}{add=[3],commit=}
0 2
   [junit4]   2> 284030 INFO  (TEST-TestMaxTokenLenTokenizer.testSingleFieldDiffAnalyzers-seed#[3A59F308DE6DF91])
[    ] o.a.s.u.DirectUpdateHandler2 start commit{,optimize=false,openSearcher=true,waitSearcher=true,expungeDeletes=false,softCommit=false,prepareCommit=false}
   [junit4]   2> 284030 INFO  (TEST-TestMaxTokenLenTokenizer.testSingleFieldDiffAnalyzers-seed#[3A59F308DE6DF91])
[    ] o.a.s.u.SolrIndexWriter Calling setCommitData with IW:org.apache.solr.update.SolrIndexWriter@18f9154
   [junit4]   2> 284031 INFO  (TEST-TestMaxTokenLenTokenizer.testSingleFieldDiffAnalyzers-seed#[3A59F308DE6DF91])
[    ] o.a.s.s.SolrIndexSearcher Opening [Searcher@c28f49[collection1] main]
   [junit4]   2> 284035 INFO  (TEST-TestMaxTokenLenTokenizer.testSingleFieldDiffAnalyzers-seed#[3A59F308DE6DF91])
[    ] o.a.s.u.DirectUpdateHandler2 end_commit_flush
   [junit4]   2> 284035 INFO  (searcherExecutor-1798-thread-1) [    ] o.a.s.c.SolrCore
[collection1] Registered new searcher Searcher@c28f49[collection1] main{ExitableDirectoryReader(UninvertingDirectoryReader(Uninverting(_5(6.7.0):C1)
Uninverting(_6(6.7.0):C1) Uninverting(_7(6.7.0):C1) Uninverting(_8(6.7.0):C1)))}
   [junit4]   2> 284035 INFO  (TEST-TestMaxTokenLenTokenizer.testSingleFieldDiffAnalyzers-seed#[3A59F308DE6DF91])
[    ] o.a.s.u.p.LogUpdateProcessorFactory [collection1]  webapp=null path=null params={wt=json&indent=true}{add=[4],commit=}
0 6
   [junit4]   2> 284036 INFO  (TEST-TestMaxTokenLenTokenizer.testSingleFieldDiffAnalyzers-seed#[3A59F308DE6DF91])
[    ] o.a.s.u.DirectUpdateHandler2 start commit{,optimize=false,openSearcher=true,waitSearcher=true,expungeDeletes=false,softCommit=false,prepareCommit=false}
   [junit4]   2> 284036 INFO  (TEST-TestMaxTokenLenTokenizer.testSingleFieldDiffAnalyzers-seed#[3A59F308DE6DF91])
[    ] o.a.s.u.SolrIndexWriter Calling setCommitData with IW:org.apache.solr.update.SolrIndexWriter@18f9154
   [junit4]   2> 284037 INFO  (TEST-TestMaxTokenLenTokenizer.testSingleFieldDiffAnalyzers-seed#[3A59F308DE6DF91])
[    ] o.a.s.s.SolrIndexSearcher Opening [Searcher@1b422fa[collection1] main]
   [junit4]   2> 284038 INFO  (TEST-TestMaxTokenLenTokenizer.testSingleFieldDiffAnalyzers-seed#[3A59F308DE6DF91])
[    ] o.a.s.u.DirectUpdateHandler2 end_commit_flush
   [junit4]   2> 284039 INFO  (searcherExecutor-1798-thread-1) [    ] o.a.s.c.SolrCore
[collection1] Registered new searcher Searcher@1b422fa[collection1] main{ExitableDirectoryReader(UninvertingDirectoryReader(Uninverting(_5(6.7.0):C1)
Uninverting(_6(6.7.0):C1) Uninverting(_7(6.7.0):C1) Uninverting(_8(6.7.0):C1) Uninverting(_9(6.7.0):C1)))}
   [junit4]   2> 284040 INFO  (TEST-TestMaxTokenLenTokenizer.testSingleFieldDiffAnalyzers-seed#[3A59F308DE6DF91])
[    ] o.a.s.u.p.LogUpdateProcessorFactory [collection1]  webapp=null path=null params={wt=json&indent=true}{add=[5],commit=}
0 4
   [junit4]   2> 284040 INFO  (TEST-TestMaxTokenLenTokenizer.testSingleFieldDiffAnalyzers-seed#[3A59F308DE6DF91])
[    ] o.a.s.u.DirectUpdateHandler2 start commit{,optimize=false,openSearcher=true,waitSearcher=true,expungeDeletes=false,softCommit=false,prepareCommit=false}
   [junit4]   2> 284040 INFO  (TEST-TestMaxTokenLenTokenizer.testSingleFieldDiffAnalyzers-seed#[3A59F308DE6DF91])
[    ] o.a.s.u.DirectUpdateHandler2 No uncommitted changes. Skipping IW.commit.
   [junit4]   2> 284040 INFO  (TEST-TestMaxTokenLenTokenizer.testSingleFieldDiffAnalyzers-seed#[3A59F308DE6DF91])
[    ] o.a.s.u.DirectUpdateHandler2 end_commit_flush
   [junit4]   2> 284040 INFO  (TEST-TestMaxTokenLenTokenizer.testSingleFieldDiffAnalyzers-seed#[3A59F308DE6DF91])
[    ] o.a.s.u.p.LogUpdateProcessorFactory [collection1]  webapp=null path=null params={}{commit=}
0 0
   [junit4]   2> 284041 INFO  (TEST-TestMaxTokenLenTokenizer.testSingleFieldDiffAnalyzers-seed#[3A59F308DE6DF91])
[    ] o.a.s.c.S.Request [collection1]  webapp=null path=null params={q=*:*&wt=xml} hits=5
status=0 QTime=0
   [junit4]   2> 284042 INFO  (TEST-TestMaxTokenLenTokenizer.testSingleFieldDiffAnalyzers-seed#[3A59F308DE6DF91])
[    ] o.a.s.c.S.Request [collection1]  webapp=null path=null params={q=letter:let&wt=xml}
hits=1 status=0 QTime=0
   [junit4]   2> 284042 INFO  (TEST-TestMaxTokenLenTokenizer.testSingleFieldDiffAnalyzers-seed#[3A59F308DE6DF91])
[    ] o.a.s.c.S.Request [collection1]  webapp=null path=null params={q=letter:lett&wt=xml}
hits=0 status=0 QTime=0
   [junit4]   2> 284044 INFO  (TEST-TestMaxTokenLenTokenizer.testSingleFieldDiffAnalyzers-seed#[3A59F308DE6DF91])
[    ] o.a.s.c.S.Request [collection1]  webapp=null path=null params={q=lowerCase:low&wt=xml}
hits=1 status=0 QTime=1
   [junit4]   2> 284046 INFO  (TEST-TestMaxTokenLenTokenizer.testSingleFieldDiffAnalyzers-seed#[3A59F308DE6DF91])
[    ] o.a.s.c.S.Request [collection1]  webapp=null path=null params={q=lowerCase:l&wt=xml}
hits=0 status=0 QTime=1
   [junit4]   2> 284047 INFO  (TEST-TestMaxTokenLenTokenizer.testSingleFieldDiffAnalyzers-seed#[3A59F308DE6DF91])
[    ] o.a.s.c.S.Request [collection1]  webapp=null path=null params={q=lowerCase:lo&wt=xml}
hits=0 status=0 QTime=0
   [junit4]   2> 284047 INFO  (TEST-TestMaxTokenLenTokenizer.testSingleFieldDiffAnalyzers-seed#[3A59F308DE6DF91])
[    ] o.a.s.c.S.Request [collection1]  webapp=null path=null params={q=lowerCase:lower&wt=xml}
hits=0 status=0 QTime=0
   [junit4]   2> 284048 INFO  (TEST-TestMaxTokenLenTokenizer.testSingleFieldDiffAnalyzers-seed#[3A59F308DE6DF91])
[    ] o.a.s.c.S.Request [collection1]  webapp=null path=null params={q=whiteSpace:whi&wt=xml}
hits=1 status=0 QTime=0
   [junit4]   2> 284048 INFO  (TEST-TestMaxTokenLenTokenizer.testSingleFieldDiffAnalyzers-seed#[3A59F308DE6DF91])
[    ] o.a.s.c.S.Request [collection1]  webapp=null path=null params={q=whiteSpace:teS&wt=xml}
hits=1 status=0 QTime=0
   [junit4]   2> 284049 INFO  (TEST-TestMaxTokenLenTokenizer.testSingleFieldDiffAnalyzers-seed#[3A59F308DE6DF91])
[    ] o.a.s.c.S.Request [collection1]  webapp=null path=null params={q=whiteSpace:in&wt=xml}
hits=1 status=0 QTime=0
   [junit4]   2> 284049 INFO  (TEST-TestMaxTokenLenTokenizer.testSingleFieldDiffAnalyzers-seed#[3A59F308DE6DF91])
[    ] o.a.s.c.S.Request [collection1]  webapp=null path=null params={q=whiteSpace:white&wt=xml}
hits=0 status=0 QTime=0
   [junit4]   2> 284050 INFO  (TEST-TestMaxTokenLenTokenizer.testSingleFieldDiffAnalyzers-seed#[3A59F308DE6DF91])
[    ] o.a.s.c.S.Request [collection1]  webapp=null path=null params={q=unicodeWhiteSpace:uni&wt=xml}
hits=1 status=0 QTime=0
   [junit4]   2> 284050 INFO  (TEST-TestMaxTokenLenTokenizer.testSingleFieldDiffAnalyzers-seed#[3A59F308DE6DF91])
[    ] o.a.s.c.S.Request [collection1]  webapp=null path=null params={q=unicodeWhiteSpace:cod&wt=xml}
hits=1 status=0 QTime=0
   [junit4]   2> 284051 INFO  (TEST-TestMaxTokenLenTokenizer.testSingleFieldDiffAnalyzers-seed#[3A59F308DE6DF91])
[    ] o.a.s.c.S.Request [collection1]  webapp=null path=null params={q=unicodeWhiteSpace:e&wt=xml}
hits=1 status=0 QTime=0
   [junit4]   2> 284051 INFO  (TEST-TestMaxTokenLenTokenizer.testSingleFieldDiffAnalyzers-seed#[3A59F308DE6DF91])
[    ] o.a.s.c.S.Request [collection1]  webapp=null path=null params={q=unicodeWhiteSpace:unico&wt=xml}
hits=0 status=0 QTime=0
   [junit4]   2> 284051 INFO  (TEST-TestMaxTokenLenTokenizer.testSingleFieldDiffAnalyzers-seed#[3A59F308DE6DF91])
[    ] o.a.s.c.S.Request [collection1]  webapp=null path=null params={q=keyword:keyword&wt=xml}
hits=1 status=0 QTime=0
   [junit4]   2> 284052 INFO  (TEST-TestMaxTokenLenTokenizer.testSingleFieldDiffAnalyzers-seed#[3A59F308DE6DF91])
[    ] o.a.s.c.S.Request [collection1]  webapp=null path=null params={q=keyword:key&wt=xml}
hits=0 status=0 QTime=0
   [junit4]   2> 284052 INFO  (TEST-TestMaxTokenLenTokenizer.testSingleFieldDiffAnalyzers-seed#[3A59F308DE6DF91])
[    ] o.a.s.SolrTestCaseJ4 ###Ending testSingleFieldDiffAnalyzers
   [junit4]   2> 284052 INFO  (SUITE-TestMaxTokenLenTokenizer-seed#[3A59F308DE6DF91]-worker)
[    ] o.a.s.SolrTestCaseJ4 ###deleteCore
   [junit4]   2> 284052 INFO  (SUITE-TestMaxTokenLenTokenizer-seed#[3A59F308DE6DF91]-worker)
[    ] o.a.s.c.CoreContainer Shutting down CoreContainer instance=25470346
   [junit4]   2> 284052 INFO  (SUITE-TestMaxTokenLenTokenizer-seed#[3A59F308DE6DF91]-worker)
[    ] o.a.s.m.SolrMetricManager Closing metric reporters for: solr.node
   [junit4]   2> 284053 INFO  (SUITE-TestMaxTokenLenTokenizer-seed#[3A59F308DE6DF91]-worker)
[    ] o.a.s.m.SolrMetricManager Closing metric reporters for: solr.jvm
   [junit4]   2> 284054 INFO  (SUITE-TestMaxTokenLenTokenizer-seed#[3A59F308DE6DF91]-worker)
[    ] o.a.s.m.SolrMetricManager Closing metric reporters for: solr.jetty
   [junit4]   2> 284055 INFO  (SUITE-TestMaxTokenLenTokenizer-seed#[3A59F308DE6DF91]-worker)
[    ] o.a.s.c.TransientSolrCoreCacheDefault Allocating transient cache for 2147483647 transient
cores
   [junit4]   2> 284055 INFO  (coreCloseExecutor-1802-thread-1) [    ] o.a.s.c.SolrCore
[collection1]  CLOSING SolrCore org.apache.solr.core.SolrCore@1384213
   [junit4]   2> 284056 INFO  (coreCloseExecutor-1802-thread-1) [    ] o.a.s.m.SolrMetricManager
Closing metric reporters for: solr.core.collection1
   [junit4]   2> NOTE: leaving temporary files on disk at: /home/jenkins/workspace/Lucene-Solr-6.x-Linux/solr/build/solr-core/test/J1/temp/solr.util.TestMaxTokenLenTokenizer_3A59F308DE6DF91-001
   [junit4]   2> NOTE: test params are: codec=CheapBastard, sim=RandomSimilarity(queryNorm=true,coord=crazy):
{}, locale=de-CH, timezone=Africa/Mogadishu
   [junit4]   2> NOTE: Linux 4.10.0-21-generic i386/Oracle Corporation 9-ea (32-bit)/cpus=8,threads=1,free=79472104,total=210657280
   [junit4]   2> NOTE: All tests run in this JVM: [TestSolrCloudWithDelegationTokens, SegmentsInfoRequestHandlerTest,
BlockCacheTest, TestStressCloudBlindAtomicUpdates, TestQueryTypes, TestCursorMarkWithoutUniqueKey,
TestPivotHelperCode, SolrMetricReporterTest, TestSystemIdResolver, ChaosMonkeySafeLeaderTest,
TestStressVersions, RAMDirectoryFactoryTest, SearchHandlerTest, DateMathParserTest, HttpSolrCallGetCoreTest,
DistributedMLTComponentTest, OutOfBoxZkACLAndCredentialsProvidersTest, SampleTest, BlockJoinFacetSimpleTest,
SpellCheckCollatorTest, TestDeleteCollectionOnDownNodes, TestExclusionRuleCollectionAccess,
TestCollectionAPIs, IndexSchemaRuntimeFieldTest, DeleteReplicaTest, TestCoreContainer, IndexBasedSpellCheckerTest,
TestFuzzyAnalyzedSuggestions, MergeStrategyTest, TestPerFieldSimilarityClassic, SoftAutoCommitTest,
SolrIndexSplitterTest, TestLMDirichletSimilarityFactory, MultiTermTest, AddSchemaFieldsUpdateProcessorFactoryTest,
SpellCheckCollatorWithCollapseTest, TestConfigSetsAPIExclusivity, TestChildDocTransformer,
SchemaVersionSpecificBehaviorTest, LeaderInitiatedRecoveryOnShardRestartTest, TestManagedSchema,
DateRangeFieldTest, TestCloudDeleteByQuery, CdcrBootstrapTest, TestEmbeddedSolrServerConstructors,
TestLuceneMatchVersion, TestMaxTokenLenTokenizer]
   [junit4] Completed [136/715 (1!)] on J1 in 0.37s, 2 tests, 1 error <<< FAILURES!

[...truncated 38194 lines...]

Mime
View raw message