lucene-dev mailing list archives

Site index · List index
Message view « Date » · « Thread »
Top « Date » · « Thread »
From Policeman Jenkins Server <jenk...@thetaphi.de>
Subject [JENKINS] Lucene-Solr-6.x-Linux (64bit/jdk1.8.0_131) - Build # 3635 - Still Unstable!
Date Thu, 01 Jun 2017 04:20:17 GMT
Build: https://jenkins.thetaphi.de/job/Lucene-Solr-6.x-Linux/3635/
Java: 64bit/jdk1.8.0_131 -XX:+UseCompressedOops -XX:+UseParallelGC

1 tests failed.
FAILED:  org.apache.solr.util.TestMaxTokenLenTokenizer.testSingleFieldSameAnalyzers

Error Message:
Exception during query

Stack Trace:
java.lang.RuntimeException: Exception during query
	at __randomizedtesting.SeedInfo.seed([3677784A92508F17:5CA54725CAB35FD8]:0)
	at org.apache.solr.SolrTestCaseJ4.assertQ(SolrTestCaseJ4.java:895)
	at org.apache.solr.util.TestMaxTokenLenTokenizer.testSingleFieldSameAnalyzers(TestMaxTokenLenTokenizer.java:104)
	at sun.reflect.NativeMethodAccessorImpl.invoke0(Native Method)
	at sun.reflect.NativeMethodAccessorImpl.invoke(NativeMethodAccessorImpl.java:62)
	at sun.reflect.DelegatingMethodAccessorImpl.invoke(DelegatingMethodAccessorImpl.java:43)
	at java.lang.reflect.Method.invoke(Method.java:498)
	at com.carrotsearch.randomizedtesting.RandomizedRunner.invoke(RandomizedRunner.java:1713)
	at com.carrotsearch.randomizedtesting.RandomizedRunner$8.evaluate(RandomizedRunner.java:907)
	at com.carrotsearch.randomizedtesting.RandomizedRunner$9.evaluate(RandomizedRunner.java:943)
	at com.carrotsearch.randomizedtesting.RandomizedRunner$10.evaluate(RandomizedRunner.java:957)
	at com.carrotsearch.randomizedtesting.rules.SystemPropertiesRestoreRule$1.evaluate(SystemPropertiesRestoreRule.java:57)
	at org.apache.lucene.util.TestRuleSetupTeardownChained$1.evaluate(TestRuleSetupTeardownChained.java:49)
	at org.apache.lucene.util.AbstractBeforeAfterRule$1.evaluate(AbstractBeforeAfterRule.java:45)
	at org.apache.lucene.util.TestRuleThreadAndTestName$1.evaluate(TestRuleThreadAndTestName.java:48)
	at org.apache.lucene.util.TestRuleIgnoreAfterMaxFailures$1.evaluate(TestRuleIgnoreAfterMaxFailures.java:64)
	at org.apache.lucene.util.TestRuleMarkFailure$1.evaluate(TestRuleMarkFailure.java:47)
	at com.carrotsearch.randomizedtesting.rules.StatementAdapter.evaluate(StatementAdapter.java:36)
	at com.carrotsearch.randomizedtesting.ThreadLeakControl$StatementRunner.run(ThreadLeakControl.java:368)
	at com.carrotsearch.randomizedtesting.ThreadLeakControl.forkTimeoutingTask(ThreadLeakControl.java:817)
	at com.carrotsearch.randomizedtesting.ThreadLeakControl$3.evaluate(ThreadLeakControl.java:468)
	at com.carrotsearch.randomizedtesting.RandomizedRunner.runSingleTest(RandomizedRunner.java:916)
	at com.carrotsearch.randomizedtesting.RandomizedRunner$5.evaluate(RandomizedRunner.java:802)
	at com.carrotsearch.randomizedtesting.RandomizedRunner$6.evaluate(RandomizedRunner.java:852)
	at com.carrotsearch.randomizedtesting.RandomizedRunner$7.evaluate(RandomizedRunner.java:863)
	at com.carrotsearch.randomizedtesting.rules.StatementAdapter.evaluate(StatementAdapter.java:36)
	at com.carrotsearch.randomizedtesting.rules.SystemPropertiesRestoreRule$1.evaluate(SystemPropertiesRestoreRule.java:57)
	at org.apache.lucene.util.AbstractBeforeAfterRule$1.evaluate(AbstractBeforeAfterRule.java:45)
	at com.carrotsearch.randomizedtesting.rules.StatementAdapter.evaluate(StatementAdapter.java:36)
	at org.apache.lucene.util.TestRuleStoreClassName$1.evaluate(TestRuleStoreClassName.java:41)
	at com.carrotsearch.randomizedtesting.rules.NoShadowingOrOverridesOnMethodsRule$1.evaluate(NoShadowingOrOverridesOnMethodsRule.java:40)
	at com.carrotsearch.randomizedtesting.rules.NoShadowingOrOverridesOnMethodsRule$1.evaluate(NoShadowingOrOverridesOnMethodsRule.java:40)
	at com.carrotsearch.randomizedtesting.rules.StatementAdapter.evaluate(StatementAdapter.java:36)
	at com.carrotsearch.randomizedtesting.rules.StatementAdapter.evaluate(StatementAdapter.java:36)
	at com.carrotsearch.randomizedtesting.rules.StatementAdapter.evaluate(StatementAdapter.java:36)
	at org.apache.lucene.util.TestRuleAssertionsRequired$1.evaluate(TestRuleAssertionsRequired.java:53)
	at org.apache.lucene.util.TestRuleMarkFailure$1.evaluate(TestRuleMarkFailure.java:47)
	at org.apache.lucene.util.TestRuleIgnoreAfterMaxFailures$1.evaluate(TestRuleIgnoreAfterMaxFailures.java:64)
	at org.apache.lucene.util.TestRuleIgnoreTestSuites$1.evaluate(TestRuleIgnoreTestSuites.java:54)
	at com.carrotsearch.randomizedtesting.rules.StatementAdapter.evaluate(StatementAdapter.java:36)
	at com.carrotsearch.randomizedtesting.ThreadLeakControl$StatementRunner.run(ThreadLeakControl.java:368)
	at java.lang.Thread.run(Thread.java:748)
Caused by: java.lang.RuntimeException: REQUEST FAILED: xpath=//result[@numFound=1]
	xml response was: <?xml version="1.0" encoding="UTF-8"?>
<response>
<lst name="responseHeader"><int name="status">0</int><int name="QTime">9</int></lst><result
name="response" numFound="0" start="0"></result>
</response>

	request was:q=letter0:lett&wt=xml
	at org.apache.solr.SolrTestCaseJ4.assertQ(SolrTestCaseJ4.java:888)
	... 40 more




Build Log:
[...truncated 11044 lines...]
   [junit4] Suite: org.apache.solr.util.TestMaxTokenLenTokenizer
   [junit4]   2> Creating dataDir: /home/jenkins/workspace/Lucene-Solr-6.x-Linux/solr/build/solr-core/test/J1/temp/solr.util.TestMaxTokenLenTokenizer_3677784A92508F17-001/init-core-data-001
   [junit4]   2> 58189 WARN  (SUITE-TestMaxTokenLenTokenizer-seed#[3677784A92508F17]-worker)
[    ] o.a.s.SolrTestCaseJ4 startTrackingSearchers: numOpens=7 numCloses=7
   [junit4]   2> 58189 INFO  (SUITE-TestMaxTokenLenTokenizer-seed#[3677784A92508F17]-worker)
[    ] o.a.s.SolrTestCaseJ4 Using TrieFields
   [junit4]   2> 58190 INFO  (SUITE-TestMaxTokenLenTokenizer-seed#[3677784A92508F17]-worker)
[    ] o.a.s.SolrTestCaseJ4 Randomized ssl (true) and clientAuth (true) via: @org.apache.solr.util.RandomizeSSL(reason=,
value=NaN, ssl=NaN, clientAuth=NaN)
   [junit4]   2> 58191 INFO  (SUITE-TestMaxTokenLenTokenizer-seed#[3677784A92508F17]-worker)
[    ] o.a.s.SolrTestCaseJ4 ####initCore
   [junit4]   2> 58192 INFO  (SUITE-TestMaxTokenLenTokenizer-seed#[3677784A92508F17]-worker)
[    ] o.a.s.c.SolrResourceLoader [null] Added 2 libs to classloader, from paths: [/home/jenkins/workspace/Lucene-Solr-6.x-Linux/solr/core/src/test-files/solr/collection1/lib,
/home/jenkins/workspace/Lucene-Solr-6.x-Linux/solr/core/src/test-files/solr/collection1/lib/classes]
   [junit4]   2> 58211 WARN  (SUITE-TestMaxTokenLenTokenizer-seed#[3677784A92508F17]-worker)
[    ] o.a.s.c.Config Beginning with Solr 5.5, <mergePolicy> is deprecated, use <mergePolicyFactory>
instead.
   [junit4]   2> 58219 INFO  (SUITE-TestMaxTokenLenTokenizer-seed#[3677784A92508F17]-worker)
[    ] o.a.s.c.SolrConfig Using Lucene MatchVersion: 6.7.0
   [junit4]   2> 58232 INFO  (SUITE-TestMaxTokenLenTokenizer-seed#[3677784A92508F17]-worker)
[    ] o.a.s.s.IndexSchema [null] Schema name=test
   [junit4]   2> 58237 INFO  (SUITE-TestMaxTokenLenTokenizer-seed#[3677784A92508F17]-worker)
[    ] o.a.s.s.IndexSchema Loaded schema test/1.0 with uniqueid field id
   [junit4]   2> 58239 INFO  (SUITE-TestMaxTokenLenTokenizer-seed#[3677784A92508F17]-worker)
[    ] o.a.s.u.UpdateShardHandler Creating UpdateShardHandler HTTP client with params: socketTimeout=30000&connTimeout=30000&retry=true
   [junit4]   2> 58253 INFO  (SUITE-TestMaxTokenLenTokenizer-seed#[3677784A92508F17]-worker)
[    ] o.a.s.m.r.SolrJmxReporter JMX monitoring for 'solr.node' (registry 'solr.node') enabled
at server: com.sun.jmx.mbeanserver.JmxMBeanServer@2c6d088
   [junit4]   2> 58255 INFO  (SUITE-TestMaxTokenLenTokenizer-seed#[3677784A92508F17]-worker)
[    ] o.a.s.m.r.SolrJmxReporter JMX monitoring for 'solr.jvm' (registry 'solr.jvm') enabled
at server: com.sun.jmx.mbeanserver.JmxMBeanServer@2c6d088
   [junit4]   2> 58255 INFO  (SUITE-TestMaxTokenLenTokenizer-seed#[3677784A92508F17]-worker)
[    ] o.a.s.m.r.SolrJmxReporter JMX monitoring for 'solr.jetty' (registry 'solr.jetty') enabled
at server: com.sun.jmx.mbeanserver.JmxMBeanServer@2c6d088
   [junit4]   2> 58260 INFO  (coreLoadExecutor-339-thread-1) [    x:collection1] o.a.s.c.SolrResourceLoader
[null] Added 2 libs to classloader, from paths: [/home/jenkins/workspace/Lucene-Solr-6.x-Linux/solr/core/src/test-files/solr/collection1/lib,
/home/jenkins/workspace/Lucene-Solr-6.x-Linux/solr/core/src/test-files/solr/collection1/lib/classes]
   [junit4]   2> 58287 WARN  (coreLoadExecutor-339-thread-1) [    x:collection1] o.a.s.c.Config
Beginning with Solr 5.5, <mergePolicy> is deprecated, use <mergePolicyFactory>
instead.
   [junit4]   2> 58288 INFO  (coreLoadExecutor-339-thread-1) [    x:collection1] o.a.s.c.SolrConfig
Using Lucene MatchVersion: 6.7.0
   [junit4]   2> 58302 INFO  (coreLoadExecutor-339-thread-1) [    x:collection1] o.a.s.s.IndexSchema
[collection1] Schema name=test
   [junit4]   2> 58307 INFO  (coreLoadExecutor-339-thread-1) [    x:collection1] o.a.s.s.IndexSchema
Loaded schema test/1.0 with uniqueid field id
   [junit4]   2> 58307 INFO  (coreLoadExecutor-339-thread-1) [    x:collection1] o.a.s.c.CoreContainer
Creating SolrCore 'collection1' using configuration from instancedir /home/jenkins/workspace/Lucene-Solr-6.x-Linux/solr/core/src/test-files/solr/collection1,
trusted=true
   [junit4]   2> 58308 INFO  (coreLoadExecutor-339-thread-1) [    x:collection1] o.a.s.m.r.SolrJmxReporter
JMX monitoring for 'solr.core.collection1' (registry 'solr.core.collection1') enabled at server:
com.sun.jmx.mbeanserver.JmxMBeanServer@2c6d088
   [junit4]   2> 58308 INFO  (coreLoadExecutor-339-thread-1) [    x:collection1] o.a.s.c.SolrCore
solr.RecoveryStrategy.Builder
   [junit4]   2> 58308 INFO  (coreLoadExecutor-339-thread-1) [    x:collection1] o.a.s.c.SolrCore
[[collection1] ] Opening new SolrCore at [/home/jenkins/workspace/Lucene-Solr-6.x-Linux/solr/core/src/test-files/solr/collection1],
dataDir=[/home/jenkins/workspace/Lucene-Solr-6.x-Linux/solr/build/solr-core/test/J1/temp/solr.util.TestMaxTokenLenTokenizer_3677784A92508F17-001/init-core-data-001/]
   [junit4]   2> 58309 INFO  (coreLoadExecutor-339-thread-1) [    x:collection1] o.a.s.u.RandomMergePolicy
RandomMergePolicy wrapping class org.apache.lucene.index.LogDocMergePolicy: [LogDocMergePolicy:
minMergeSize=1000, mergeFactor=23, maxMergeSize=9223372036854775807, maxMergeSizeForForcedMerge=9223372036854775807,
calibrateSizeByDeletes=false, maxMergeDocs=2147483647, maxCFSSegmentSizeMB=8.796093022207999E12,
noCFSRatio=0.6972819723554022]
   [junit4]   2> 58503 INFO  (coreLoadExecutor-339-thread-1) [    x:collection1] o.a.s.u.CommitTracker
Hard AutoCommit: disabled
   [junit4]   2> 58503 INFO  (coreLoadExecutor-339-thread-1) [    x:collection1] o.a.s.u.CommitTracker
Soft AutoCommit: disabled
   [junit4]   2> 58505 INFO  (coreLoadExecutor-339-thread-1) [    x:collection1] o.a.s.u.RandomMergePolicy
RandomMergePolicy wrapping class org.apache.lucene.index.AlcoholicMergePolicy: [AlcoholicMergePolicy:
minMergeSize=0, mergeFactor=10, maxMergeSize=341244005, maxMergeSizeForForcedMerge=9223372036854775807,
calibrateSizeByDeletes=true, maxMergeDocs=2147483647, maxCFSSegmentSizeMB=8.796093022207999E12,
noCFSRatio=0.1]
   [junit4]   2> 58506 INFO  (coreLoadExecutor-339-thread-1) [    x:collection1] o.a.s.s.SolrIndexSearcher
Opening [Searcher@21f71b6e[collection1] main]
   [junit4]   2> 58506 WARN  (coreLoadExecutor-339-thread-1) [    x:collection1] o.a.s.r.ManagedResourceStorage
Cannot write to config directory /home/jenkins/workspace/Lucene-Solr-6.x-Linux/solr/core/src/test-files/solr/collection1/conf;
switching to use InMemory storage instead.
   [junit4]   2> 58513 INFO  (coreLoadExecutor-339-thread-1) [    x:collection1] o.a.s.h.ReplicationHandler
Commits will be reserved for  10000
   [junit4]   2> 58513 INFO  (searcherExecutor-340-thread-1-processing-x:collection1) [
   x:collection1] o.a.s.c.SolrCore [collection1] Registered new searcher Searcher@21f71b6e[collection1]
main{ExitableDirectoryReader(UninvertingDirectoryReader())}
   [junit4]   2> 58515 INFO  (SUITE-TestMaxTokenLenTokenizer-seed#[3677784A92508F17]-worker)
[    ] o.a.s.SolrTestCaseJ4 ####initCore end
   [junit4]   2> 58516 INFO  (TEST-TestMaxTokenLenTokenizer.testSingleFieldDiffAnalyzers-seed#[3677784A92508F17])
[    ] o.a.s.SolrTestCaseJ4 ###Starting testSingleFieldDiffAnalyzers
   [junit4]   2> 58517 INFO  (TEST-TestMaxTokenLenTokenizer.testSingleFieldDiffAnalyzers-seed#[3677784A92508F17])
[    ] o.a.s.u.DirectUpdateHandler2 [collection1] REMOVING ALL DOCUMENTS FROM INDEX
   [junit4]   2> 58517 INFO  (TEST-TestMaxTokenLenTokenizer.testSingleFieldDiffAnalyzers-seed#[3677784A92508F17])
[    ] o.a.s.u.p.LogUpdateProcessorFactory [collection1]  webapp=null path=null params={_version_=-9223372036854775807&update.distrib=FROMLEADER&versions=true&wt=json&indent=true}{deleteByQuery=*:*}
0 0
   [junit4]   2> 58525 INFO  (TEST-TestMaxTokenLenTokenizer.testSingleFieldDiffAnalyzers-seed#[3677784A92508F17])
[    ] o.a.s.u.DirectUpdateHandler2 start commit{,optimize=false,openSearcher=true,waitSearcher=true,expungeDeletes=false,softCommit=false,prepareCommit=false}
   [junit4]   2> 58525 INFO  (TEST-TestMaxTokenLenTokenizer.testSingleFieldDiffAnalyzers-seed#[3677784A92508F17])
[    ] o.a.s.u.SolrIndexWriter Calling setCommitData with IW:org.apache.solr.update.SolrIndexWriter@636fcefc
   [junit4]   2> 58530 INFO  (TEST-TestMaxTokenLenTokenizer.testSingleFieldDiffAnalyzers-seed#[3677784A92508F17])
[    ] o.a.s.s.SolrIndexSearcher Opening [Searcher@7f927ba8[collection1] main]
   [junit4]   2> 58531 INFO  (TEST-TestMaxTokenLenTokenizer.testSingleFieldDiffAnalyzers-seed#[3677784A92508F17])
[    ] o.a.s.u.DirectUpdateHandler2 end_commit_flush
   [junit4]   2> 58531 INFO  (searcherExecutor-340-thread-1) [    ] o.a.s.c.SolrCore [collection1]
Registered new searcher Searcher@7f927ba8[collection1] main{ExitableDirectoryReader(UninvertingDirectoryReader(Uninverting(_0(6.7.0):C1)))}
   [junit4]   2> 58531 INFO  (TEST-TestMaxTokenLenTokenizer.testSingleFieldDiffAnalyzers-seed#[3677784A92508F17])
[    ] o.a.s.u.p.LogUpdateProcessorFactory [collection1]  webapp=null path=null params={wt=json&indent=true}{add=[1],commit=}
0 13
   [junit4]   2> 58532 INFO  (TEST-TestMaxTokenLenTokenizer.testSingleFieldDiffAnalyzers-seed#[3677784A92508F17])
[    ] o.a.s.u.DirectUpdateHandler2 start commit{,optimize=false,openSearcher=true,waitSearcher=true,expungeDeletes=false,softCommit=false,prepareCommit=false}
   [junit4]   2> 58532 INFO  (TEST-TestMaxTokenLenTokenizer.testSingleFieldDiffAnalyzers-seed#[3677784A92508F17])
[    ] o.a.s.u.SolrIndexWriter Calling setCommitData with IW:org.apache.solr.update.SolrIndexWriter@636fcefc
   [junit4]   2> 58534 INFO  (TEST-TestMaxTokenLenTokenizer.testSingleFieldDiffAnalyzers-seed#[3677784A92508F17])
[    ] o.a.s.s.SolrIndexSearcher Opening [Searcher@7df97b9a[collection1] main]
   [junit4]   2> 58535 INFO  (TEST-TestMaxTokenLenTokenizer.testSingleFieldDiffAnalyzers-seed#[3677784A92508F17])
[    ] o.a.s.u.DirectUpdateHandler2 end_commit_flush
   [junit4]   2> 58535 INFO  (searcherExecutor-340-thread-1) [    ] o.a.s.c.SolrCore [collection1]
Registered new searcher Searcher@7df97b9a[collection1] main{ExitableDirectoryReader(UninvertingDirectoryReader(Uninverting(_0(6.7.0):C1)
Uninverting(_1(6.7.0):C1)))}
   [junit4]   2> 58535 INFO  (TEST-TestMaxTokenLenTokenizer.testSingleFieldDiffAnalyzers-seed#[3677784A92508F17])
[    ] o.a.s.u.p.LogUpdateProcessorFactory [collection1]  webapp=null path=null params={wt=json&indent=true}{add=[2],commit=}
0 3
   [junit4]   2> 58536 INFO  (TEST-TestMaxTokenLenTokenizer.testSingleFieldDiffAnalyzers-seed#[3677784A92508F17])
[    ] o.a.s.u.DirectUpdateHandler2 start commit{,optimize=false,openSearcher=true,waitSearcher=true,expungeDeletes=false,softCommit=false,prepareCommit=false}
   [junit4]   2> 58536 INFO  (TEST-TestMaxTokenLenTokenizer.testSingleFieldDiffAnalyzers-seed#[3677784A92508F17])
[    ] o.a.s.u.SolrIndexWriter Calling setCommitData with IW:org.apache.solr.update.SolrIndexWriter@636fcefc
   [junit4]   2> 58538 INFO  (TEST-TestMaxTokenLenTokenizer.testSingleFieldDiffAnalyzers-seed#[3677784A92508F17])
[    ] o.a.s.s.SolrIndexSearcher Opening [Searcher@64d95a0e[collection1] main]
   [junit4]   2> 58539 INFO  (TEST-TestMaxTokenLenTokenizer.testSingleFieldDiffAnalyzers-seed#[3677784A92508F17])
[    ] o.a.s.u.DirectUpdateHandler2 end_commit_flush
   [junit4]   2> 58539 INFO  (searcherExecutor-340-thread-1) [    ] o.a.s.c.SolrCore [collection1]
Registered new searcher Searcher@64d95a0e[collection1] main{ExitableDirectoryReader(UninvertingDirectoryReader(Uninverting(_0(6.7.0):C1)
Uninverting(_1(6.7.0):C1) Uninverting(_2(6.7.0):C1)))}
   [junit4]   2> 58539 INFO  (TEST-TestMaxTokenLenTokenizer.testSingleFieldDiffAnalyzers-seed#[3677784A92508F17])
[    ] o.a.s.u.p.LogUpdateProcessorFactory [collection1]  webapp=null path=null params={wt=json&indent=true}{add=[3],commit=}
0 4
   [junit4]   2> 58540 INFO  (TEST-TestMaxTokenLenTokenizer.testSingleFieldDiffAnalyzers-seed#[3677784A92508F17])
[    ] o.a.s.u.DirectUpdateHandler2 start commit{,optimize=false,openSearcher=true,waitSearcher=true,expungeDeletes=false,softCommit=false,prepareCommit=false}
   [junit4]   2> 58540 INFO  (TEST-TestMaxTokenLenTokenizer.testSingleFieldDiffAnalyzers-seed#[3677784A92508F17])
[    ] o.a.s.u.SolrIndexWriter Calling setCommitData with IW:org.apache.solr.update.SolrIndexWriter@636fcefc
   [junit4]   2> 58542 INFO  (TEST-TestMaxTokenLenTokenizer.testSingleFieldDiffAnalyzers-seed#[3677784A92508F17])
[    ] o.a.s.s.SolrIndexSearcher Opening [Searcher@5f5300d3[collection1] main]
   [junit4]   2> 58543 INFO  (TEST-TestMaxTokenLenTokenizer.testSingleFieldDiffAnalyzers-seed#[3677784A92508F17])
[    ] o.a.s.u.DirectUpdateHandler2 end_commit_flush
   [junit4]   2> 58543 INFO  (searcherExecutor-340-thread-1) [    ] o.a.s.c.SolrCore [collection1]
Registered new searcher Searcher@5f5300d3[collection1] main{ExitableDirectoryReader(UninvertingDirectoryReader(Uninverting(_0(6.7.0):C1)
Uninverting(_1(6.7.0):C1) Uninverting(_2(6.7.0):C1) Uninverting(_3(6.7.0):C1)))}
   [junit4]   2> 58552 INFO  (TEST-TestMaxTokenLenTokenizer.testSingleFieldDiffAnalyzers-seed#[3677784A92508F17])
[    ] o.a.s.u.p.LogUpdateProcessorFactory [collection1]  webapp=null path=null params={wt=json&indent=true}{add=[4],commit=}
0 13
   [junit4]   2> 58553 INFO  (TEST-TestMaxTokenLenTokenizer.testSingleFieldDiffAnalyzers-seed#[3677784A92508F17])
[    ] o.a.s.u.DirectUpdateHandler2 start commit{,optimize=false,openSearcher=true,waitSearcher=true,expungeDeletes=false,softCommit=false,prepareCommit=false}
   [junit4]   2> 58553 INFO  (TEST-TestMaxTokenLenTokenizer.testSingleFieldDiffAnalyzers-seed#[3677784A92508F17])
[    ] o.a.s.u.SolrIndexWriter Calling setCommitData with IW:org.apache.solr.update.SolrIndexWriter@636fcefc
   [junit4]   2> 58556 INFO  (TEST-TestMaxTokenLenTokenizer.testSingleFieldDiffAnalyzers-seed#[3677784A92508F17])
[    ] o.a.s.s.SolrIndexSearcher Opening [Searcher@3594293b[collection1] main]
   [junit4]   2> 58556 INFO  (TEST-TestMaxTokenLenTokenizer.testSingleFieldDiffAnalyzers-seed#[3677784A92508F17])
[    ] o.a.s.u.DirectUpdateHandler2 end_commit_flush
   [junit4]   2> 58557 INFO  (searcherExecutor-340-thread-1) [    ] o.a.s.c.SolrCore [collection1]
Registered new searcher Searcher@3594293b[collection1] main{ExitableDirectoryReader(UninvertingDirectoryReader(Uninverting(_0(6.7.0):C1)
Uninverting(_1(6.7.0):C1) Uninverting(_2(6.7.0):C1) Uninverting(_3(6.7.0):C1) Uninverting(_4(6.7.0):C1)))}
   [junit4]   2> 58557 INFO  (TEST-TestMaxTokenLenTokenizer.testSingleFieldDiffAnalyzers-seed#[3677784A92508F17])
[    ] o.a.s.u.p.LogUpdateProcessorFactory [collection1]  webapp=null path=null params={wt=json&indent=true}{add=[5],commit=}
0 4
   [junit4]   2> 58557 INFO  (TEST-TestMaxTokenLenTokenizer.testSingleFieldDiffAnalyzers-seed#[3677784A92508F17])
[    ] o.a.s.u.DirectUpdateHandler2 start commit{,optimize=false,openSearcher=true,waitSearcher=true,expungeDeletes=false,softCommit=false,prepareCommit=false}
   [junit4]   2> 58557 INFO  (TEST-TestMaxTokenLenTokenizer.testSingleFieldDiffAnalyzers-seed#[3677784A92508F17])
[    ] o.a.s.u.DirectUpdateHandler2 No uncommitted changes. Skipping IW.commit.
   [junit4]   2> 58558 INFO  (TEST-TestMaxTokenLenTokenizer.testSingleFieldDiffAnalyzers-seed#[3677784A92508F17])
[    ] o.a.s.u.DirectUpdateHandler2 end_commit_flush
   [junit4]   2> 58558 INFO  (TEST-TestMaxTokenLenTokenizer.testSingleFieldDiffAnalyzers-seed#[3677784A92508F17])
[    ] o.a.s.u.p.LogUpdateProcessorFactory [collection1]  webapp=null path=null params={}{commit=}
0 0
   [junit4]   2> 58560 INFO  (TEST-TestMaxTokenLenTokenizer.testSingleFieldDiffAnalyzers-seed#[3677784A92508F17])
[    ] o.a.s.c.S.Request [collection1]  webapp=null path=null params={q=*:*&wt=xml} hits=5
status=0 QTime=0
   [junit4]   2> 58562 INFO  (TEST-TestMaxTokenLenTokenizer.testSingleFieldDiffAnalyzers-seed#[3677784A92508F17])
[    ] o.a.s.c.S.Request [collection1]  webapp=null path=null params={q=letter:let&wt=xml}
hits=1 status=0 QTime=1
   [junit4]   2> 58564 INFO  (TEST-TestMaxTokenLenTokenizer.testSingleFieldDiffAnalyzers-seed#[3677784A92508F17])
[    ] o.a.s.c.S.Request [collection1]  webapp=null path=null params={q=letter:lett&wt=xml}
hits=0 status=0 QTime=0
   [junit4]   2> 58564 INFO  (TEST-TestMaxTokenLenTokenizer.testSingleFieldDiffAnalyzers-seed#[3677784A92508F17])
[    ] o.a.s.c.S.Request [collection1]  webapp=null path=null params={q=lowerCase:low&wt=xml}
hits=1 status=0 QTime=0
   [junit4]   2> 58565 INFO  (TEST-TestMaxTokenLenTokenizer.testSingleFieldDiffAnalyzers-seed#[3677784A92508F17])
[    ] o.a.s.c.S.Request [collection1]  webapp=null path=null params={q=lowerCase:l&wt=xml}
hits=0 status=0 QTime=0
   [junit4]   2> 58566 INFO  (TEST-TestMaxTokenLenTokenizer.testSingleFieldDiffAnalyzers-seed#[3677784A92508F17])
[    ] o.a.s.c.S.Request [collection1]  webapp=null path=null params={q=lowerCase:lo&wt=xml}
hits=0 status=0 QTime=0
   [junit4]   2> 58567 INFO  (TEST-TestMaxTokenLenTokenizer.testSingleFieldDiffAnalyzers-seed#[3677784A92508F17])
[    ] o.a.s.c.S.Request [collection1]  webapp=null path=null params={q=lowerCase:lower&wt=xml}
hits=0 status=0 QTime=0
   [junit4]   2> 58568 INFO  (TEST-TestMaxTokenLenTokenizer.testSingleFieldDiffAnalyzers-seed#[3677784A92508F17])
[    ] o.a.s.c.S.Request [collection1]  webapp=null path=null params={q=whiteSpace:whi&wt=xml}
hits=1 status=0 QTime=0
   [junit4]   2> 58569 INFO  (TEST-TestMaxTokenLenTokenizer.testSingleFieldDiffAnalyzers-seed#[3677784A92508F17])
[    ] o.a.s.c.S.Request [collection1]  webapp=null path=null params={q=whiteSpace:teS&wt=xml}
hits=1 status=0 QTime=0
   [junit4]   2> 58570 INFO  (TEST-TestMaxTokenLenTokenizer.testSingleFieldDiffAnalyzers-seed#[3677784A92508F17])
[    ] o.a.s.c.S.Request [collection1]  webapp=null path=null params={q=whiteSpace:in&wt=xml}
hits=1 status=0 QTime=0
   [junit4]   2> 58571 INFO  (TEST-TestMaxTokenLenTokenizer.testSingleFieldDiffAnalyzers-seed#[3677784A92508F17])
[    ] o.a.s.c.S.Request [collection1]  webapp=null path=null params={q=whiteSpace:white&wt=xml}
hits=0 status=0 QTime=0
   [junit4]   2> 58572 INFO  (TEST-TestMaxTokenLenTokenizer.testSingleFieldDiffAnalyzers-seed#[3677784A92508F17])
[    ] o.a.s.c.S.Request [collection1]  webapp=null path=null params={q=unicodeWhiteSpace:uni&wt=xml}
hits=1 status=0 QTime=0
   [junit4]   2> 58573 INFO  (TEST-TestMaxTokenLenTokenizer.testSingleFieldDiffAnalyzers-seed#[3677784A92508F17])
[    ] o.a.s.c.S.Request [collection1]  webapp=null path=null params={q=unicodeWhiteSpace:cod&wt=xml}
hits=1 status=0 QTime=0
   [junit4]   2> 58574 INFO  (TEST-TestMaxTokenLenTokenizer.testSingleFieldDiffAnalyzers-seed#[3677784A92508F17])
[    ] o.a.s.c.S.Request [collection1]  webapp=null path=null params={q=unicodeWhiteSpace:e&wt=xml}
hits=1 status=0 QTime=0
   [junit4]   2> 58575 INFO  (TEST-TestMaxTokenLenTokenizer.testSingleFieldDiffAnalyzers-seed#[3677784A92508F17])
[    ] o.a.s.c.S.Request [collection1]  webapp=null path=null params={q=unicodeWhiteSpace:unico&wt=xml}
hits=0 status=0 QTime=0
   [junit4]   2> 58576 INFO  (TEST-TestMaxTokenLenTokenizer.testSingleFieldDiffAnalyzers-seed#[3677784A92508F17])
[    ] o.a.s.c.S.Request [collection1]  webapp=null path=null params={q=keyword:keyword&wt=xml}
hits=1 status=0 QTime=0
   [junit4]   2> 58577 INFO  (TEST-TestMaxTokenLenTokenizer.testSingleFieldDiffAnalyzers-seed#[3677784A92508F17])
[    ] o.a.s.c.S.Request [collection1]  webapp=null path=null params={q=keyword:key&wt=xml}
hits=0 status=0 QTime=0
   [junit4]   2> 58577 INFO  (TEST-TestMaxTokenLenTokenizer.testSingleFieldDiffAnalyzers-seed#[3677784A92508F17])
[    ] o.a.s.SolrTestCaseJ4 ###Ending testSingleFieldDiffAnalyzers
   [junit4]   2> 58579 INFO  (TEST-TestMaxTokenLenTokenizer.testSingleFieldSameAnalyzers-seed#[3677784A92508F17])
[    ] o.a.s.SolrTestCaseJ4 ###Starting testSingleFieldSameAnalyzers
   [junit4]   2> 58579 INFO  (TEST-TestMaxTokenLenTokenizer.testSingleFieldSameAnalyzers-seed#[3677784A92508F17])
[    ] o.a.s.u.DirectUpdateHandler2 [collection1] REMOVING ALL DOCUMENTS FROM INDEX
   [junit4]   2> 58580 INFO  (TEST-TestMaxTokenLenTokenizer.testSingleFieldSameAnalyzers-seed#[3677784A92508F17])
[    ] o.a.s.u.p.LogUpdateProcessorFactory [collection1]  webapp=null path=null params={_version_=-9223372036854775807&update.distrib=FROMLEADER&versions=true&wt=json&indent=true}{deleteByQuery=*:*}
0 0
   [junit4]   2> 58581 INFO  (TEST-TestMaxTokenLenTokenizer.testSingleFieldSameAnalyzers-seed#[3677784A92508F17])
[    ] o.a.s.u.DirectUpdateHandler2 start commit{,optimize=false,openSearcher=true,waitSearcher=true,expungeDeletes=false,softCommit=false,prepareCommit=false}
   [junit4]   2> 58581 INFO  (TEST-TestMaxTokenLenTokenizer.testSingleFieldSameAnalyzers-seed#[3677784A92508F17])
[    ] o.a.s.u.SolrIndexWriter Calling setCommitData with IW:org.apache.solr.update.SolrIndexWriter@636fcefc
   [junit4]   2> 58583 INFO  (TEST-TestMaxTokenLenTokenizer.testSingleFieldSameAnalyzers-seed#[3677784A92508F17])
[    ] o.a.s.s.SolrIndexSearcher Opening [Searcher@50031b6c[collection1] main]
   [junit4]   2> 58583 INFO  (TEST-TestMaxTokenLenTokenizer.testSingleFieldSameAnalyzers-seed#[3677784A92508F17])
[    ] o.a.s.u.DirectUpdateHandler2 end_commit_flush
   [junit4]   2> 58583 INFO  (searcherExecutor-340-thread-1) [    ] o.a.s.c.SolrCore [collection1]
Registered new searcher Searcher@50031b6c[collection1] main{ExitableDirectoryReader(UninvertingDirectoryReader(Uninverting(_5(6.7.0):C1)))}
   [junit4]   2> 58585 INFO  (TEST-TestMaxTokenLenTokenizer.testSingleFieldSameAnalyzers-seed#[3677784A92508F17])
[    ] o.a.s.u.p.LogUpdateProcessorFactory [collection1]  webapp=null path=null params={wt=json&indent=true}{add=[1],commit=}
0 4
   [junit4]   2> 58585 INFO  (TEST-TestMaxTokenLenTokenizer.testSingleFieldSameAnalyzers-seed#[3677784A92508F17])
[    ] o.a.s.u.DirectUpdateHandler2 start commit{,optimize=false,openSearcher=true,waitSearcher=true,expungeDeletes=false,softCommit=false,prepareCommit=false}
   [junit4]   2> 58586 INFO  (TEST-TestMaxTokenLenTokenizer.testSingleFieldSameAnalyzers-seed#[3677784A92508F17])
[    ] o.a.s.u.SolrIndexWriter Calling setCommitData with IW:org.apache.solr.update.SolrIndexWriter@636fcefc
   [junit4]   2> 58587 INFO  (TEST-TestMaxTokenLenTokenizer.testSingleFieldSameAnalyzers-seed#[3677784A92508F17])
[    ] o.a.s.s.SolrIndexSearcher Opening [Searcher@43c12d4a[collection1] main]
   [junit4]   2> 58588 INFO  (TEST-TestMaxTokenLenTokenizer.testSingleFieldSameAnalyzers-seed#[3677784A92508F17])
[    ] o.a.s.u.DirectUpdateHandler2 end_commit_flush
   [junit4]   2> 58588 INFO  (searcherExecutor-340-thread-1) [    ] o.a.s.c.SolrCore [collection1]
Registered new searcher Searcher@43c12d4a[collection1] main{ExitableDirectoryReader(UninvertingDirectoryReader(Uninverting(_5(6.7.0):C1)
Uninverting(_6(6.7.0):C1)))}
   [junit4]   2> 58588 INFO  (TEST-TestMaxTokenLenTokenizer.testSingleFieldSameAnalyzers-seed#[3677784A92508F17])
[    ] o.a.s.u.p.LogUpdateProcessorFactory [collection1]  webapp=null path=null params={wt=json&indent=true}{add=[2],commit=}
0 3
   [junit4]   2> 58592 INFO  (TEST-TestMaxTokenLenTokenizer.testSingleFieldSameAnalyzers-seed#[3677784A92508F17])
[    ] o.a.s.u.DirectUpdateHandler2 start commit{,optimize=false,openSearcher=true,waitSearcher=true,expungeDeletes=false,softCommit=false,prepareCommit=false}
   [junit4]   2> 58593 INFO  (TEST-TestMaxTokenLenTokenizer.testSingleFieldSameAnalyzers-seed#[3677784A92508F17])
[    ] o.a.s.u.SolrIndexWriter Calling setCommitData with IW:org.apache.solr.update.SolrIndexWriter@636fcefc
   [junit4]   2> 58596 INFO  (TEST-TestMaxTokenLenTokenizer.testSingleFieldSameAnalyzers-seed#[3677784A92508F17])
[    ] o.a.s.s.SolrIndexSearcher Opening [Searcher@55aa37b[collection1] main]
   [junit4]   2> 58596 INFO  (TEST-TestMaxTokenLenTokenizer.testSingleFieldSameAnalyzers-seed#[3677784A92508F17])
[    ] o.a.s.u.DirectUpdateHandler2 end_commit_flush
   [junit4]   2> 58596 INFO  (searcherExecutor-340-thread-1) [    ] o.a.s.c.SolrCore [collection1]
Registered new searcher Searcher@55aa37b[collection1] main{ExitableDirectoryReader(UninvertingDirectoryReader(Uninverting(_5(6.7.0):C1)
Uninverting(_6(6.7.0):C1) Uninverting(_7(6.7.0):C1)))}
   [junit4]   2> 58596 INFO  (TEST-TestMaxTokenLenTokenizer.testSingleFieldSameAnalyzers-seed#[3677784A92508F17])
[    ] o.a.s.u.p.LogUpdateProcessorFactory [collection1]  webapp=null path=null params={wt=json&indent=true}{add=[3],commit=}
0 7
   [junit4]   2> 58597 INFO  (TEST-TestMaxTokenLenTokenizer.testSingleFieldSameAnalyzers-seed#[3677784A92508F17])
[    ] o.a.s.u.DirectUpdateHandler2 start commit{,optimize=false,openSearcher=true,waitSearcher=true,expungeDeletes=false,softCommit=false,prepareCommit=false}
   [junit4]   2> 58598 INFO  (TEST-TestMaxTokenLenTokenizer.testSingleFieldSameAnalyzers-seed#[3677784A92508F17])
[    ] o.a.s.u.SolrIndexWriter Calling setCommitData with IW:org.apache.solr.update.SolrIndexWriter@636fcefc
   [junit4]   2> 58600 INFO  (TEST-TestMaxTokenLenTokenizer.testSingleFieldSameAnalyzers-seed#[3677784A92508F17])
[    ] o.a.s.s.SolrIndexSearcher Opening [Searcher@761a496d[collection1] main]
   [junit4]   2> 58600 INFO  (TEST-TestMaxTokenLenTokenizer.testSingleFieldSameAnalyzers-seed#[3677784A92508F17])
[    ] o.a.s.u.DirectUpdateHandler2 end_commit_flush
   [junit4]   2> 58601 INFO  (searcherExecutor-340-thread-1) [    ] o.a.s.c.SolrCore [collection1]
Registered new searcher Searcher@761a496d[collection1] main{ExitableDirectoryReader(UninvertingDirectoryReader(Uninverting(_5(6.7.0):C1)
Uninverting(_6(6.7.0):C1) Uninverting(_7(6.7.0):C1) Uninverting(_8(6.7.0):C1)))}
   [junit4]   2> 58601 INFO  (TEST-TestMaxTokenLenTokenizer.testSingleFieldSameAnalyzers-seed#[3677784A92508F17])
[    ] o.a.s.u.p.LogUpdateProcessorFactory [collection1]  webapp=null path=null params={wt=json&indent=true}{add=[4],commit=}
0 4
   [junit4]   2> 58602 INFO  (TEST-TestMaxTokenLenTokenizer.testSingleFieldSameAnalyzers-seed#[3677784A92508F17])
[    ] o.a.s.u.DirectUpdateHandler2 start commit{,optimize=false,openSearcher=true,waitSearcher=true,expungeDeletes=false,softCommit=false,prepareCommit=false}
   [junit4]   2> 58602 INFO  (TEST-TestMaxTokenLenTokenizer.testSingleFieldSameAnalyzers-seed#[3677784A92508F17])
[    ] o.a.s.u.SolrIndexWriter Calling setCommitData with IW:org.apache.solr.update.SolrIndexWriter@636fcefc
   [junit4]   2> 58604 INFO  (TEST-TestMaxTokenLenTokenizer.testSingleFieldSameAnalyzers-seed#[3677784A92508F17])
[    ] o.a.s.s.SolrIndexSearcher Opening [Searcher@46ad09e3[collection1] main]
   [junit4]   2> 58605 INFO  (TEST-TestMaxTokenLenTokenizer.testSingleFieldSameAnalyzers-seed#[3677784A92508F17])
[    ] o.a.s.u.DirectUpdateHandler2 end_commit_flush
   [junit4]   2> 58605 INFO  (searcherExecutor-340-thread-1) [    ] o.a.s.c.SolrCore [collection1]
Registered new searcher Searcher@46ad09e3[collection1] main{ExitableDirectoryReader(UninvertingDirectoryReader(Uninverting(_5(6.7.0):C1)
Uninverting(_6(6.7.0):C1) Uninverting(_7(6.7.0):C1) Uninverting(_8(6.7.0):C1) Uninverting(_9(6.7.0):C1)))}
   [junit4]   2> 58606 INFO  (TEST-TestMaxTokenLenTokenizer.testSingleFieldSameAnalyzers-seed#[3677784A92508F17])
[    ] o.a.s.u.p.LogUpdateProcessorFactory [collection1]  webapp=null path=null params={wt=json&indent=true}{add=[5],commit=}
0 4
   [junit4]   2> 58606 INFO  (TEST-TestMaxTokenLenTokenizer.testSingleFieldSameAnalyzers-seed#[3677784A92508F17])
[    ] o.a.s.u.DirectUpdateHandler2 start commit{,optimize=false,openSearcher=true,waitSearcher=true,expungeDeletes=false,softCommit=false,prepareCommit=false}
   [junit4]   2> 58606 INFO  (TEST-TestMaxTokenLenTokenizer.testSingleFieldSameAnalyzers-seed#[3677784A92508F17])
[    ] o.a.s.u.DirectUpdateHandler2 No uncommitted changes. Skipping IW.commit.
   [junit4]   2> 58607 INFO  (TEST-TestMaxTokenLenTokenizer.testSingleFieldSameAnalyzers-seed#[3677784A92508F17])
[    ] o.a.s.u.DirectUpdateHandler2 end_commit_flush
   [junit4]   2> 58607 INFO  (TEST-TestMaxTokenLenTokenizer.testSingleFieldSameAnalyzers-seed#[3677784A92508F17])
[    ] o.a.s.u.p.LogUpdateProcessorFactory [collection1]  webapp=null path=null params={}{commit=}
0 1
   [junit4]   2> 58608 INFO  (TEST-TestMaxTokenLenTokenizer.testSingleFieldSameAnalyzers-seed#[3677784A92508F17])
[    ] o.a.s.c.S.Request [collection1]  webapp=null path=null params={q=*:*&wt=xml} hits=5
status=0 QTime=0
   [junit4]   2> 58610 INFO  (TEST-TestMaxTokenLenTokenizer.testSingleFieldSameAnalyzers-seed#[3677784A92508F17])
[    ] o.a.s.c.S.Request [collection1]  webapp=null path=null params={q=letter0:l&wt=xml}
hits=0 status=0 QTime=0
   [junit4]   2> 58612 INFO  (TEST-TestMaxTokenLenTokenizer.testSingleFieldSameAnalyzers-seed#[3677784A92508F17])
[    ] o.a.s.c.S.Request [collection1]  webapp=null path=null params={q=letter0:let&wt=xml}
hits=1 status=0 QTime=0
   [junit4]   2> 58622 INFO  (TEST-TestMaxTokenLenTokenizer.testSingleFieldSameAnalyzers-seed#[3677784A92508F17])
[    ] o.a.s.c.S.Request [collection1]  webapp=null path=null params={q=letter0:lett&wt=xml}
hits=0 status=0 QTime=9
   [junit4]   2> 58624 ERROR (TEST-TestMaxTokenLenTokenizer.testSingleFieldSameAnalyzers-seed#[3677784A92508F17])
[    ] o.a.s.SolrTestCaseJ4 REQUEST FAILED: xpath=//result[@numFound=1]
   [junit4]   2> 	xml response was: <?xml version="1.0" encoding="UTF-8"?>
   [junit4]   2> <response>
   [junit4]   2> <lst name="responseHeader"><int name="status">0</int><int
name="QTime">9</int></lst><result name="response" numFound="0" start="0"></result>
   [junit4]   2> </response>
   [junit4]   2> 
   [junit4]   2> 	request was:q=letter0:lett&wt=xml
   [junit4]   2> 58625 ERROR (TEST-TestMaxTokenLenTokenizer.testSingleFieldSameAnalyzers-seed#[3677784A92508F17])
[    ] o.a.s.SolrTestCaseJ4 REQUEST FAILED: q=letter0:lett&wt=xml:java.lang.RuntimeException:
REQUEST FAILED: xpath=//result[@numFound=1]
   [junit4]   2> 	xml response was: <?xml version="1.0" encoding="UTF-8"?>
   [junit4]   2> <response>
   [junit4]   2> <lst name="responseHeader"><int name="status">0</int><int
name="QTime">9</int></lst><result name="response" numFound="0" start="0"></result>
   [junit4]   2> </response>
   [junit4]   2> 
   [junit4]   2> 	request was:q=letter0:lett&wt=xml
   [junit4]   2> 	at org.apache.solr.SolrTestCaseJ4.assertQ(SolrTestCaseJ4.java:888)
   [junit4]   2> 	at org.apache.solr.util.TestMaxTokenLenTokenizer.testSingleFieldSameAnalyzers(TestMaxTokenLenTokenizer.java:104)
   [junit4]   2> 	at sun.reflect.NativeMethodAccessorImpl.invoke0(Native Method)
   [junit4]   2> 	at sun.reflect.NativeMethodAccessorImpl.invoke(NativeMethodAccessorImpl.java:62)
   [junit4]   2> 	at sun.reflect.DelegatingMethodAccessorImpl.invoke(DelegatingMethodAccessorImpl.java:43)
   [junit4]   2> 	at java.lang.reflect.Method.invoke(Method.java:498)
   [junit4]   2> 	at com.carrotsearch.randomizedtesting.RandomizedRunner.invoke(RandomizedRunner.java:1713)
   [junit4]   2> 	at com.carrotsearch.randomizedtesting.RandomizedRunner$8.evaluate(RandomizedRunner.java:907)
   [junit4]   2> 	at com.carrotsearch.randomizedtesting.RandomizedRunner$9.evaluate(RandomizedRunner.java:943)
   [junit4]   2> 	at com.carrotsearch.randomizedtesting.RandomizedRunner$10.evaluate(RandomizedRunner.java:957)
   [junit4]   2> 	at com.carrotsearch.randomizedtesting.rules.SystemPropertiesRestoreRule$1.evaluate(SystemPropertiesRestoreRule.java:57)
   [junit4]   2> 	at org.apache.lucene.util.TestRuleSetupTeardownChained$1.evaluate(TestRuleSetupTeardownChained.java:49)
   [junit4]   2> 	at org.apache.lucene.util.AbstractBeforeAfterRule$1.evaluate(AbstractBeforeAfterRule.java:45)
   [junit4]   2> 	at org.apache.lucene.util.TestRuleThreadAndTestName$1.evaluate(TestRuleThreadAndTestName.java:48)
   [junit4]   2> 	at org.apache.lucene.util.TestRuleIgnoreAfterMaxFailures$1.evaluate(TestRuleIgnoreAfterMaxFailures.java:64)
   [junit4]   2> 	at org.apache.lucene.util.TestRuleMarkFailure$1.evaluate(TestRuleMarkFailure.java:47)
   [junit4]   2> 	at com.carrotsearch.randomizedtesting.rules.StatementAdapter.evaluate(StatementAdapter.java:36)
   [junit4]   2> 	at com.carrotsearch.randomizedtesting.ThreadLeakControl$StatementRunner.run(ThreadLeakControl.java:368)
   [junit4]   2> 	at com.carrotsearch.randomizedtesting.ThreadLeakControl.forkTimeoutingTask(ThreadLeakControl.java:817)
   [junit4]   2> 	at com.carrotsearch.randomizedtesting.ThreadLeakControl$3.evaluate(ThreadLeakControl.java:468)
   [junit4]   2> 	at com.carrotsearch.randomizedtesting.RandomizedRunner.runSingleTest(RandomizedRunner.java:916)
   [junit4]   2> 	at com.carrotsearch.randomizedtesting.RandomizedRunner$5.evaluate(RandomizedRunner.java:802)
   [junit4]   2> 	at com.carrotsearch.randomizedtesting.RandomizedRunner$6.evaluate(RandomizedRunner.java:852)
   [junit4]   2> 	at com.carrotsearch.randomizedtesting.RandomizedRunner$7.evaluate(RandomizedRunner.java:863)
   [junit4]   2> 	at com.carrotsearch.randomizedtesting.rules.StatementAdapter.evaluate(StatementAdapter.java:36)
   [junit4]   2> 	at com.carrotsearch.randomizedtesting.rules.SystemPropertiesRestoreRule$1.evaluate(SystemPropertiesRestoreRule.java:57)
   [junit4]   2> 	at org.apache.lucene.util.AbstractBeforeAfterRule$1.evaluate(AbstractBeforeAfterRule.java:45)
   [junit4]   2> 	at com.carrotsearch.randomizedtesting.rules.StatementAdapter.evaluate(StatementAdapter.java:36)
   [junit4]   2> 	at org.apache.lucene.util.TestRuleStoreClassName$1.evaluate(TestRuleStoreClassName.java:41)
   [junit4]   2> 	at com.carrotsearch.randomizedtesting.rules.NoShadowingOrOverridesOnMethodsRule$1.evaluate(NoShadowingOrOverridesOnMethodsRule.java:40)
   [junit4]   2> 	at com.carrotsearch.randomizedtesting.rules.NoShadowingOrOverridesOnMethodsRule$1.evaluate(NoShadowingOrOverridesOnMethodsRule.java:40)
   [junit4]   2> 	at com.carrotsearch.randomizedtesting.rules.StatementAdapter.evaluate(StatementAdapter.java:36)
   [junit4]   2> 	at com.carrotsearch.randomizedtesting.rules.StatementAdapter.evaluate(StatementAdapter.java:36)
   [junit4]   2> 	at com.carrotsearch.randomizedtesting.rules.StatementAdapter.evaluate(StatementAdapter.java:36)
   [junit4]   2> 	at org.apache.lucene.util.TestRuleAssertionsRequired$1.evaluate(TestRuleAssertionsRequired.java:53)
   [junit4]   2> 	at org.apache.lucene.util.TestRuleMarkFailure$1.evaluate(TestRuleMarkFailure.java:47)
   [junit4]   2> 	at org.apache.lucene.util.TestRuleIgnoreAfterMaxFailures$1.evaluate(TestRuleIgnoreAfterMaxFailures.java:64)
   [junit4]   2> 	at org.apache.lucene.util.TestRuleIgnoreTestSuites$1.evaluate(TestRuleIgnoreTestSuites.java:54)
   [junit4]   2> 	at com.carrotsearch.randomizedtesting.rules.StatementAdapter.evaluate(StatementAdapter.java:36)
   [junit4]   2> 	at com.carrotsearch.randomizedtesting.ThreadLeakControl$StatementRunner.run(ThreadLeakControl.java:368)
   [junit4]   2> 	at java.lang.Thread.run(Thread.java:748)
   [junit4]   2> 
   [junit4]   2> 58625 INFO  (TEST-TestMaxTokenLenTokenizer.testSingleFieldSameAnalyzers-seed#[3677784A92508F17])
[    ] o.a.s.SolrTestCaseJ4 ###Ending testSingleFieldSameAnalyzers
   [junit4]   2> NOTE: reproduce with: ant test  -Dtestcase=TestMaxTokenLenTokenizer -Dtests.method=testSingleFieldSameAnalyzers
-Dtests.seed=3677784A92508F17 -Dtests.multiplier=3 -Dtests.slow=true -Dtests.locale=es-PE
-Dtests.timezone=America/Indiana/Marengo -Dtests.asserts=true -Dtests.file.encoding=ISO-8859-1
   [junit4] ERROR   0.05s J1 | TestMaxTokenLenTokenizer.testSingleFieldSameAnalyzers <<<
   [junit4]    > Throwable #1: java.lang.RuntimeException: Exception during query
   [junit4]    > 	at __randomizedtesting.SeedInfo.seed([3677784A92508F17:5CA54725CAB35FD8]:0)
   [junit4]    > 	at org.apache.solr.SolrTestCaseJ4.assertQ(SolrTestCaseJ4.java:895)
   [junit4]    > 	at org.apache.solr.util.TestMaxTokenLenTokenizer.testSingleFieldSameAnalyzers(TestMaxTokenLenTokenizer.java:104)
   [junit4]    > 	at java.lang.Thread.run(Thread.java:748)
   [junit4]    > Caused by: java.lang.RuntimeException: REQUEST FAILED: xpath=//result[@numFound=1]
   [junit4]    > 	xml response was: <?xml version="1.0" encoding="UTF-8"?>
   [junit4]    > <response>
   [junit4]    > <lst name="responseHeader"><int name="status">0</int><int
name="QTime">9</int></lst><result name="response" numFound="0" start="0"></result>
   [junit4]    > </response>
   [junit4]    > 	request was:q=letter0:lett&wt=xml
   [junit4]    > 	at org.apache.solr.SolrTestCaseJ4.assertQ(SolrTestCaseJ4.java:888)
   [junit4]    > 	... 40 more
   [junit4]   2> 58631 INFO  (SUITE-TestMaxTokenLenTokenizer-seed#[3677784A92508F17]-worker)
[    ] o.a.s.SolrTestCaseJ4 ###deleteCore
   [junit4]   2> 58631 INFO  (SUITE-TestMaxTokenLenTokenizer-seed#[3677784A92508F17]-worker)
[    ] o.a.s.c.CoreContainer Shutting down CoreContainer instance=1803591576
   [junit4]   2> 58631 INFO  (SUITE-TestMaxTokenLenTokenizer-seed#[3677784A92508F17]-worker)
[    ] o.a.s.m.SolrMetricManager Closing metric reporters for: solr.node
   [junit4]   2> 58633 INFO  (SUITE-TestMaxTokenLenTokenizer-seed#[3677784A92508F17]-worker)
[    ] o.a.s.m.SolrMetricManager Closing metric reporters for: solr.jvm
   [junit4]   2> 58634 INFO  (SUITE-TestMaxTokenLenTokenizer-seed#[3677784A92508F17]-worker)
[    ] o.a.s.m.SolrMetricManager Closing metric reporters for: solr.jetty
   [junit4]   2> 58634 INFO  (SUITE-TestMaxTokenLenTokenizer-seed#[3677784A92508F17]-worker)
[    ] o.a.s.c.TransientSolrCoreCacheDefault Allocating transient cache for 2147483647 transient
cores
   [junit4]   2> 58653 INFO  (coreCloseExecutor-344-thread-1) [    x:collection1] o.a.s.c.SolrCore
[collection1]  CLOSING SolrCore org.apache.solr.core.SolrCore@6fc14e6b
   [junit4]   2> 58657 INFO  (coreCloseExecutor-344-thread-1) [    x:collection1] o.a.s.m.SolrMetricManager
Closing metric reporters for: solr.core.collection1
   [junit4]   2> NOTE: leaving temporary files on disk at: /home/jenkins/workspace/Lucene-Solr-6.x-Linux/solr/build/solr-core/test/J1/temp/solr.util.TestMaxTokenLenTokenizer_3677784A92508F17-001
   [junit4]   2> NOTE: test params are: codec=CheapBastard, sim=RandomSimilarity(queryNorm=true,coord=crazy):
{}, locale=es-PE, timezone=America/Indiana/Marengo
   [junit4]   2> NOTE: Linux 4.10.0-21-generic amd64/Oracle Corporation 1.8.0_131 (64-bit)/cpus=8,threads=1,free=388766496,total=515375104
   [junit4]   2> NOTE: All tests run in this JVM: [ManagedSchemaRoundRobinCloudTest, URLClassifyProcessorTest,
LeaderFailoverAfterPartitionTest, TemplateUpdateProcessorTest, TestNestedDocsSort, SolrMetricReporterTest,
TestChildDocTransformer, TestSuggestSpellingConverter, SchemaVersionSpecificBehaviorTest,
TestMaxTokenLenTokenizer]
   [junit4] Completed [20/715 (1!)] on J1 in 0.48s, 2 tests, 1 error <<< FAILURES!

[...truncated 45743 lines...]

Mime
View raw message