lucene-dev mailing list archives

Site index · List index
Message view « Date » · « Thread »
Top « Date » · « Thread »
From Policeman Jenkins Server <jenk...@thetaphi.de>
Subject [JENKINS] Lucene-Solr-master-MacOSX (64bit/jdk1.8.0) - Build # 4043 - Still Unstable!
Date Fri, 02 Jun 2017 11:38:05 GMT
Build: https://jenkins.thetaphi.de/job/Lucene-Solr-master-MacOSX/4043/
Java: 64bit/jdk1.8.0 -XX:-UseCompressedOops -XX:+UseSerialGC

1 tests failed.
FAILED:  org.apache.solr.handler.admin.MetricsHandlerTest.testPropertyFilter

Error Message:


Stack Trace:
java.lang.AssertionError
	at __randomizedtesting.SeedInfo.seed([89C01A8F4C3FD829:EBADE4CE83B1B817]:0)
	at org.junit.Assert.fail(Assert.java:92)
	at org.junit.Assert.assertTrue(Assert.java:43)
	at org.junit.Assert.assertNotNull(Assert.java:526)
	at org.junit.Assert.assertNotNull(Assert.java:537)
	at org.apache.solr.handler.admin.MetricsHandlerTest.testPropertyFilter(MetricsHandlerTest.java:201)
	at sun.reflect.NativeMethodAccessorImpl.invoke0(Native Method)
	at sun.reflect.NativeMethodAccessorImpl.invoke(NativeMethodAccessorImpl.java:62)
	at sun.reflect.DelegatingMethodAccessorImpl.invoke(DelegatingMethodAccessorImpl.java:43)
	at java.lang.reflect.Method.invoke(Method.java:498)
	at com.carrotsearch.randomizedtesting.RandomizedRunner.invoke(RandomizedRunner.java:1713)
	at com.carrotsearch.randomizedtesting.RandomizedRunner$8.evaluate(RandomizedRunner.java:907)
	at com.carrotsearch.randomizedtesting.RandomizedRunner$9.evaluate(RandomizedRunner.java:943)
	at com.carrotsearch.randomizedtesting.RandomizedRunner$10.evaluate(RandomizedRunner.java:957)
	at com.carrotsearch.randomizedtesting.rules.SystemPropertiesRestoreRule$1.evaluate(SystemPropertiesRestoreRule.java:57)
	at org.apache.lucene.util.TestRuleSetupTeardownChained$1.evaluate(TestRuleSetupTeardownChained.java:49)
	at org.apache.lucene.util.AbstractBeforeAfterRule$1.evaluate(AbstractBeforeAfterRule.java:45)
	at org.apache.lucene.util.TestRuleThreadAndTestName$1.evaluate(TestRuleThreadAndTestName.java:48)
	at org.apache.lucene.util.TestRuleIgnoreAfterMaxFailures$1.evaluate(TestRuleIgnoreAfterMaxFailures.java:64)
	at org.apache.lucene.util.TestRuleMarkFailure$1.evaluate(TestRuleMarkFailure.java:47)
	at com.carrotsearch.randomizedtesting.rules.StatementAdapter.evaluate(StatementAdapter.java:36)
	at com.carrotsearch.randomizedtesting.ThreadLeakControl$StatementRunner.run(ThreadLeakControl.java:368)
	at com.carrotsearch.randomizedtesting.ThreadLeakControl.forkTimeoutingTask(ThreadLeakControl.java:817)
	at com.carrotsearch.randomizedtesting.ThreadLeakControl$3.evaluate(ThreadLeakControl.java:468)
	at com.carrotsearch.randomizedtesting.RandomizedRunner.runSingleTest(RandomizedRunner.java:916)
	at com.carrotsearch.randomizedtesting.RandomizedRunner$5.evaluate(RandomizedRunner.java:802)
	at com.carrotsearch.randomizedtesting.RandomizedRunner$6.evaluate(RandomizedRunner.java:852)
	at com.carrotsearch.randomizedtesting.RandomizedRunner$7.evaluate(RandomizedRunner.java:863)
	at com.carrotsearch.randomizedtesting.rules.StatementAdapter.evaluate(StatementAdapter.java:36)
	at com.carrotsearch.randomizedtesting.rules.SystemPropertiesRestoreRule$1.evaluate(SystemPropertiesRestoreRule.java:57)
	at org.apache.lucene.util.AbstractBeforeAfterRule$1.evaluate(AbstractBeforeAfterRule.java:45)
	at com.carrotsearch.randomizedtesting.rules.StatementAdapter.evaluate(StatementAdapter.java:36)
	at org.apache.lucene.util.TestRuleStoreClassName$1.evaluate(TestRuleStoreClassName.java:41)
	at com.carrotsearch.randomizedtesting.rules.NoShadowingOrOverridesOnMethodsRule$1.evaluate(NoShadowingOrOverridesOnMethodsRule.java:40)
	at com.carrotsearch.randomizedtesting.rules.NoShadowingOrOverridesOnMethodsRule$1.evaluate(NoShadowingOrOverridesOnMethodsRule.java:40)
	at com.carrotsearch.randomizedtesting.rules.StatementAdapter.evaluate(StatementAdapter.java:36)
	at com.carrotsearch.randomizedtesting.rules.StatementAdapter.evaluate(StatementAdapter.java:36)
	at com.carrotsearch.randomizedtesting.rules.StatementAdapter.evaluate(StatementAdapter.java:36)
	at org.apache.lucene.util.TestRuleAssertionsRequired$1.evaluate(TestRuleAssertionsRequired.java:53)
	at org.apache.lucene.util.TestRuleMarkFailure$1.evaluate(TestRuleMarkFailure.java:47)
	at org.apache.lucene.util.TestRuleIgnoreAfterMaxFailures$1.evaluate(TestRuleIgnoreAfterMaxFailures.java:64)
	at org.apache.lucene.util.TestRuleIgnoreTestSuites$1.evaluate(TestRuleIgnoreTestSuites.java:54)
	at com.carrotsearch.randomizedtesting.rules.StatementAdapter.evaluate(StatementAdapter.java:36)
	at com.carrotsearch.randomizedtesting.ThreadLeakControl$StatementRunner.run(ThreadLeakControl.java:368)
	at java.lang.Thread.run(Thread.java:748)




Build Log:
[...truncated 12751 lines...]
   [junit4] Suite: org.apache.solr.handler.admin.MetricsHandlerTest
   [junit4]   2> Creating dataDir: /Users/jenkins/workspace/Lucene-Solr-master-MacOSX/solr/build/solr-core/test/J1/temp/solr.handler.admin.MetricsHandlerTest_89C01A8F4C3FD829-001/init-core-data-001
   [junit4]   2> 2444044 WARN  (SUITE-MetricsHandlerTest-seed#[89C01A8F4C3FD829]-worker)
[    ] o.a.s.SolrTestCaseJ4 startTrackingSearchers: numOpens=1 numCloses=1
   [junit4]   2> 2444044 INFO  (SUITE-MetricsHandlerTest-seed#[89C01A8F4C3FD829]-worker)
[    ] o.a.s.SolrTestCaseJ4 Using TrieFields
   [junit4]   2> 2444047 INFO  (SUITE-MetricsHandlerTest-seed#[89C01A8F4C3FD829]-worker)
[    ] o.a.s.SolrTestCaseJ4 Randomized ssl (false) and clientAuth (false) via: @org.apache.solr.util.RandomizeSSL(reason=,
value=NaN, ssl=NaN, clientAuth=NaN) w/ MAC_OS_X supressed clientAuth
   [junit4]   2> 2444047 INFO  (SUITE-MetricsHandlerTest-seed#[89C01A8F4C3FD829]-worker)
[    ] o.a.s.SolrTestCaseJ4 ####initCore
   [junit4]   2> 2444047 INFO  (SUITE-MetricsHandlerTest-seed#[89C01A8F4C3FD829]-worker)
[    ] o.a.s.c.SolrResourceLoader [null] Added 2 libs to classloader, from paths: [/Users/jenkins/workspace/Lucene-Solr-master-MacOSX/solr/core/src/test-files/solr/collection1/lib,
/Users/jenkins/workspace/Lucene-Solr-master-MacOSX/solr/core/src/test-files/solr/collection1/lib/classes]
   [junit4]   2> 2444083 INFO  (SUITE-MetricsHandlerTest-seed#[89C01A8F4C3FD829]-worker)
[    ] o.a.s.c.SolrConfig Using Lucene MatchVersion: 7.0.0
   [junit4]   2> 2444104 INFO  (SUITE-MetricsHandlerTest-seed#[89C01A8F4C3FD829]-worker)
[    ] o.a.s.s.IndexSchema [null] Schema name=test
   [junit4]   2> 2444202 INFO  (SUITE-MetricsHandlerTest-seed#[89C01A8F4C3FD829]-worker)
[    ] o.a.s.s.IndexSchema Loaded schema test/1.0 with uniqueid field id
   [junit4]   2> 2444271 INFO  (SUITE-MetricsHandlerTest-seed#[89C01A8F4C3FD829]-worker)
[    ] o.a.s.m.r.SolrJmxReporter JMX monitoring for 'solr.node' (registry 'solr.node') enabled
at server: com.sun.jmx.mbeanserver.JmxMBeanServer@4a290140
   [junit4]   2> 2444273 INFO  (SUITE-MetricsHandlerTest-seed#[89C01A8F4C3FD829]-worker)
[    ] o.a.s.m.r.SolrJmxReporter JMX monitoring for 'solr.jvm' (registry 'solr.jvm') enabled
at server: com.sun.jmx.mbeanserver.JmxMBeanServer@4a290140
   [junit4]   2> 2444273 INFO  (SUITE-MetricsHandlerTest-seed#[89C01A8F4C3FD829]-worker)
[    ] o.a.s.m.r.SolrJmxReporter JMX monitoring for 'solr.jetty' (registry 'solr.jetty') enabled
at server: com.sun.jmx.mbeanserver.JmxMBeanServer@4a290140
   [junit4]   2> 2444275 INFO  (coreLoadExecutor-10637-thread-1) [    x:collection1] o.a.s.c.SolrResourceLoader
[null] Added 2 libs to classloader, from paths: [/Users/jenkins/workspace/Lucene-Solr-master-MacOSX/solr/core/src/test-files/solr/collection1/lib,
/Users/jenkins/workspace/Lucene-Solr-master-MacOSX/solr/core/src/test-files/solr/collection1/lib/classes]
   [junit4]   2> 2444327 INFO  (coreLoadExecutor-10637-thread-1) [    x:collection1] o.a.s.c.SolrConfig
Using Lucene MatchVersion: 7.0.0
   [junit4]   2> 2444353 INFO  (coreLoadExecutor-10637-thread-1) [    x:collection1] o.a.s.s.IndexSchema
[collection1] Schema name=test
   [junit4]   2> 2444423 INFO  (coreLoadExecutor-10637-thread-1) [    x:collection1] o.a.s.s.IndexSchema
Loaded schema test/1.0 with uniqueid field id
   [junit4]   2> 2444428 INFO  (coreLoadExecutor-10637-thread-1) [    x:collection1] o.a.s.c.CoreContainer
Creating SolrCore 'collection1' using configuration from instancedir /Users/jenkins/workspace/Lucene-Solr-master-MacOSX/solr/core/src/test-files/solr/collection1,
trusted=true
   [junit4]   2> 2444428 INFO  (coreLoadExecutor-10637-thread-1) [    x:collection1] o.a.s.m.r.SolrJmxReporter
JMX monitoring for 'solr.core.collection1' (registry 'solr.core.collection1') enabled at server:
com.sun.jmx.mbeanserver.JmxMBeanServer@4a290140
   [junit4]   2> 2444428 INFO  (coreLoadExecutor-10637-thread-1) [    x:collection1] o.a.s.c.SolrCore
solr.RecoveryStrategy.Builder
   [junit4]   2> 2444429 INFO  (coreLoadExecutor-10637-thread-1) [    x:collection1] o.a.s.c.SolrCore
[[collection1] ] Opening new SolrCore at [/Users/jenkins/workspace/Lucene-Solr-master-MacOSX/solr/core/src/test-files/solr/collection1],
dataDir=[/Users/jenkins/workspace/Lucene-Solr-master-MacOSX/solr/build/solr-core/test/J1/temp/solr.handler.admin.MetricsHandlerTest_89C01A8F4C3FD829-001/init-core-data-001/]
   [junit4]   2> 2444429 INFO  (coreLoadExecutor-10637-thread-1) [    x:collection1] o.a.s.u.RandomMergePolicy
RandomMergePolicy wrapping class org.apache.lucene.index.TieredMergePolicy: [TieredMergePolicy:
maxMergeAtOnce=31, maxMergeAtOnceExplicit=37, maxMergedSegmentMB=27.5556640625, floorSegmentMB=2.1025390625,
forceMergeDeletesPctAllowed=2.3881323078575467, segmentsPerTier=45.0, maxCFSSegmentSizeMB=8.796093022207999E12,
noCFSRatio=1.0
   [junit4]   2> 2444501 INFO  (coreLoadExecutor-10637-thread-1) [    x:collection1] o.a.s.u.UpdateHandler
Using UpdateLog implementation: org.apache.solr.update.UpdateLog
   [junit4]   2> 2444501 INFO  (coreLoadExecutor-10637-thread-1) [    x:collection1] o.a.s.u.UpdateLog
Initializing UpdateLog: dataDir= defaultSyncLevel=FLUSH numRecordsToKeep=100 maxNumLogsToKeep=10
numVersionBuckets=65536
   [junit4]   2> 2444502 INFO  (coreLoadExecutor-10637-thread-1) [    x:collection1] o.a.s.u.CommitTracker
Hard AutoCommit: disabled
   [junit4]   2> 2444502 INFO  (coreLoadExecutor-10637-thread-1) [    x:collection1] o.a.s.u.CommitTracker
Soft AutoCommit: disabled
   [junit4]   2> 2444504 INFO  (coreLoadExecutor-10637-thread-1) [    x:collection1] o.a.s.u.RandomMergePolicy
RandomMergePolicy wrapping class org.apache.lucene.index.TieredMergePolicy: [TieredMergePolicy:
maxMergeAtOnce=43, maxMergeAtOnceExplicit=39, maxMergedSegmentMB=48.40234375, floorSegmentMB=1.5185546875,
forceMergeDeletesPctAllowed=20.43444629518149, segmentsPerTier=16.0, maxCFSSegmentSizeMB=8.796093022207999E12,
noCFSRatio=0.7211135321691934
   [junit4]   2> 2444505 INFO  (coreLoadExecutor-10637-thread-1) [    x:collection1] o.a.s.s.SolrIndexSearcher
Opening [Searcher@de54613[collection1] main]
   [junit4]   2> 2444505 INFO  (coreLoadExecutor-10637-thread-1) [    x:collection1] o.a.s.h.c.SpellCheckComponent
Initializing spell checkers
   [junit4]   2> 2444515 INFO  (coreLoadExecutor-10637-thread-1) [    x:collection1] o.a.s.s.DirectSolrSpellChecker
init: {name=direct,classname=DirectSolrSpellChecker,field=lowerfilt,minQueryLength=3}
   [junit4]   2> 2444533 INFO  (coreLoadExecutor-10637-thread-1) [    x:collection1] o.a.s.h.ReplicationHandler
Commits will be reserved for  10000
   [junit4]   2> 2444534 INFO  (searcherExecutor-10638-thread-1-processing-x:collection1)
[    x:collection1] o.a.s.h.c.SpellCheckComponent Loading spell index for spellchecker: default
   [junit4]   2> 2444534 INFO  (coreLoadExecutor-10637-thread-1) [    x:collection1] o.a.s.u.UpdateLog
Could not find max version in index or recent updates, using new clock 1569091506054103040
   [junit4]   2> 2444535 INFO  (searcherExecutor-10638-thread-1-processing-x:collection1)
[    x:collection1] o.a.s.h.c.SpellCheckComponent Loading spell index for spellchecker: direct
   [junit4]   2> 2444535 INFO  (searcherExecutor-10638-thread-1-processing-x:collection1)
[    x:collection1] o.a.s.h.c.SpellCheckComponent Loading spell index for spellchecker: wordbreak
   [junit4]   2> 2444535 INFO  (searcherExecutor-10638-thread-1-processing-x:collection1)
[    x:collection1] o.a.s.h.c.SpellCheckComponent Loading spell index for spellchecker: multipleFields
   [junit4]   2> 2444538 INFO  (SUITE-MetricsHandlerTest-seed#[89C01A8F4C3FD829]-worker)
[    ] o.a.s.SolrTestCaseJ4 ####initCore end
   [junit4]   2> 2444538 INFO  (searcherExecutor-10638-thread-1-processing-x:collection1)
[    x:collection1] o.a.s.h.c.SpellCheckComponent Loading spell index for spellchecker: jarowinkler
   [junit4]   2> 2444542 INFO  (searcherExecutor-10638-thread-1-processing-x:collection1)
[    x:collection1] o.a.s.h.c.SpellCheckComponent Loading spell index for spellchecker: external
   [junit4]   2> 2444542 INFO  (TEST-MetricsHandlerTest.testPropertyFilter-seed#[89C01A8F4C3FD829])
[    ] o.a.s.SolrTestCaseJ4 ###Starting testPropertyFilter
   [junit4]   2> 2444543 INFO  (TEST-MetricsHandlerTest.testPropertyFilter-seed#[89C01A8F4C3FD829])
[    ] o.a.s.SolrTestCaseJ4 ###Ending testPropertyFilter
   [junit4]   2> 2444545 INFO  (searcherExecutor-10638-thread-1-processing-x:collection1)
[    x:collection1] o.a.s.h.c.SpellCheckComponent Loading spell index for spellchecker: freq
   [junit4]   2> 2444545 INFO  (searcherExecutor-10638-thread-1-processing-x:collection1)
[    x:collection1] o.a.s.h.c.SpellCheckComponent Loading spell index for spellchecker: fqcn
   [junit4]   2> 2444545 INFO  (searcherExecutor-10638-thread-1-processing-x:collection1)
[    x:collection1] o.a.s.h.c.SpellCheckComponent Loading spell index for spellchecker: perDict
   [junit4]   2> NOTE: reproduce with: ant test  -Dtestcase=MetricsHandlerTest -Dtests.method=testPropertyFilter
-Dtests.seed=89C01A8F4C3FD829 -Dtests.slow=true -Dtests.locale=ar-LB -Dtests.timezone=America/Rainy_River
-Dtests.asserts=true -Dtests.file.encoding=UTF-8
   [junit4] FAILURE 0.01s J1 | MetricsHandlerTest.testPropertyFilter <<<
   [junit4]    > Throwable #1: java.lang.AssertionError
   [junit4]    > 	at __randomizedtesting.SeedInfo.seed([89C01A8F4C3FD829:EBADE4CE83B1B817]:0)
   [junit4]    > 	at org.apache.solr.handler.admin.MetricsHandlerTest.testPropertyFilter(MetricsHandlerTest.java:201)
   [junit4]    > 	at java.lang.Thread.run(Thread.java:748)
   [junit4]   2> 2444546 INFO  (searcherExecutor-10638-thread-1-processing-x:collection1)
[    x:collection1] o.a.s.c.SolrCore [collection1] Registered new searcher Searcher@de54613[collection1]
main{ExitableDirectoryReader(UninvertingDirectoryReader())}
   [junit4]   2> 2444548 INFO  (TEST-MetricsHandlerTest.test-seed#[89C01A8F4C3FD829]) [
   ] o.a.s.SolrTestCaseJ4 ###Starting test
   [junit4]   2> 2444560 INFO  (TEST-MetricsHandlerTest.test-seed#[89C01A8F4C3FD829]) [
   ] o.a.s.c.TransientSolrCoreCacheDefault Allocating transient cache for 2147483647 transient
cores
   [junit4]   2> 2444622 INFO  (TEST-MetricsHandlerTest.test-seed#[89C01A8F4C3FD829]) [
   ] o.a.s.SolrTestCaseJ4 ###Ending test
   [junit4]   2> 2444624 INFO  (TEST-MetricsHandlerTest.testCompact-seed#[89C01A8F4C3FD829])
[    ] o.a.s.SolrTestCaseJ4 ###Starting testCompact
   [junit4]   2> 2444634 INFO  (TEST-MetricsHandlerTest.testCompact-seed#[89C01A8F4C3FD829])
[    ] o.a.s.SolrTestCaseJ4 ###Ending testCompact
   [junit4]   2> 2444634 INFO  (SUITE-MetricsHandlerTest-seed#[89C01A8F4C3FD829]-worker)
[    ] o.a.s.SolrTestCaseJ4 ###deleteCore
   [junit4]   2> 2444634 INFO  (SUITE-MetricsHandlerTest-seed#[89C01A8F4C3FD829]-worker)
[    ] o.a.s.c.CoreContainer Shutting down CoreContainer instance=1462181797
   [junit4]   2> 2444634 INFO  (SUITE-MetricsHandlerTest-seed#[89C01A8F4C3FD829]-worker)
[    ] o.a.s.m.SolrMetricManager Closing metric reporters for registry=solr.node, tag=null
   [junit4]   2> 2444635 INFO  (SUITE-MetricsHandlerTest-seed#[89C01A8F4C3FD829]-worker)
[    ] o.a.s.m.SolrMetricManager Closing metric reporters for registry=solr.jvm, tag=null
   [junit4]   2> 2444647 INFO  (SUITE-MetricsHandlerTest-seed#[89C01A8F4C3FD829]-worker)
[    ] o.a.s.m.SolrMetricManager Closing metric reporters for registry=solr.jetty, tag=null
   [junit4]   2> 2444650 INFO  (coreCloseExecutor-10643-thread-1) [    x:collection1] o.a.s.c.SolrCore
[collection1]  CLOSING SolrCore org.apache.solr.core.SolrCore@431cbb75
   [junit4]   2> 2444651 INFO  (coreCloseExecutor-10643-thread-1) [    x:collection1] o.a.s.m.SolrMetricManager
Closing metric reporters for registry=solr.core.collection1, tag=1125956469
   [junit4]   2> NOTE: leaving temporary files on disk at: /Users/jenkins/workspace/Lucene-Solr-master-MacOSX/solr/build/solr-core/test/J1/temp/solr.handler.admin.MetricsHandlerTest_89C01A8F4C3FD829-001
   [junit4]   2> NOTE: test params are: codec=Asserting(Lucene70): {}, docValues:{}, maxPointsInLeafNode=1124,
maxMBSortInHeap=6.942294012803714, sim=RandomSimilarity(queryNorm=false): {}, locale=ar-LB,
timezone=America/Rainy_River
   [junit4]   2> NOTE: Mac OS X 10.11.6 x86_64/Oracle Corporation 1.8.0_131 (64-bit)/cpus=3,threads=1,free=226794784,total=518979584
   [junit4]   2> NOTE: All tests run in this JVM: [TestFieldCacheSortRandom, CurrencyFieldOpenExchangeTest,
CollectionsAPIDistributedZkTest, TestSystemCollAutoCreate, ChaosMonkeyNothingIsSafeTest, TestCoreAdminApis,
TestIndexSearcher, SolrCoreMetricManagerTest, TestUseDocValuesAsStored2, TestValueSourceCache,
TestIntervalFaceting, DistribCursorPagingTest, TestCloudSchemaless, ShardRoutingCustomTest,
MissingSegmentRecoveryTest, TestSolrQueryResponse, DeleteInactiveReplicaTest, TestCloudDeleteByQuery,
TemplateUpdateProcessorTest, TestRandomFlRTGCloud, TestSolrXml, TestUninvertingReader, TestConfigSetsAPIZkFailure,
TestFieldTypeResource, SmileWriterTest, TestSearcherReuse, TestLMJelinekMercerSimilarityFactory,
BadComponentTest, HdfsBasicDistributedZk2Test, TestFieldResource, TestCollectionAPIs, RegexBoostProcessorTest,
CollectionTooManyReplicasTest, TestSSLRandomization, TestReqParamsAPI, TestSolrCoreSnapshots,
SubstringBytesRefFilterTest, BasicFunctionalityTest, OverseerTaskQueueTest, LoggingHandlerTest,
TestDynamicFieldResource, TestSchemaResource, ClusterStateTest, DeleteNodeTest, TestRequestForwarding,
SpellCheckCollatorTest, DeleteShardTest, ZkStateReaderTest, HighlighterConfigTest, SolrCmdDistributorTest,
BadIndexSchemaTest, DistanceUnitsTest, SolrCoreCheckLockOnStartupTest, CdcrVersionReplicationTest,
TestJoin, TestEmbeddedSolrServerSchemaAPI, TestConfigSetsAPI, SSLMigrationTest, JvmMetricsTest,
ConvertedLegacyTest, SolrIndexMetricsTest, SignatureUpdateProcessorFactoryTest, IgnoreCommitOptimizeUpdateProcessorFactoryTest,
IndexSchemaTest, TestDFRSimilarityFactory, TestQueryUtils, AliasIntegrationTest, DirectoryFactoryTest,
TestNoOpRegenerator, TestLuceneMatchVersion, SpatialHeatmapFacetsTest, RequestHandlersTest,
DistribJoinFromCollectionTest, TestSolr4Spatial, TestJavabinTupleStreamParser, TestRawResponseWriter,
TestShortCircuitedRequests, AnalyticsQueryTest, CoreAdminCreateDiscoverTest, TestQueryTypes,
URLClassifyProcessorTest, TestFieldCacheWithThreads, TestZkChroot, TestLegacyTerms, SolrIndexSplitterTest,
SparseHLLTest, ExplicitHLLTest, DebugComponentTest, TestDocTermOrds, TestConfigSets, TestSQLHandler,
TestRecovery, TestOrdValues, OutOfBoxZkACLAndCredentialsProvidersTest, TestStandardQParsers,
TestComponentsName, TestCustomSort, ConfigureRecoveryStrategyTest, TestManagedSynonymFilterFactory,
TestSearchPerf, RecoveryAfterSoftCommitTest, TestStressRecovery, OverseerCollectionConfigSetProcessorTest,
TestImpersonationWithHadoopAuth, TestXmlQParserPlugin, TestNonDefinedSimilarityFactory, FieldMutatingUpdateProcessorTest,
TestLegacyNumericRangeQueryBuilder, SuggesterTest, TestLegacyFieldReuse, TestPayloadCheckQParserPlugin,
BasicAuthIntegrationTest, TermVectorComponentTest, TestExpandComponent, TestSubQueryTransformer,
HdfsUnloadDistributedZkTest, TestRecoveryHdfs, TestBackupRepositoryFactory, PrimUtilsTest,
TestSolrConfigHandlerCloud, TestFastLRUCache, BJQParserTest, DataDrivenBlockJoinTest, PKIAuthenticationIntegrationTest,
TestTestInjection, CreateCollectionCleanupTest, BasicDistributedZk2Test, SliceStateTest, TestOmitPositions,
UpdateRequestProcessorFactoryTest, TestQuerySenderListener, CoreAdminHandlerTest, NoCacheHeaderTest,
TestLeaderElectionZkExpiry, StatsComponentTest, SolrXmlInZkTest, TimeZoneUtilsTest, SolrInfoBeanTest,
TestFoldingMultitermQuery, CollectionReloadTest, TestPKIAuthenticationPlugin, TestUniqueKeyFieldResource,
TestRandomFaceting, HdfsRecoverLeaseTest, TestBadConfig, DistributedQueryComponentOptimizationTest,
UpdateLogTest, SolrCloudReportersTest, TestFilteredDocIdSet, AddSchemaFieldsUpdateProcessorFactoryTest,
FullSolrCloudDistribCmdsTest, ChangedSchemaMergeTest, TestManagedSchemaAPI, LeaderInitiatedRecoveryOnShardRestartTest,
TestJsonFacets, TestInitParams, TestDistribIDF, LeaderElectionIntegrationTest, EchoParamsTest,
DocValuesMissingTest, TestUnifiedSolrHighlighter, ZkSolrClientTest, TestFiltering, StatsReloadRaceTest,
TestSolrCoreProperties, HdfsCollectionsAPIDistributedZkTest, TestWriterPerf, DistributedTermsComponentTest,
TestSimpleTrackingShardHandler, TestSolrCloudWithDelegationTokens, TestMiniSolrCloudClusterSSL,
TestSchemalessBufferedUpdates, ReturnFieldsTest, StressHdfsTest, ManagedSchemaRoundRobinCloudTest,
TestIndexingPerformance, TestLocalFSCloudBackupRestore, RulesTest, OpenCloseCoreStressTest,
ShardRoutingTest, TestRandomDVFaceting, ZkCLITest, AutoCommitTest, TestDistributedGrouping,
TestFaceting, DistributedSpellCheckComponentTest, TermVectorComponentDistributedTest, TestStressReorder,
TestRangeQuery, SpellCheckComponentTest, QueryElevationComponentTest, CurrencyFieldXmlFileTest,
TestExtendedDismaxParser, SuggesterFSTTest, DocValuesTest, SortByFunctionTest, XsltUpdateRequestHandlerTest,
IndexBasedSpellCheckerTest, DisMaxRequestHandlerTest, TestReversedWildcardFilterFactory, PrimitiveFieldTypeTest,
FileBasedSpellCheckerTest, DocumentBuilderTest, FieldAnalysisRequestHandlerTest, IndexSchemaRuntimeFieldTest,
SolrPluginUtilsTest, TestCSVResponseWriter, QueryParsingTest, UniqFieldsUpdateProcessorFactoryTest,
BinaryUpdateRequestHandlerTest, TestPHPSerializedResponseWriter, CSVRequestHandlerTest, UpdateParamsTest,
AlternateDirectoryTest, TestSolrIndexConfig, TestQuerySenderNoQuery, ResponseLogComponentTest,
TestSolrDeletionPolicy2, MultiTermTest, TestDocSet, TestBinaryField, NumericFieldsTest, MinimalSchemaTest,
TestConfig, ExternalFileFieldSortTest, NotRequiredUniqueKeyTest, SpellPossibilityIteratorTest,
TestCharFilters, SynonymTokenizerTest, TestXIncludeConfig, TestPerFieldSimilarity, TestIBSimilarityFactory,
TestFastWriter, ResourceLoaderTest, ScriptEngineTest, DateMathParserTest, TestSystemIdResolver,
TestSuggestSpellingConverter, SpellingQueryConverterTest, TestDocumentBuilder, UUIDFieldTest,
CircularListTest, DistributedIntervalFacetingTest, TestPathTrie, TestEmbeddedSolrServerConstructors,
TestJettySolrRunner, ConnectionReuseTest, AsyncCallRequestStatusResponseTest, CdcrReplicationHandlerTest,
CdcrRequestHandlerTest, ChaosMonkeyNothingIsSafeWithPullReplicasTest, CleanupOldIndexTest,
CloudExitableDirectoryReaderTest, CollectionStateFormat2Test, CollectionsAPISolrJTest, DeleteStatusTest,
DocValuesNotIndexedTest, ForceLeaderTest, MultiThreadedOCPTest, PeerSyncReplicationTest, ReplaceNodeTest,
ShardSplitTest, TestLeaderInitiatedRecoveryThread, TestMiniSolrCloudCluster, TestPullReplicaErrorHandling,
TestRebalanceLeaders, TestRequestStatusCollectionAPI, TestSolrCloudWithSecureImpersonation,
TestStressCloudBlindAtomicUpdates, TestStressInPlaceUpdates, TestTolerantUpdateProcessorRandomCloud,
TlogReplayBufferedWhileIndexingTest, TriLevelCompositeIdRoutingTest, HdfsChaosMonkeyNothingIsSafeTest,
HdfsChaosMonkeySafeLeaderTest, HdfsRestartWhileUpdatingTest, HdfsThreadLeakTest, ZkStateWriterTest,
RuleEngineTest, CachingDirectoryFactoryTest, CoreSorterTest, ExitableDirectoryReaderTest,
HdfsDirectoryFactoryTest, QueryResultKeyTest, TestConfigOverlay, TestConfigSetImmutable, TestCustomStream,
RequestLoggingTest, TestBlobHandler, TestHdfsBackupRestoreCore, TestRestoreCore, CoreMergeIndexesAdminHandlerTest,
MetricsHandlerTest]
   [junit4] Completed [586/724 (1!)] on J1 in 0.63s, 3 tests, 1 failure <<< FAILURES!

[...truncated 43791 lines...]

Mime
View raw message