lucene-dev mailing list archives

Site index · List index
Message view « Date » · « Thread »
Top « Date » · « Thread »
From Policeman Jenkins Server <jenk...@thetaphi.de>
Subject [JENKINS-EA] Lucene-Solr-6.x-Linux (64bit/jdk-9-ea+171) - Build # 3638 - Still Unstable!
Date Thu, 01 Jun 2017 12:54:33 GMT
Build: https://jenkins.thetaphi.de/job/Lucene-Solr-6.x-Linux/3638/
Java: 64bit/jdk-9-ea+171 -XX:-UseCompressedOops -XX:+UseParallelGC

1 tests failed.
FAILED:  org.apache.solr.util.TestMaxTokenLenTokenizer.testSingleFieldSameAnalyzers

Error Message:
Exception during query

Stack Trace:
java.lang.RuntimeException: Exception during query
	at __randomizedtesting.SeedInfo.seed([57452151A5C76ECF:3D971E3EFD24BE00]:0)
	at org.apache.solr.SolrTestCaseJ4.assertQ(SolrTestCaseJ4.java:895)
	at org.apache.solr.util.TestMaxTokenLenTokenizer.testSingleFieldSameAnalyzers(TestMaxTokenLenTokenizer.java:104)
	at java.base/jdk.internal.reflect.NativeMethodAccessorImpl.invoke0(Native Method)
	at java.base/jdk.internal.reflect.NativeMethodAccessorImpl.invoke(NativeMethodAccessorImpl.java:62)
	at java.base/jdk.internal.reflect.DelegatingMethodAccessorImpl.invoke(DelegatingMethodAccessorImpl.java:43)
	at java.base/java.lang.reflect.Method.invoke(Method.java:563)
	at com.carrotsearch.randomizedtesting.RandomizedRunner.invoke(RandomizedRunner.java:1713)
	at com.carrotsearch.randomizedtesting.RandomizedRunner$8.evaluate(RandomizedRunner.java:907)
	at com.carrotsearch.randomizedtesting.RandomizedRunner$9.evaluate(RandomizedRunner.java:943)
	at com.carrotsearch.randomizedtesting.RandomizedRunner$10.evaluate(RandomizedRunner.java:957)
	at com.carrotsearch.randomizedtesting.rules.SystemPropertiesRestoreRule$1.evaluate(SystemPropertiesRestoreRule.java:57)
	at org.apache.lucene.util.TestRuleSetupTeardownChained$1.evaluate(TestRuleSetupTeardownChained.java:49)
	at org.apache.lucene.util.AbstractBeforeAfterRule$1.evaluate(AbstractBeforeAfterRule.java:45)
	at org.apache.lucene.util.TestRuleThreadAndTestName$1.evaluate(TestRuleThreadAndTestName.java:48)
	at org.apache.lucene.util.TestRuleIgnoreAfterMaxFailures$1.evaluate(TestRuleIgnoreAfterMaxFailures.java:64)
	at org.apache.lucene.util.TestRuleMarkFailure$1.evaluate(TestRuleMarkFailure.java:47)
	at com.carrotsearch.randomizedtesting.rules.StatementAdapter.evaluate(StatementAdapter.java:36)
	at com.carrotsearch.randomizedtesting.ThreadLeakControl$StatementRunner.run(ThreadLeakControl.java:368)
	at com.carrotsearch.randomizedtesting.ThreadLeakControl.forkTimeoutingTask(ThreadLeakControl.java:817)
	at com.carrotsearch.randomizedtesting.ThreadLeakControl$3.evaluate(ThreadLeakControl.java:468)
	at com.carrotsearch.randomizedtesting.RandomizedRunner.runSingleTest(RandomizedRunner.java:916)
	at com.carrotsearch.randomizedtesting.RandomizedRunner$5.evaluate(RandomizedRunner.java:802)
	at com.carrotsearch.randomizedtesting.RandomizedRunner$6.evaluate(RandomizedRunner.java:852)
	at com.carrotsearch.randomizedtesting.RandomizedRunner$7.evaluate(RandomizedRunner.java:863)
	at com.carrotsearch.randomizedtesting.rules.StatementAdapter.evaluate(StatementAdapter.java:36)
	at com.carrotsearch.randomizedtesting.rules.SystemPropertiesRestoreRule$1.evaluate(SystemPropertiesRestoreRule.java:57)
	at org.apache.lucene.util.AbstractBeforeAfterRule$1.evaluate(AbstractBeforeAfterRule.java:45)
	at com.carrotsearch.randomizedtesting.rules.StatementAdapter.evaluate(StatementAdapter.java:36)
	at org.apache.lucene.util.TestRuleStoreClassName$1.evaluate(TestRuleStoreClassName.java:41)
	at com.carrotsearch.randomizedtesting.rules.NoShadowingOrOverridesOnMethodsRule$1.evaluate(NoShadowingOrOverridesOnMethodsRule.java:40)
	at com.carrotsearch.randomizedtesting.rules.NoShadowingOrOverridesOnMethodsRule$1.evaluate(NoShadowingOrOverridesOnMethodsRule.java:40)
	at com.carrotsearch.randomizedtesting.rules.StatementAdapter.evaluate(StatementAdapter.java:36)
	at com.carrotsearch.randomizedtesting.rules.StatementAdapter.evaluate(StatementAdapter.java:36)
	at org.apache.lucene.util.TestRuleAssertionsRequired$1.evaluate(TestRuleAssertionsRequired.java:53)
	at org.apache.lucene.util.TestRuleMarkFailure$1.evaluate(TestRuleMarkFailure.java:47)
	at org.apache.lucene.util.TestRuleIgnoreAfterMaxFailures$1.evaluate(TestRuleIgnoreAfterMaxFailures.java:64)
	at org.apache.lucene.util.TestRuleIgnoreTestSuites$1.evaluate(TestRuleIgnoreTestSuites.java:54)
	at com.carrotsearch.randomizedtesting.rules.StatementAdapter.evaluate(StatementAdapter.java:36)
	at com.carrotsearch.randomizedtesting.ThreadLeakControl$StatementRunner.run(ThreadLeakControl.java:368)
	at java.base/java.lang.Thread.run(Thread.java:844)
Caused by: java.lang.RuntimeException: REQUEST FAILED: xpath=//result[@numFound=1]
	xml response was: <?xml version="1.0" encoding="UTF-8"?>
<response>
<lst name="responseHeader"><int name="status">0</int><int name="QTime">0</int></lst><result name="response" numFound="0" start="0"></result>
</response>

	request was:q=letter0:lett&wt=xml
	at org.apache.solr.SolrTestCaseJ4.assertQ(SolrTestCaseJ4.java:888)
	... 39 more




Build Log:
[...truncated 13296 lines...]
   [junit4] Suite: org.apache.solr.util.TestMaxTokenLenTokenizer
   [junit4]   2> Creating dataDir: /home/jenkins/workspace/Lucene-Solr-6.x-Linux/solr/build/solr-core/test/J0/temp/solr.util.TestMaxTokenLenTokenizer_57452151A5C76ECF-001/init-core-data-001
   [junit4]   2> 1771313 INFO  (SUITE-TestMaxTokenLenTokenizer-seed#[57452151A5C76ECF]-worker) [    ] o.a.s.SolrTestCaseJ4 Using PointFields
   [junit4]   2> 1771314 INFO  (SUITE-TestMaxTokenLenTokenizer-seed#[57452151A5C76ECF]-worker) [    ] o.a.s.SolrTestCaseJ4 Randomized ssl (false) and clientAuth (false) via: @org.apache.solr.util.RandomizeSSL(reason="", ssl=0.0/0.0, value=0.0/0.0, clientAuth=0.0/0.0)
   [junit4]   2> 1771314 INFO  (SUITE-TestMaxTokenLenTokenizer-seed#[57452151A5C76ECF]-worker) [    ] o.a.s.SolrTestCaseJ4 ####initCore
   [junit4]   2> 1771314 INFO  (SUITE-TestMaxTokenLenTokenizer-seed#[57452151A5C76ECF]-worker) [    ] o.a.s.c.SolrResourceLoader [null] Added 2 libs to classloader, from paths: [/home/jenkins/workspace/Lucene-Solr-6.x-Linux/solr/core/src/test-files/solr/collection1/lib, /home/jenkins/workspace/Lucene-Solr-6.x-Linux/solr/core/src/test-files/solr/collection1/lib/classes]
   [junit4]   2> 1771342 INFO  (SUITE-TestMaxTokenLenTokenizer-seed#[57452151A5C76ECF]-worker) [    ] o.a.s.c.SolrConfig Using Lucene MatchVersion: 6.7.0
   [junit4]   2> 1771373 INFO  (SUITE-TestMaxTokenLenTokenizer-seed#[57452151A5C76ECF]-worker) [    ] o.a.s.s.IndexSchema [null] Schema name=test
   [junit4]   2> 1771390 INFO  (SUITE-TestMaxTokenLenTokenizer-seed#[57452151A5C76ECF]-worker) [    ] o.a.s.s.IndexSchema Loaded schema test/1.0 with uniqueid field id
   [junit4]   2> 1771392 INFO  (SUITE-TestMaxTokenLenTokenizer-seed#[57452151A5C76ECF]-worker) [    ] o.a.s.u.UpdateShardHandler Creating UpdateShardHandler HTTP client with params: socketTimeout=30000&connTimeout=30000&retry=true
   [junit4]   2> 1771412 INFO  (SUITE-TestMaxTokenLenTokenizer-seed#[57452151A5C76ECF]-worker) [    ] o.a.s.m.r.SolrJmxReporter JMX monitoring for 'solr.node' (registry 'solr.node') enabled at server: com.sun.jmx.mbeanserver.JmxMBeanServer@4a664633
   [junit4]   2> 1771416 INFO  (SUITE-TestMaxTokenLenTokenizer-seed#[57452151A5C76ECF]-worker) [    ] o.a.s.m.r.SolrJmxReporter JMX monitoring for 'solr.jvm' (registry 'solr.jvm') enabled at server: com.sun.jmx.mbeanserver.JmxMBeanServer@4a664633
   [junit4]   2> 1771416 INFO  (SUITE-TestMaxTokenLenTokenizer-seed#[57452151A5C76ECF]-worker) [    ] o.a.s.m.r.SolrJmxReporter JMX monitoring for 'solr.jetty' (registry 'solr.jetty') enabled at server: com.sun.jmx.mbeanserver.JmxMBeanServer@4a664633
   [junit4]   2> 1771440 INFO  (coreLoadExecutor-8346-thread-1) [    ] o.a.s.c.SolrResourceLoader [null] Added 2 libs to classloader, from paths: [/home/jenkins/workspace/Lucene-Solr-6.x-Linux/solr/core/src/test-files/solr/collection1/lib, /home/jenkins/workspace/Lucene-Solr-6.x-Linux/solr/core/src/test-files/solr/collection1/lib/classes]
   [junit4]   2> 1771463 INFO  (coreLoadExecutor-8346-thread-1) [    ] o.a.s.c.SolrConfig Using Lucene MatchVersion: 6.7.0
   [junit4]   2> 1771486 INFO  (coreLoadExecutor-8346-thread-1) [    ] o.a.s.s.IndexSchema [collection1] Schema name=test
   [junit4]   2> 1771549 INFO  (coreLoadExecutor-8346-thread-1) [    ] o.a.s.s.IndexSchema Loaded schema test/1.0 with uniqueid field id
   [junit4]   2> 1771549 INFO  (coreLoadExecutor-8346-thread-1) [    ] o.a.s.c.CoreContainer Creating SolrCore 'collection1' using configuration from instancedir /home/jenkins/workspace/Lucene-Solr-6.x-Linux/solr/core/src/test-files/solr/collection1, trusted=true
   [junit4]   2> 1771549 INFO  (coreLoadExecutor-8346-thread-1) [    ] o.a.s.m.r.SolrJmxReporter JMX monitoring for 'solr.core.collection1' (registry 'solr.core.collection1') enabled at server: com.sun.jmx.mbeanserver.JmxMBeanServer@4a664633
   [junit4]   2> 1771550 INFO  (coreLoadExecutor-8346-thread-1) [    ] o.a.s.c.SolrCore solr.RecoveryStrategy.Builder
   [junit4]   2> 1771550 INFO  (coreLoadExecutor-8346-thread-1) [    ] o.a.s.c.SolrCore [[collection1] ] Opening new SolrCore at [/home/jenkins/workspace/Lucene-Solr-6.x-Linux/solr/core/src/test-files/solr/collection1], dataDir=[/home/jenkins/workspace/Lucene-Solr-6.x-Linux/solr/build/solr-core/test/J0/temp/solr.util.TestMaxTokenLenTokenizer_57452151A5C76ECF-001/init-core-data-001/]
   [junit4]   2> 1771552 INFO  (coreLoadExecutor-8346-thread-1) [    ] o.a.s.u.RandomMergePolicy RandomMergePolicy wrapping class org.apache.lucene.index.LogByteSizeMergePolicy: [LogByteSizeMergePolicy: minMergeSize=1677721, mergeFactor=41, maxMergeSize=2147483648, maxMergeSizeForForcedMerge=9223372036854775807, calibrateSizeByDeletes=true, maxMergeDocs=2147483647, maxCFSSegmentSizeMB=8.796093022207999E12, noCFSRatio=0.6120898001883901]
   [junit4]   2> 1771578 INFO  (coreLoadExecutor-8346-thread-1) [    ] o.a.s.u.CommitTracker Hard AutoCommit: disabled
   [junit4]   2> 1771578 INFO  (coreLoadExecutor-8346-thread-1) [    ] o.a.s.u.CommitTracker Soft AutoCommit: disabled
   [junit4]   2> 1771579 INFO  (coreLoadExecutor-8346-thread-1) [    ] o.a.s.u.RandomMergePolicy RandomMergePolicy wrapping class org.apache.lucene.index.AlcoholicMergePolicy: [AlcoholicMergePolicy: minMergeSize=0, mergeFactor=10, maxMergeSize=1376454500, maxMergeSizeForForcedMerge=9223372036854775807, calibrateSizeByDeletes=true, maxMergeDocs=2147483647, maxCFSSegmentSizeMB=8.796093022207999E12, noCFSRatio=0.1]
   [junit4]   2> 1771579 INFO  (coreLoadExecutor-8346-thread-1) [    ] o.a.s.s.SolrIndexSearcher Opening [Searcher@4367e872[collection1] main]
   [junit4]   2> 1771579 WARN  (coreLoadExecutor-8346-thread-1) [    ] o.a.s.r.ManagedResourceStorage Cannot write to config directory /home/jenkins/workspace/Lucene-Solr-6.x-Linux/solr/core/src/test-files/solr/collection1/conf; switching to use InMemory storage instead.
   [junit4]   2> 1771580 INFO  (coreLoadExecutor-8346-thread-1) [    ] o.a.s.h.ReplicationHandler Commits will be reserved for  10000
   [junit4]   2> 1771580 INFO  (searcherExecutor-8347-thread-1) [    ] o.a.s.c.SolrCore [collection1] Registered new searcher Searcher@4367e872[collection1] main{ExitableDirectoryReader(UninvertingDirectoryReader())}
   [junit4]   2> 1771581 INFO  (SUITE-TestMaxTokenLenTokenizer-seed#[57452151A5C76ECF]-worker) [    ] o.a.s.SolrTestCaseJ4 ####initCore end
   [junit4]   2> 1771582 INFO  (TEST-TestMaxTokenLenTokenizer.testSingleFieldSameAnalyzers-seed#[57452151A5C76ECF]) [    ] o.a.s.SolrTestCaseJ4 ###Starting testSingleFieldSameAnalyzers
   [junit4]   2> 1771582 INFO  (TEST-TestMaxTokenLenTokenizer.testSingleFieldSameAnalyzers-seed#[57452151A5C76ECF]) [    ] o.a.s.u.DirectUpdateHandler2 [collection1] REMOVING ALL DOCUMENTS FROM INDEX
   [junit4]   2> 1771583 INFO  (TEST-TestMaxTokenLenTokenizer.testSingleFieldSameAnalyzers-seed#[57452151A5C76ECF]) [    ] o.a.s.u.p.LogUpdateProcessorFactory [collection1]  webapp=null path=null params={_version_=-9223372036854775807&update.distrib=FROMLEADER&versions=true&wt=json&indent=true}{deleteByQuery=*:*} 0 0
   [junit4]   2> 1771583 INFO  (TEST-TestMaxTokenLenTokenizer.testSingleFieldSameAnalyzers-seed#[57452151A5C76ECF]) [    ] o.a.s.u.DirectUpdateHandler2 start commit{,optimize=false,openSearcher=true,waitSearcher=true,expungeDeletes=false,softCommit=false,prepareCommit=false}
   [junit4]   2> 1771583 INFO  (TEST-TestMaxTokenLenTokenizer.testSingleFieldSameAnalyzers-seed#[57452151A5C76ECF]) [    ] o.a.s.u.SolrIndexWriter Calling setCommitData with IW:org.apache.solr.update.SolrIndexWriter@7aaa4b53
   [junit4]   2> 1771585 INFO  (TEST-TestMaxTokenLenTokenizer.testSingleFieldSameAnalyzers-seed#[57452151A5C76ECF]) [    ] o.a.s.s.SolrIndexSearcher Opening [Searcher@18d087a5[collection1] main]
   [junit4]   2> 1771586 INFO  (TEST-TestMaxTokenLenTokenizer.testSingleFieldSameAnalyzers-seed#[57452151A5C76ECF]) [    ] o.a.s.u.DirectUpdateHandler2 end_commit_flush
   [junit4]   2> 1771586 INFO  (searcherExecutor-8347-thread-1) [    ] o.a.s.c.SolrCore [collection1] Registered new searcher Searcher@18d087a5[collection1] main{ExitableDirectoryReader(UninvertingDirectoryReader(Uninverting(_0(6.7.0):c1)))}
   [junit4]   2> 1771586 INFO  (TEST-TestMaxTokenLenTokenizer.testSingleFieldSameAnalyzers-seed#[57452151A5C76ECF]) [    ] o.a.s.u.p.LogUpdateProcessorFactory [collection1]  webapp=null path=null params={wt=json&indent=true}{add=[1],commit=} 0 3
   [junit4]   2> 1771586 INFO  (TEST-TestMaxTokenLenTokenizer.testSingleFieldSameAnalyzers-seed#[57452151A5C76ECF]) [    ] o.a.s.u.DirectUpdateHandler2 start commit{,optimize=false,openSearcher=true,waitSearcher=true,expungeDeletes=false,softCommit=false,prepareCommit=false}
   [junit4]   2> 1771586 INFO  (TEST-TestMaxTokenLenTokenizer.testSingleFieldSameAnalyzers-seed#[57452151A5C76ECF]) [    ] o.a.s.u.SolrIndexWriter Calling setCommitData with IW:org.apache.solr.update.SolrIndexWriter@7aaa4b53
   [junit4]   2> 1771587 INFO  (TEST-TestMaxTokenLenTokenizer.testSingleFieldSameAnalyzers-seed#[57452151A5C76ECF]) [    ] o.a.s.s.SolrIndexSearcher Opening [Searcher@28dda1ad[collection1] main]
   [junit4]   2> 1771588 INFO  (TEST-TestMaxTokenLenTokenizer.testSingleFieldSameAnalyzers-seed#[57452151A5C76ECF]) [    ] o.a.s.u.DirectUpdateHandler2 end_commit_flush
   [junit4]   2> 1771588 INFO  (searcherExecutor-8347-thread-1) [    ] o.a.s.c.SolrCore [collection1] Registered new searcher Searcher@28dda1ad[collection1] main{ExitableDirectoryReader(UninvertingDirectoryReader(Uninverting(_0(6.7.0):c1) Uninverting(_1(6.7.0):c1)))}
   [junit4]   2> 1771588 INFO  (TEST-TestMaxTokenLenTokenizer.testSingleFieldSameAnalyzers-seed#[57452151A5C76ECF]) [    ] o.a.s.u.p.LogUpdateProcessorFactory [collection1]  webapp=null path=null params={wt=json&indent=true}{add=[2],commit=} 0 2
   [junit4]   2> 1771588 INFO  (TEST-TestMaxTokenLenTokenizer.testSingleFieldSameAnalyzers-seed#[57452151A5C76ECF]) [    ] o.a.s.u.DirectUpdateHandler2 start commit{,optimize=false,openSearcher=true,waitSearcher=true,expungeDeletes=false,softCommit=false,prepareCommit=false}
   [junit4]   2> 1771589 INFO  (TEST-TestMaxTokenLenTokenizer.testSingleFieldSameAnalyzers-seed#[57452151A5C76ECF]) [    ] o.a.s.u.SolrIndexWriter Calling setCommitData with IW:org.apache.solr.update.SolrIndexWriter@7aaa4b53
   [junit4]   2> 1771590 INFO  (TEST-TestMaxTokenLenTokenizer.testSingleFieldSameAnalyzers-seed#[57452151A5C76ECF]) [    ] o.a.s.s.SolrIndexSearcher Opening [Searcher@7cce4fa6[collection1] main]
   [junit4]   2> 1771590 INFO  (TEST-TestMaxTokenLenTokenizer.testSingleFieldSameAnalyzers-seed#[57452151A5C76ECF]) [    ] o.a.s.u.DirectUpdateHandler2 end_commit_flush
   [junit4]   2> 1771590 INFO  (searcherExecutor-8347-thread-1) [    ] o.a.s.c.SolrCore [collection1] Registered new searcher Searcher@7cce4fa6[collection1] main{ExitableDirectoryReader(UninvertingDirectoryReader(Uninverting(_0(6.7.0):c1) Uninverting(_1(6.7.0):c1) Uninverting(_2(6.7.0):c1)))}
   [junit4]   2> 1771591 INFO  (TEST-TestMaxTokenLenTokenizer.testSingleFieldSameAnalyzers-seed#[57452151A5C76ECF]) [    ] o.a.s.u.p.LogUpdateProcessorFactory [collection1]  webapp=null path=null params={wt=json&indent=true}{add=[3],commit=} 0 2
   [junit4]   2> 1771591 INFO  (TEST-TestMaxTokenLenTokenizer.testSingleFieldSameAnalyzers-seed#[57452151A5C76ECF]) [    ] o.a.s.u.DirectUpdateHandler2 start commit{,optimize=false,openSearcher=true,waitSearcher=true,expungeDeletes=false,softCommit=false,prepareCommit=false}
   [junit4]   2> 1771591 INFO  (TEST-TestMaxTokenLenTokenizer.testSingleFieldSameAnalyzers-seed#[57452151A5C76ECF]) [    ] o.a.s.u.SolrIndexWriter Calling setCommitData with IW:org.apache.solr.update.SolrIndexWriter@7aaa4b53
   [junit4]   2> 1771592 INFO  (TEST-TestMaxTokenLenTokenizer.testSingleFieldSameAnalyzers-seed#[57452151A5C76ECF]) [    ] o.a.s.s.SolrIndexSearcher Opening [Searcher@9a1e29e[collection1] main]
   [junit4]   2> 1771593 INFO  (TEST-TestMaxTokenLenTokenizer.testSingleFieldSameAnalyzers-seed#[57452151A5C76ECF]) [    ] o.a.s.u.DirectUpdateHandler2 end_commit_flush
   [junit4]   2> 1771593 INFO  (searcherExecutor-8347-thread-1) [    ] o.a.s.c.SolrCore [collection1] Registered new searcher Searcher@9a1e29e[collection1] main{ExitableDirectoryReader(UninvertingDirectoryReader(Uninverting(_0(6.7.0):c1) Uninverting(_1(6.7.0):c1) Uninverting(_2(6.7.0):c1) Uninverting(_3(6.7.0):c1)))}
   [junit4]   2> 1771593 INFO  (TEST-TestMaxTokenLenTokenizer.testSingleFieldSameAnalyzers-seed#[57452151A5C76ECF]) [    ] o.a.s.u.p.LogUpdateProcessorFactory [collection1]  webapp=null path=null params={wt=json&indent=true}{add=[4],commit=} 0 2
   [junit4]   2> 1771593 INFO  (TEST-TestMaxTokenLenTokenizer.testSingleFieldSameAnalyzers-seed#[57452151A5C76ECF]) [    ] o.a.s.u.DirectUpdateHandler2 start commit{,optimize=false,openSearcher=true,waitSearcher=true,expungeDeletes=false,softCommit=false,prepareCommit=false}
   [junit4]   2> 1771593 INFO  (TEST-TestMaxTokenLenTokenizer.testSingleFieldSameAnalyzers-seed#[57452151A5C76ECF]) [    ] o.a.s.u.SolrIndexWriter Calling setCommitData with IW:org.apache.solr.update.SolrIndexWriter@7aaa4b53
   [junit4]   2> 1771594 INFO  (TEST-TestMaxTokenLenTokenizer.testSingleFieldSameAnalyzers-seed#[57452151A5C76ECF]) [    ] o.a.s.s.SolrIndexSearcher Opening [Searcher@1db01cf9[collection1] main]
   [junit4]   2> 1771595 INFO  (TEST-TestMaxTokenLenTokenizer.testSingleFieldSameAnalyzers-seed#[57452151A5C76ECF]) [    ] o.a.s.u.DirectUpdateHandler2 end_commit_flush
   [junit4]   2> 1771595 INFO  (searcherExecutor-8347-thread-1) [    ] o.a.s.c.SolrCore [collection1] Registered new searcher Searcher@1db01cf9[collection1] main{ExitableDirectoryReader(UninvertingDirectoryReader(Uninverting(_0(6.7.0):c1) Uninverting(_1(6.7.0):c1) Uninverting(_2(6.7.0):c1) Uninverting(_3(6.7.0):c1) Uninverting(_4(6.7.0):c1)))}
   [junit4]   2> 1771595 INFO  (TEST-TestMaxTokenLenTokenizer.testSingleFieldSameAnalyzers-seed#[57452151A5C76ECF]) [    ] o.a.s.u.p.LogUpdateProcessorFactory [collection1]  webapp=null path=null params={wt=json&indent=true}{add=[5],commit=} 0 2
   [junit4]   2> 1771595 INFO  (TEST-TestMaxTokenLenTokenizer.testSingleFieldSameAnalyzers-seed#[57452151A5C76ECF]) [    ] o.a.s.u.DirectUpdateHandler2 start commit{,optimize=false,openSearcher=true,waitSearcher=true,expungeDeletes=false,softCommit=false,prepareCommit=false}
   [junit4]   2> 1771595 INFO  (TEST-TestMaxTokenLenTokenizer.testSingleFieldSameAnalyzers-seed#[57452151A5C76ECF]) [    ] o.a.s.u.DirectUpdateHandler2 No uncommitted changes. Skipping IW.commit.
   [junit4]   2> 1771595 INFO  (TEST-TestMaxTokenLenTokenizer.testSingleFieldSameAnalyzers-seed#[57452151A5C76ECF]) [    ] o.a.s.u.DirectUpdateHandler2 end_commit_flush
   [junit4]   2> 1771595 INFO  (TEST-TestMaxTokenLenTokenizer.testSingleFieldSameAnalyzers-seed#[57452151A5C76ECF]) [    ] o.a.s.u.p.LogUpdateProcessorFactory [collection1]  webapp=null path=null params={}{commit=} 0 0
   [junit4]   2> 1771597 INFO  (TEST-TestMaxTokenLenTokenizer.testSingleFieldSameAnalyzers-seed#[57452151A5C76ECF]) [    ] o.a.s.c.S.Request [collection1]  webapp=null path=null params={q=*:*&wt=xml} hits=5 status=0 QTime=0
   [junit4]   2> 1771597 INFO  (TEST-TestMaxTokenLenTokenizer.testSingleFieldSameAnalyzers-seed#[57452151A5C76ECF]) [    ] o.a.s.c.S.Request [collection1]  webapp=null path=null params={q=letter0:l&wt=xml} hits=0 status=0 QTime=0
   [junit4]   2> 1771598 INFO  (TEST-TestMaxTokenLenTokenizer.testSingleFieldSameAnalyzers-seed#[57452151A5C76ECF]) [    ] o.a.s.c.S.Request [collection1]  webapp=null path=null params={q=letter0:let&wt=xml} hits=1 status=0 QTime=0
   [junit4]   2> 1771598 INFO  (TEST-TestMaxTokenLenTokenizer.testSingleFieldSameAnalyzers-seed#[57452151A5C76ECF]) [    ] o.a.s.c.S.Request [collection1]  webapp=null path=null params={q=letter0:lett&wt=xml} hits=0 status=0 QTime=0
   [junit4]   2> 1771598 ERROR (TEST-TestMaxTokenLenTokenizer.testSingleFieldSameAnalyzers-seed#[57452151A5C76ECF]) [    ] o.a.s.SolrTestCaseJ4 REQUEST FAILED: xpath=//result[@numFound=1]
   [junit4]   2> 	xml response was: <?xml version="1.0" encoding="UTF-8"?>
   [junit4]   2> <response>
   [junit4]   2> <lst name="responseHeader"><int name="status">0</int><int name="QTime">0</int></lst><result name="response" numFound="0" start="0"></result>
   [junit4]   2> </response>
   [junit4]   2> 
   [junit4]   2> 	request was:q=letter0:lett&wt=xml
   [junit4]   2> 1771599 ERROR (TEST-TestMaxTokenLenTokenizer.testSingleFieldSameAnalyzers-seed#[57452151A5C76ECF]) [    ] o.a.s.SolrTestCaseJ4 REQUEST FAILED: q=letter0:lett&wt=xml:java.lang.RuntimeException: REQUEST FAILED: xpath=//result[@numFound=1]
   [junit4]   2> 	xml response was: <?xml version="1.0" encoding="UTF-8"?>
   [junit4]   2> <response>
   [junit4]   2> <lst name="responseHeader"><int name="status">0</int><int name="QTime">0</int></lst><result name="response" numFound="0" start="0"></result>
   [junit4]   2> </response>
   [junit4]   2> 
   [junit4]   2> 	request was:q=letter0:lett&wt=xml
   [junit4]   2> 	at org.apache.solr.SolrTestCaseJ4.assertQ(SolrTestCaseJ4.java:888)
   [junit4]   2> 	at org.apache.solr.util.TestMaxTokenLenTokenizer.testSingleFieldSameAnalyzers(TestMaxTokenLenTokenizer.java:104)
   [junit4]   2> 	at java.base/jdk.internal.reflect.NativeMethodAccessorImpl.invoke0(Native Method)
   [junit4]   2> 	at java.base/jdk.internal.reflect.NativeMethodAccessorImpl.invoke(NativeMethodAccessorImpl.java:62)
   [junit4]   2> 	at java.base/jdk.internal.reflect.DelegatingMethodAccessorImpl.invoke(DelegatingMethodAccessorImpl.java:43)
   [junit4]   2> 	at java.base/java.lang.reflect.Method.invoke(Method.java:563)
   [junit4]   2> 	at com.carrotsearch.randomizedtesting.RandomizedRunner.invoke(RandomizedRunner.java:1713)
   [junit4]   2> 	at com.carrotsearch.randomizedtesting.RandomizedRunner$8.evaluate(RandomizedRunner.java:907)
   [junit4]   2> 	at com.carrotsearch.randomizedtesting.RandomizedRunner$9.evaluate(RandomizedRunner.java:943)
   [junit4]   2> 	at com.carrotsearch.randomizedtesting.RandomizedRunner$10.evaluate(RandomizedRunner.java:957)
   [junit4]   2> 	at com.carrotsearch.randomizedtesting.rules.SystemPropertiesRestoreRule$1.evaluate(SystemPropertiesRestoreRule.java:57)
   [junit4]   2> 	at org.apache.lucene.util.TestRuleSetupTeardownChained$1.evaluate(TestRuleSetupTeardownChained.java:49)
   [junit4]   2> 	at org.apache.lucene.util.AbstractBeforeAfterRule$1.evaluate(AbstractBeforeAfterRule.java:45)
   [junit4]   2> 	at org.apache.lucene.util.TestRuleThreadAndTestName$1.evaluate(TestRuleThreadAndTestName.java:48)
   [junit4]   2> 	at org.apache.lucene.util.TestRuleIgnoreAfterMaxFailures$1.evaluate(TestRuleIgnoreAfterMaxFailures.java:64)
   [junit4]   2> 	at org.apache.lucene.util.TestRuleMarkFailure$1.evaluate(TestRuleMarkFailure.java:47)
   [junit4]   2> 	at com.carrotsearch.randomizedtesting.rules.StatementAdapter.evaluate(StatementAdapter.java:36)
   [junit4]   2> 	at com.carrotsearch.randomizedtesting.ThreadLeakControl$StatementRunner.run(ThreadLeakControl.java:368)
   [junit4]   2> 	at com.carrotsearch.randomizedtesting.ThreadLeakControl.forkTimeoutingTask(ThreadLeakControl.java:817)
   [junit4]   2> 	at com.carrotsearch.randomizedtesting.ThreadLeakControl$3.evaluate(ThreadLeakControl.java:468)
   [junit4]   2> 	at com.carrotsearch.randomizedtesting.RandomizedRunner.runSingleTest(RandomizedRunner.java:916)
   [junit4]   2> 	at com.carrotsearch.randomizedtesting.RandomizedRunner$5.evaluate(RandomizedRunner.java:802)
   [junit4]   2> 	at com.carrotsearch.randomizedtesting.RandomizedRunner$6.evaluate(RandomizedRunner.java:852)
   [junit4]   2> 	at com.carrotsearch.randomizedtesting.RandomizedRunner$7.evaluate(RandomizedRunner.java:863)
   [junit4]   2> 	at com.carrotsearch.randomizedtesting.rules.StatementAdapter.evaluate(StatementAdapter.java:36)
   [junit4]   2> 	at com.carrotsearch.randomizedtesting.rules.SystemPropertiesRestoreRule$1.evaluate(SystemPropertiesRestoreRule.java:57)
   [junit4]   2> 	at org.apache.lucene.util.AbstractBeforeAfterRule$1.evaluate(AbstractBeforeAfterRule.java:45)
   [junit4]   2> 	at com.carrotsearch.randomizedtesting.rules.StatementAdapter.evaluate(StatementAdapter.java:36)
   [junit4]   2> 	at org.apache.lucene.util.TestRuleStoreClassName$1.evaluate(TestRuleStoreClassName.java:41)
   [junit4]   2> 	at com.carrotsearch.randomizedtesting.rules.NoShadowingOrOverridesOnMethodsRule$1.evaluate(NoShadowingOrOverridesOnMethodsRule.java:40)
   [junit4]   2> 	at com.carrotsearch.randomizedtesting.rules.NoShadowingOrOverridesOnMethodsRule$1.evaluate(NoShadowingOrOverridesOnMethodsRule.java:40)
   [junit4]   2> 	at com.carrotsearch.randomizedtesting.rules.StatementAdapter.evaluate(StatementAdapter.java:36)
   [junit4]   2> 	at com.carrotsearch.randomizedtesting.rules.StatementAdapter.evaluate(StatementAdapter.java:36)
   [junit4]   2> 	at org.apache.lucene.util.TestRuleAssertionsRequired$1.evaluate(TestRuleAssertionsRequired.java:53)
   [junit4]   2> 	at org.apache.lucene.util.TestRuleMarkFailure$1.evaluate(TestRuleMarkFailure.java:47)
   [junit4]   2> 	at org.apache.lucene.util.TestRuleIgnoreAfterMaxFailures$1.evaluate(TestRuleIgnoreAfterMaxFailures.java:64)
   [junit4]   2> 	at org.apache.lucene.util.TestRuleIgnoreTestSuites$1.evaluate(TestRuleIgnoreTestSuites.java:54)
   [junit4]   2> 	at com.carrotsearch.randomizedtesting.rules.StatementAdapter.evaluate(StatementAdapter.java:36)
   [junit4]   2> 	at com.carrotsearch.randomizedtesting.ThreadLeakControl$StatementRunner.run(ThreadLeakControl.java:368)
   [junit4]   2> 	at java.base/java.lang.Thread.run(Thread.java:844)
   [junit4]   2> 
   [junit4]   2> 1771599 INFO  (TEST-TestMaxTokenLenTokenizer.testSingleFieldSameAnalyzers-seed#[57452151A5C76ECF]) [    ] o.a.s.SolrTestCaseJ4 ###Ending testSingleFieldSameAnalyzers
   [junit4]   2> NOTE: reproduce with: ant test  -Dtestcase=TestMaxTokenLenTokenizer -Dtests.method=testSingleFieldSameAnalyzers -Dtests.seed=57452151A5C76ECF -Dtests.multiplier=3 -Dtests.slow=true -Dtests.locale=fr-MR -Dtests.timezone=JST -Dtests.asserts=true -Dtests.file.encoding=US-ASCII
   [junit4] ERROR   0.02s J0 | TestMaxTokenLenTokenizer.testSingleFieldSameAnalyzers <<<
   [junit4]    > Throwable #1: java.lang.RuntimeException: Exception during query
   [junit4]    > 	at __randomizedtesting.SeedInfo.seed([57452151A5C76ECF:3D971E3EFD24BE00]:0)
   [junit4]    > 	at org.apache.solr.SolrTestCaseJ4.assertQ(SolrTestCaseJ4.java:895)
   [junit4]    > 	at org.apache.solr.util.TestMaxTokenLenTokenizer.testSingleFieldSameAnalyzers(TestMaxTokenLenTokenizer.java:104)
   [junit4]    > 	at java.base/jdk.internal.reflect.NativeMethodAccessorImpl.invoke0(Native Method)
   [junit4]    > 	at java.base/jdk.internal.reflect.NativeMethodAccessorImpl.invoke(NativeMethodAccessorImpl.java:62)
   [junit4]    > 	at java.base/jdk.internal.reflect.DelegatingMethodAccessorImpl.invoke(DelegatingMethodAccessorImpl.java:43)
   [junit4]    > 	at java.base/java.lang.reflect.Method.invoke(Method.java:563)
   [junit4]    > 	at java.base/java.lang.Thread.run(Thread.java:844)
   [junit4]    > Caused by: java.lang.RuntimeException: REQUEST FAILED: xpath=//result[@numFound=1]
   [junit4]    > 	xml response was: <?xml version="1.0" encoding="UTF-8"?>
   [junit4]    > <response>
   [junit4]    > <lst name="responseHeader"><int name="status">0</int><int name="QTime">0</int></lst><result name="response" numFound="0" start="0"></result>
   [junit4]    > </response>
   [junit4]    > 	request was:q=letter0:lett&wt=xml
   [junit4]    > 	at org.apache.solr.SolrTestCaseJ4.assertQ(SolrTestCaseJ4.java:888)
   [junit4]    > 	... 39 more
   [junit4]   2> 1771602 INFO  (TEST-TestMaxTokenLenTokenizer.testSingleFieldDiffAnalyzers-seed#[57452151A5C76ECF]) [    ] o.a.s.SolrTestCaseJ4 ###Starting testSingleFieldDiffAnalyzers
   [junit4]   2> 1771602 INFO  (TEST-TestMaxTokenLenTokenizer.testSingleFieldDiffAnalyzers-seed#[57452151A5C76ECF]) [    ] o.a.s.u.DirectUpdateHandler2 [collection1] REMOVING ALL DOCUMENTS FROM INDEX
   [junit4]   2> 1771602 INFO  (TEST-TestMaxTokenLenTokenizer.testSingleFieldDiffAnalyzers-seed#[57452151A5C76ECF]) [    ] o.a.s.u.p.LogUpdateProcessorFactory [collection1]  webapp=null path=null params={_version_=-9223372036854775807&update.distrib=FROMLEADER&versions=true&wt=json&indent=true}{deleteByQuery=*:*} 0 0
   [junit4]   2> 1771603 INFO  (TEST-TestMaxTokenLenTokenizer.testSingleFieldDiffAnalyzers-seed#[57452151A5C76ECF]) [    ] o.a.s.u.DirectUpdateHandler2 start commit{,optimize=false,openSearcher=true,waitSearcher=true,expungeDeletes=false,softCommit=false,prepareCommit=false}
   [junit4]   2> 1771603 INFO  (TEST-TestMaxTokenLenTokenizer.testSingleFieldDiffAnalyzers-seed#[57452151A5C76ECF]) [    ] o.a.s.u.SolrIndexWriter Calling setCommitData with IW:org.apache.solr.update.SolrIndexWriter@7aaa4b53
   [junit4]   2> 1771604 INFO  (TEST-TestMaxTokenLenTokenizer.testSingleFieldDiffAnalyzers-seed#[57452151A5C76ECF]) [    ] o.a.s.s.SolrIndexSearcher Opening [Searcher@17209a46[collection1] main]
   [junit4]   2> 1771605 INFO  (TEST-TestMaxTokenLenTokenizer.testSingleFieldDiffAnalyzers-seed#[57452151A5C76ECF]) [    ] o.a.s.u.DirectUpdateHandler2 end_commit_flush
   [junit4]   2> 1771605 INFO  (searcherExecutor-8347-thread-1) [    ] o.a.s.c.SolrCore [collection1] Registered new searcher Searcher@17209a46[collection1] main{ExitableDirectoryReader(UninvertingDirectoryReader(Uninverting(_5(6.7.0):c1)))}
   [junit4]   2> 1771605 INFO  (TEST-TestMaxTokenLenTokenizer.testSingleFieldDiffAnalyzers-seed#[57452151A5C76ECF]) [    ] o.a.s.u.p.LogUpdateProcessorFactory [collection1]  webapp=null path=null params={wt=json&indent=true}{add=[1],commit=} 0 2
   [junit4]   2> 1771605 INFO  (TEST-TestMaxTokenLenTokenizer.testSingleFieldDiffAnalyzers-seed#[57452151A5C76ECF]) [    ] o.a.s.u.DirectUpdateHandler2 start commit{,optimize=false,openSearcher=true,waitSearcher=true,expungeDeletes=false,softCommit=false,prepareCommit=false}
   [junit4]   2> 1771605 INFO  (TEST-TestMaxTokenLenTokenizer.testSingleFieldDiffAnalyzers-seed#[57452151A5C76ECF]) [    ] o.a.s.u.SolrIndexWriter Calling setCommitData with IW:org.apache.solr.update.SolrIndexWriter@7aaa4b53
   [junit4]   2> 1771607 INFO  (TEST-TestMaxTokenLenTokenizer.testSingleFieldDiffAnalyzers-seed#[57452151A5C76ECF]) [    ] o.a.s.s.SolrIndexSearcher Opening [Searcher@744f1e61[collection1] main]
   [junit4]   2> 1771607 INFO  (TEST-TestMaxTokenLenTokenizer.testSingleFieldDiffAnalyzers-seed#[57452151A5C76ECF]) [    ] o.a.s.u.DirectUpdateHandler2 end_commit_flush
   [junit4]   2> 1771607 INFO  (searcherExecutor-8347-thread-1) [    ] o.a.s.c.SolrCore [collection1] Registered new searcher Searcher@744f1e61[collection1] main{ExitableDirectoryReader(UninvertingDirectoryReader(Uninverting(_5(6.7.0):c1) Uninverting(_6(6.7.0):c1)))}
   [junit4]   2> 1771607 INFO  (TEST-TestMaxTokenLenTokenizer.testSingleFieldDiffAnalyzers-seed#[57452151A5C76ECF]) [    ] o.a.s.u.p.LogUpdateProcessorFactory [collection1]  webapp=null path=null params={wt=json&indent=true}{add=[2],commit=} 0 2
   [junit4]   2> 1771608 INFO  (TEST-TestMaxTokenLenTokenizer.testSingleFieldDiffAnalyzers-seed#[57452151A5C76ECF]) [    ] o.a.s.u.DirectUpdateHandler2 start commit{,optimize=false,openSearcher=true,waitSearcher=true,expungeDeletes=false,softCommit=false,prepareCommit=false}
   [junit4]   2> 1771608 INFO  (TEST-TestMaxTokenLenTokenizer.testSingleFieldDiffAnalyzers-seed#[57452151A5C76ECF]) [    ] o.a.s.u.SolrIndexWriter Calling setCommitData with IW:org.apache.solr.update.SolrIndexWriter@7aaa4b53
   [junit4]   2> 1771609 INFO  (TEST-TestMaxTokenLenTokenizer.testSingleFieldDiffAnalyzers-seed#[57452151A5C76ECF]) [    ] o.a.s.s.SolrIndexSearcher Opening [Searcher@4e2daf6b[collection1] main]
   [junit4]   2> 1771610 INFO  (TEST-TestMaxTokenLenTokenizer.testSingleFieldDiffAnalyzers-seed#[57452151A5C76ECF]) [    ] o.a.s.u.DirectUpdateHandler2 end_commit_flush
   [junit4]   2> 1771610 INFO  (searcherExecutor-8347-thread-1) [    ] o.a.s.c.SolrCore [collection1] Registered new searcher Searcher@4e2daf6b[collection1] main{ExitableDirectoryReader(UninvertingDirectoryReader(Uninverting(_5(6.7.0):c1) Uninverting(_6(6.7.0):c1) Uninverting(_7(6.7.0):c1)))}
   [junit4]   2> 1771610 INFO  (TEST-TestMaxTokenLenTokenizer.testSingleFieldDiffAnalyzers-seed#[57452151A5C76ECF]) [    ] o.a.s.u.p.LogUpdateProcessorFactory [collection1]  webapp=null path=null params={wt=json&indent=true}{add=[3],commit=} 0 2
   [junit4]   2> 1771610 INFO  (TEST-TestMaxTokenLenTokenizer.testSingleFieldDiffAnalyzers-seed#[57452151A5C76ECF]) [    ] o.a.s.u.DirectUpdateHandler2 start commit{,optimize=false,openSearcher=true,waitSearcher=true,expungeDeletes=false,softCommit=false,prepareCommit=false}
   [junit4]   2> 1771610 INFO  (TEST-TestMaxTokenLenTokenizer.testSingleFieldDiffAnalyzers-seed#[57452151A5C76ECF]) [    ] o.a.s.u.SolrIndexWriter Calling setCommitData with IW:org.apache.solr.update.SolrIndexWriter@7aaa4b53
   [junit4]   2> 1771612 INFO  (TEST-TestMaxTokenLenTokenizer.testSingleFieldDiffAnalyzers-seed#[57452151A5C76ECF]) [    ] o.a.s.s.SolrIndexSearcher Opening [Searcher@f796ea4[collection1] main]
   [junit4]   2> 1771612 INFO  (TEST-TestMaxTokenLenTokenizer.testSingleFieldDiffAnalyzers-seed#[57452151A5C76ECF]) [    ] o.a.s.u.DirectUpdateHandler2 end_commit_flush
   [junit4]   2> 1771613 INFO  (searcherExecutor-8347-thread-1) [    ] o.a.s.c.SolrCore [collection1] Registered new searcher Searcher@f796ea4[collection1] main{ExitableDirectoryReader(UninvertingDirectoryReader(Uninverting(_5(6.7.0):c1) Uninverting(_6(6.7.0):c1) Uninverting(_7(6.7.0):c1) Uninverting(_8(6.7.0):c1)))}
   [junit4]   2> 1771613 INFO  (TEST-TestMaxTokenLenTokenizer.testSingleFieldDiffAnalyzers-seed#[57452151A5C76ECF]) [    ] o.a.s.u.p.LogUpdateProcessorFactory [collection1]  webapp=null path=null params={wt=json&indent=true}{add=[4],commit=} 0 2
   [junit4]   2> 1771613 INFO  (TEST-TestMaxTokenLenTokenizer.testSingleFieldDiffAnalyzers-seed#[57452151A5C76ECF]) [    ] o.a.s.u.DirectUpdateHandler2 start commit{,optimize=false,openSearcher=true,waitSearcher=true,expungeDeletes=false,softCommit=false,prepareCommit=false}
   [junit4]   2> 1771613 INFO  (TEST-TestMaxTokenLenTokenizer.testSingleFieldDiffAnalyzers-seed#[57452151A5C76ECF]) [    ] o.a.s.u.SolrIndexWriter Calling setCommitData with IW:org.apache.solr.update.SolrIndexWriter@7aaa4b53
   [junit4]   2> 1771614 INFO  (TEST-TestMaxTokenLenTokenizer.testSingleFieldDiffAnalyzers-seed#[57452151A5C76ECF]) [    ] o.a.s.s.SolrIndexSearcher Opening [Searcher@658db9fc[collection1] main]
   [junit4]   2> 1771615 INFO  (TEST-TestMaxTokenLenTokenizer.testSingleFieldDiffAnalyzers-seed#[57452151A5C76ECF]) [    ] o.a.s.u.DirectUpdateHandler2 end_commit_flush
   [junit4]   2> 1771615 INFO  (searcherExecutor-8347-thread-1) [    ] o.a.s.c.SolrCore [collection1] Registered new searcher Searcher@658db9fc[collection1] main{ExitableDirectoryReader(UninvertingDirectoryReader(Uninverting(_5(6.7.0):c1) Uninverting(_6(6.7.0):c1) Uninverting(_7(6.7.0):c1) Uninverting(_8(6.7.0):c1) Uninverting(_9(6.7.0):c1)))}
   [junit4]   2> 1771615 INFO  (TEST-TestMaxTokenLenTokenizer.testSingleFieldDiffAnalyzers-seed#[57452151A5C76ECF]) [    ] o.a.s.u.p.LogUpdateProcessorFactory [collection1]  webapp=null path=null params={wt=json&indent=true}{add=[5],commit=} 0 2
   [junit4]   2> 1771615 INFO  (TEST-TestMaxTokenLenTokenizer.testSingleFieldDiffAnalyzers-seed#[57452151A5C76ECF]) [    ] o.a.s.u.DirectUpdateHandler2 start commit{,optimize=false,openSearcher=true,waitSearcher=true,expungeDeletes=false,softCommit=false,prepareCommit=false}
   [junit4]   2> 1771615 INFO  (TEST-TestMaxTokenLenTokenizer.testSingleFieldDiffAnalyzers-seed#[57452151A5C76ECF]) [    ] o.a.s.u.DirectUpdateHandler2 No uncommitted changes. Skipping IW.commit.
   [junit4]   2> 1771615 INFO  (TEST-TestMaxTokenLenTokenizer.testSingleFieldDiffAnalyzers-seed#[57452151A5C76ECF]) [    ] o.a.s.u.DirectUpdateHandler2 end_commit_flush
   [junit4]   2> 1771616 INFO  (TEST-TestMaxTokenLenTokenizer.testSingleFieldDiffAnalyzers-seed#[57452151A5C76ECF]) [    ] o.a.s.u.p.LogUpdateProcessorFactory [collection1]  webapp=null path=null params={}{commit=} 0 0
   [junit4]   2> 1771616 INFO  (TEST-TestMaxTokenLenTokenizer.testSingleFieldDiffAnalyzers-seed#[57452151A5C76ECF]) [    ] o.a.s.c.S.Request [collection1]  webapp=null path=null params={q=*:*&wt=xml} hits=5 status=0 QTime=0
   [junit4]   2> 1771617 INFO  (TEST-TestMaxTokenLenTokenizer.testSingleFieldDiffAnalyzers-seed#[57452151A5C76ECF]) [    ] o.a.s.c.S.Request [collection1]  webapp=null path=null params={q=letter:let&wt=xml} hits=1 status=0 QTime=0
   [junit4]   2> 1771617 INFO  (TEST-TestMaxTokenLenTokenizer.testSingleFieldDiffAnalyzers-seed#[57452151A5C76ECF]) [    ] o.a.s.c.S.Request [collection1]  webapp=null path=null params={q=letter:lett&wt=xml} hits=0 status=0 QTime=0
   [junit4]   2> 1771617 INFO  (TEST-TestMaxTokenLenTokenizer.testSingleFieldDiffAnalyzers-seed#[57452151A5C76ECF]) [    ] o.a.s.c.S.Request [collection1]  webapp=null path=null params={q=lowerCase:low&wt=xml} hits=1 status=0 QTime=0
   [junit4]   2> 1771618 INFO  (TEST-TestMaxTokenLenTokenizer.testSingleFieldDiffAnalyzers-seed#[57452151A5C76ECF]) [    ] o.a.s.c.S.Request [collection1]  webapp=null path=null params={q=lowerCase:l&wt=xml} hits=0 status=0 QTime=0
   [junit4]   2> 1771618 INFO  (TEST-TestMaxTokenLenTokenizer.testSingleFieldDiffAnalyzers-seed#[57452151A5C76ECF]) [    ] o.a.s.c.S.Request [collection1]  webapp=null path=null params={q=lowerCase:lo&wt=xml} hits=0 status=0 QTime=0
   [junit4]   2> 1771618 INFO  (TEST-TestMaxTokenLenTokenizer.testSingleFieldDiffAnalyzers-seed#[57452151A5C76ECF]) [    ] o.a.s.c.S.Request [collection1]  webapp=null path=null params={q=lowerCase:lower&wt=xml} hits=0 status=0 QTime=0
   [junit4]   2> 1771619 INFO  (TEST-TestMaxTokenLenTokenizer.testSingleFieldDiffAnalyzers-seed#[57452151A5C76ECF]) [    ] o.a.s.c.S.Request [collection1]  webapp=null path=null params={q=whiteSpace:whi&wt=xml} hits=1 status=0 QTime=0
   [junit4]   2> 1771619 INFO  (TEST-TestMaxTokenLenTokenizer.testSingleFieldDiffAnalyzers-seed#[57452151A5C76ECF]) [    ] o.a.s.c.S.Request [collection1]  webapp=null path=null params={q=whiteSpace:teS&wt=xml} hits=1 status=0 QTime=0
   [junit4]   2> 1771619 INFO  (TEST-TestMaxTokenLenTokenizer.testSingleFieldDiffAnalyzers-seed#[57452151A5C76ECF]) [    ] o.a.s.c.S.Request [collection1]  webapp=null path=null params={q=whiteSpace:in&wt=xml} hits=1 status=0 QTime=0
   [junit4]   2> 1771619 INFO  (TEST-TestMaxTokenLenTokenizer.testSingleFieldDiffAnalyzers-seed#[57452151A5C76ECF]) [    ] o.a.s.c.S.Request [collection1]  webapp=null path=null params={q=whiteSpace:white&wt=xml} hits=0 status=0 QTime=0
   [junit4]   2> 1771620 INFO  (TEST-TestMaxTokenLenTokenizer.testSingleFieldDiffAnalyzers-seed#[57452151A5C76ECF]) [    ] o.a.s.c.S.Request [collection1]  webapp=null path=null params={q=unicodeWhiteSpace:uni&wt=xml} hits=1 status=0 QTime=0
   [junit4]   2> 1771620 INFO  (TEST-TestMaxTokenLenTokenizer.testSingleFieldDiffAnalyzers-seed#[57452151A5C76ECF]) [    ] o.a.s.c.S.Request [collection1]  webapp=null path=null params={q=unicodeWhiteSpace:cod&wt=xml} hits=1 status=0 QTime=0
   [junit4]   2> 1771620 INFO  (TEST-TestMaxTokenLenTokenizer.testSingleFieldDiffAnalyzers-seed#[57452151A5C76ECF]) [    ] o.a.s.c.S.Request [collection1]  webapp=null path=null params={q=unicodeWhiteSpace:e&wt=xml} hits=1 status=0 QTime=0
   [junit4]   2> 1771620 INFO  (TEST-TestMaxTokenLenTokenizer.testSingleFieldDiffAnalyzers-seed#[57452151A5C76ECF]) [    ] o.a.s.c.S.Request [collection1]  webapp=null path=null params={q=unicodeWhiteSpace:unico&wt=xml} hits=0 status=0 QTime=0
   [junit4]   2> 1771621 INFO  (TEST-TestMaxTokenLenTokenizer.testSingleFieldDiffAnalyzers-seed#[57452151A5C76ECF]) [    ] o.a.s.c.S.Request [collection1]  webapp=null path=null params={q=keyword:keyword&wt=xml} hits=1 status=0 QTime=0
   [junit4]   2> 1771621 INFO  (TEST-TestMaxTokenLenTokenizer.testSingleFieldDiffAnalyzers-seed#[57452151A5C76ECF]) [    ] o.a.s.c.S.Request [collection1]  webapp=null path=null params={q=keyword:key&wt=xml} hits=0 status=0 QTime=0
   [junit4]   2> 1771621 INFO  (TEST-TestMaxTokenLenTokenizer.testSingleFieldDiffAnalyzers-seed#[57452151A5C76ECF]) [    ] o.a.s.SolrTestCaseJ4 ###Ending testSingleFieldDiffAnalyzers
   [junit4]   2> 1771621 INFO  (SUITE-TestMaxTokenLenTokenizer-seed#[57452151A5C76ECF]-worker) [    ] o.a.s.SolrTestCaseJ4 ###deleteCore
   [junit4]   2> 1771621 INFO  (SUITE-TestMaxTokenLenTokenizer-seed#[57452151A5C76ECF]-worker) [    ] o.a.s.c.CoreContainer Shutting down CoreContainer instance=1234347634
   [junit4]   2> 1771622 INFO  (SUITE-TestMaxTokenLenTokenizer-seed#[57452151A5C76ECF]-worker) [    ] o.a.s.m.SolrMetricManager Closing metric reporters for: solr.node
   [junit4]   2> 1771622 INFO  (SUITE-TestMaxTokenLenTokenizer-seed#[57452151A5C76ECF]-worker) [    ] o.a.s.m.SolrMetricManager Closing metric reporters for: solr.jvm
   [junit4]   2> 1771623 INFO  (SUITE-TestMaxTokenLenTokenizer-seed#[57452151A5C76ECF]-worker) [    ] o.a.s.m.SolrMetricManager Closing metric reporters for: solr.jetty
   [junit4]   2> 1771624 INFO  (SUITE-TestMaxTokenLenTokenizer-seed#[57452151A5C76ECF]-worker) [    ] o.a.s.c.TransientSolrCoreCacheDefault Allocating transient cache for 2147483647 transient cores
   [junit4]   2> 1771624 INFO  (coreCloseExecutor-8351-thread-1) [    ] o.a.s.c.SolrCore [collection1]  CLOSING SolrCore org.apache.solr.core.SolrCore@1f475c3
   [junit4]   2> 1771624 INFO  (coreCloseExecutor-8351-thread-1) [    ] o.a.s.m.SolrMetricManager Closing metric reporters for: solr.core.collection1
   [junit4]   2> NOTE: leaving temporary files on disk at: /home/jenkins/workspace/Lucene-Solr-6.x-Linux/solr/build/solr-core/test/J0/temp/solr.util.TestMaxTokenLenTokenizer_57452151A5C76ECF-001
   [junit4]   2> NOTE: test params are: codec=Asserting(Lucene62): {lowerCase0=PostingsFormat(name=Memory doPackFST= false), whiteSpace=PostingsFormat(name=LuceneVarGapDocFreqInterval), letter=BlockTreeOrds(blocksize=128), lowerCase=PostingsFormat(name=Memory doPackFST= false), unicodeWhiteSpace=BlockTreeOrds(blocksize=128), letter0=BlockTreeOrds(blocksize=128), unicodeWhiteSpace0=BlockTreeOrds(blocksize=128), keyword0=PostingsFormat(name=Memory doPackFST= false), id=PostingsFormat(name=Memory doPackFST= false), keyword=PostingsFormat(name=Memory doPackFST= false), whiteSpace0=PostingsFormat(name=LuceneVarGapDocFreqInterval)}, docValues:{}, maxPointsInLeafNode=128, maxMBSortInHeap=6.529224967066024, sim=RandomSimilarity(queryNorm=true,coord=crazy): {}, locale=fr-MR, timezone=JST
   [junit4]   2> NOTE: Linux 4.10.0-21-generic amd64/Oracle Corporation 9-ea (64-bit)/cpus=8,threads=1,free=205783912,total=525336576
   [junit4]   2> NOTE: All tests run in this JVM: [BaseCdcrDistributedZkTest, BasicAuthIntegrationTest, TestRandomFaceting, TestFastWriter, SolrSlf4jReporterTest, SparseHLLTest, HdfsSyncSliceTest, TestLocalFSCloudBackupRestore, TestMacros, PathHierarchyTokenizerFactoryTest, TestValueSourceCache, TestStressLucene, TestComplexPhraseLeadingWildcard, TestSchemalessBufferedUpdates, TestReloadAndDeleteDocs, TestLazyCores, OverseerStatusTest, TestSubQueryTransformerCrossCore, TestStressLiveNodes, TestRTimerTree, AlternateDirectoryTest, TestUniqueKeyFieldResource, TestClusterStateMutator, TestAuthenticationFramework, SimpleMLTQParserTest, StandardRequestHandlerTest, TestManagedSchemaThreadSafety, TestXmlQParser, TestCrossCoreJoin, TestReplicationHandler, MissingSegmentRecoveryTest, RegexBoostProcessorTest, TestHttpShardHandlerFactory, HdfsUnloadDistributedZkTest, DeleteNodeTest, TestSolrCloudSnapshots, ZkNodePropsTest, TestSolrQueryResponse, DistributedQueryComponentCustomSortTest, SortSpecParsingTest, SecurityConfHandlerTest, TestManagedResourceStorage, TestDocBasedVersionConstraints, TestSizeLimitedDistributedMap, TestBinaryResponseWriter, TestGeoJSONResponseWriter, LeaderElectionContextKeyTest, LargeFieldTest, UniqFieldsUpdateProcessorFactoryTest, TestCloudRecovery, TestConfigSetsAPI, TestExactSharedStatsCache, TestInfoStreamLogging, ReplicationFactorTest, TolerantUpdateProcessorTest, TestBinaryResponseWriter, UUIDFieldTest, TestCloudNestedDocsSort, AliasIntegrationTest, CollectionsAPIAsyncDistributedZkTest, TestClassNameShortening, TestFieldTypeCollectionResource, TestDocTermOrds, BasicDistributedZkTest, AddBlockUpdateTest, TestFieldCacheSanityChecker, SharedFSAutoReplicaFailoverTest, RequiredFieldsTest, TestIBSimilarityFactory, TestSearcherReuse, TlogReplayBufferedWhileIndexingTest, TestRealTimeGet, FastVectorHighlighterTest, TestSchemaResource, DocumentAnalysisRequestHandlerTest, TestJoin, TestNonDefinedSimilarityFactory, TestAuthorizationFramework, TestPathTrie, TestDynamicFieldResource, TestReRankQParserPlugin, SolrCLIZkUtilsTest, NodeMutatorTest, TestCodecSupport, HighlighterConfigTest, RecoveryAfterSoftCommitTest, TestScoreJoinQPScore, ScriptEngineTest, TestFoldingMultitermQuery, TestFunctionQuery, DocValuesNotIndexedTest, TestBlendedInfixSuggestions, SolrGangliaReporterTest, TestSlowCompositeReaderWrapper, PolyFieldTest, OverseerCollectionConfigSetProcessorTest, TestFieldSortValues, TestInPlaceUpdatesDistrib, TestCustomStream, TestNumericTerms32, DistributedFacetPivotSmallAdvancedTest, CoreAdminCreateDiscoverTest, ExternalFileFieldSortTest, TestPHPSerializedResponseWriter, ReturnFieldsTest, SolrRequestParserTest, InfoHandlerTest, TestSolr4Spatial, TestHashQParserPlugin, TestSha256AuthenticationProvider, ConjunctionSolrSpellCheckerTest, SignatureUpdateProcessorFactoryTest, TestDocumentBuilder, HdfsChaosMonkeySafeLeaderTest, TestSolr4Spatial2, UnloadDistributedZkTest, CollectionsAPIDistributedZkTest, SyncSliceTest, LeaderElectionIntegrationTest, TestRandomDVFaceting, TestDistributedGrouping, TestHashPartitioner, TestStressVersions, TestCoreContainer, SimpleFacetsTest, StatsComponentTest, PeerSyncTest, ShowFileRequestHandlerTest, CurrencyFieldXmlFileTest, SimplePostToolTest, TestCoreDiscovery, TestExtendedDismaxParser, CoreAdminHandlerTest, TestTrie, SpatialFilterTest, TestCSVLoader, SchemaVersionSpecificBehaviorTest, TestPseudoReturnFields, TestUpdate, TestAtomicUpdateErrorCases, TestWordDelimiterFilterFactory, QueryEqualityTest, DirectUpdateHandlerOptimizeTest, DefaultValueUpdateProcessorTest, StatelessScriptUpdateProcessorFactoryTest, CacheHeaderTest, DirectSolrSpellCheckerTest, TestQueryTypes, FileBasedSpellCheckerTest, TestIndexingPerformance, MoreLikeThisHandlerTest, IndexSchemaTest, TestCollationField, UpdateRequestProcessorFactoryTest, MBeansHandlerTest, TestPartialUpdateDeduplication, CSVRequestHandlerTest, TestComponentsName, SearchHandlerTest, SOLR749Test, TestQuerySenderListener, UpdateParamsTest, ResponseLogComponentTest, TestSolrDeletionPolicy2, SampleTest, TestDocSet, NumericFieldsTest, MinimalSchemaTest, TestElisionMultitermQuery, TestConfig, OutputWriterTest, TestSolrCoreProperties, NotRequiredUniqueKeyTest, TestLuceneMatchVersion, SynonymTokenizerTest, TestXIncludeConfig, EchoParamsTest, TestSweetSpotSimilarityFactory, TestPerFieldSimilarity, TestLMDirichletSimilarityFactory, TestBM25SimilarityFactory, TestJmxMonitoredMap, ResourceLoaderTest, TestFastOutputStream, OpenExchangeRatesOrgProviderTest, URLClassifyProcessorTest, TestFastLRUCache, DateMathParserTest, ChaosMonkeyNothingIsSafeTest, CleanupOldIndexTest, CollectionReloadTest, CollectionsAPISolrJTest, DistribCursorPagingTest, HttpPartitionTest, OverseerRolesTest, OverseerTaskQueueTest, SSLMigrationTest, SaslZkACLProviderTest, SimpleCollectionCreateDeleteTest, TestClusterProperties, TestCryptoKeys, TestExclusionRuleCollectionAccess, TestMiniSolrCloudClusterSSL, TestReplicaProperties, TestShortCircuitedRequests, HdfsBasicDistributedZk2Test, HdfsBasicDistributedZkTest, HdfsChaosMonkeyNothingIsSafeTest, HdfsNNFailoverTest, HdfsRecoverLeaseTest, HdfsThreadLeakTest, HdfsTlogReplayBufferedWhileIndexingTest, HdfsWriteToMultipleCollectionsTest, StressHdfsTest, ZkStateWriterTest, RulesTest, TestBackupRepositoryFactory, TestConfigSetProperties, TestConfigSets, TestDynamicLoading, TestReplicationHandlerBackup, TestSolrConfigHandlerConcurrent, DistributedFacetExistsSmallTest, DistributedFacetPivotLongTailTest, DistributedSuggestComponentTest, TestDistributedStatsComponentCardinality, TestAddFieldRealTimeGet, TestCustomSort, TestFilteredDocIdSet, TestMissingGroups, TestPayloadScoreQParserPlugin, TestRecoveryHdfs, TestSolrFieldCacheMBean, TestJsonFacets, TestFieldCacheWithThreads, TestLegacyFieldCache, CdcrUpdateLogTest, DataDrivenBlockJoinTest, PeerSyncWithIndexFingerprintCachingTest, TestExceedMaxTermLength, VersionInfoTest, AtomicUpdateProcessorFactoryTest, AtomicUpdatesTest, ClassificationUpdateProcessorIntegrationTest, ClassificationUpdateProcessorTest, CloneFieldUpdateProcessorFactoryTest, ParsingFieldUpdateProcessorsTest, TemplateUpdateProcessorTest, JsonValidatorTest, TestMaxTokenLenTokenizer]
   [junit4] Completed [706/715 (1!)] on J0 in 0.33s, 2 tests, 1 error <<< FAILURES!

[...truncated 36378 lines...]

Mime
View raw message