lucene-dev mailing list archives

Site index · List index
Message view « Date » · « Thread »
Top « Date » · « Thread »
From Policeman Jenkins Server <jenk...@thetaphi.de>
Subject [JENKINS-EA] Lucene-Solr-6.x-Linux (64bit/jdk-9-ea+171) - Build # 3642 - Still Unstable!
Date Fri, 02 Jun 2017 04:24:58 GMT
Build: https://jenkins.thetaphi.de/job/Lucene-Solr-6.x-Linux/3642/
Java: 64bit/jdk-9-ea+171 -XX:-UseCompressedOops -XX:+UseSerialGC

1 tests failed.
FAILED:  org.apache.solr.util.TestMaxTokenLenTokenizer.testSingleFieldSameAnalyzers

Error Message:
Exception during query

Stack Trace:
java.lang.RuntimeException: Exception during query
	at __randomizedtesting.SeedInfo.seed([C9C07427AC3AB277:A3124B48F4D962B8]:0)
	at org.apache.solr.SolrTestCaseJ4.assertQ(SolrTestCaseJ4.java:895)
	at org.apache.solr.util.TestMaxTokenLenTokenizer.testSingleFieldSameAnalyzers(TestMaxTokenLenTokenizer.java:104)
	at java.base/jdk.internal.reflect.NativeMethodAccessorImpl.invoke0(Native Method)
	at java.base/jdk.internal.reflect.NativeMethodAccessorImpl.invoke(NativeMethodAccessorImpl.java:62)
	at java.base/jdk.internal.reflect.DelegatingMethodAccessorImpl.invoke(DelegatingMethodAccessorImpl.java:43)
	at java.base/java.lang.reflect.Method.invoke(Method.java:563)
	at com.carrotsearch.randomizedtesting.RandomizedRunner.invoke(RandomizedRunner.java:1713)
	at com.carrotsearch.randomizedtesting.RandomizedRunner$8.evaluate(RandomizedRunner.java:907)
	at com.carrotsearch.randomizedtesting.RandomizedRunner$9.evaluate(RandomizedRunner.java:943)
	at com.carrotsearch.randomizedtesting.RandomizedRunner$10.evaluate(RandomizedRunner.java:957)
	at com.carrotsearch.randomizedtesting.rules.SystemPropertiesRestoreRule$1.evaluate(SystemPropertiesRestoreRule.java:57)
	at org.apache.lucene.util.TestRuleSetupTeardownChained$1.evaluate(TestRuleSetupTeardownChained.java:49)
	at org.apache.lucene.util.AbstractBeforeAfterRule$1.evaluate(AbstractBeforeAfterRule.java:45)
	at org.apache.lucene.util.TestRuleThreadAndTestName$1.evaluate(TestRuleThreadAndTestName.java:48)
	at org.apache.lucene.util.TestRuleIgnoreAfterMaxFailures$1.evaluate(TestRuleIgnoreAfterMaxFailures.java:64)
	at org.apache.lucene.util.TestRuleMarkFailure$1.evaluate(TestRuleMarkFailure.java:47)
	at com.carrotsearch.randomizedtesting.rules.StatementAdapter.evaluate(StatementAdapter.java:36)
	at com.carrotsearch.randomizedtesting.ThreadLeakControl$StatementRunner.run(ThreadLeakControl.java:368)
	at com.carrotsearch.randomizedtesting.ThreadLeakControl.forkTimeoutingTask(ThreadLeakControl.java:817)
	at com.carrotsearch.randomizedtesting.ThreadLeakControl$3.evaluate(ThreadLeakControl.java:468)
	at com.carrotsearch.randomizedtesting.RandomizedRunner.runSingleTest(RandomizedRunner.java:916)
	at com.carrotsearch.randomizedtesting.RandomizedRunner$5.evaluate(RandomizedRunner.java:802)
	at com.carrotsearch.randomizedtesting.RandomizedRunner$6.evaluate(RandomizedRunner.java:852)
	at com.carrotsearch.randomizedtesting.RandomizedRunner$7.evaluate(RandomizedRunner.java:863)
	at com.carrotsearch.randomizedtesting.rules.StatementAdapter.evaluate(StatementAdapter.java:36)
	at com.carrotsearch.randomizedtesting.rules.SystemPropertiesRestoreRule$1.evaluate(SystemPropertiesRestoreRule.java:57)
	at org.apache.lucene.util.AbstractBeforeAfterRule$1.evaluate(AbstractBeforeAfterRule.java:45)
	at com.carrotsearch.randomizedtesting.rules.StatementAdapter.evaluate(StatementAdapter.java:36)
	at org.apache.lucene.util.TestRuleStoreClassName$1.evaluate(TestRuleStoreClassName.java:41)
	at com.carrotsearch.randomizedtesting.rules.NoShadowingOrOverridesOnMethodsRule$1.evaluate(NoShadowingOrOverridesOnMethodsRule.java:40)
	at com.carrotsearch.randomizedtesting.rules.NoShadowingOrOverridesOnMethodsRule$1.evaluate(NoShadowingOrOverridesOnMethodsRule.java:40)
	at com.carrotsearch.randomizedtesting.rules.StatementAdapter.evaluate(StatementAdapter.java:36)
	at com.carrotsearch.randomizedtesting.rules.StatementAdapter.evaluate(StatementAdapter.java:36)
	at org.apache.lucene.util.TestRuleAssertionsRequired$1.evaluate(TestRuleAssertionsRequired.java:53)
	at org.apache.lucene.util.TestRuleMarkFailure$1.evaluate(TestRuleMarkFailure.java:47)
	at org.apache.lucene.util.TestRuleIgnoreAfterMaxFailures$1.evaluate(TestRuleIgnoreAfterMaxFailures.java:64)
	at org.apache.lucene.util.TestRuleIgnoreTestSuites$1.evaluate(TestRuleIgnoreTestSuites.java:54)
	at com.carrotsearch.randomizedtesting.rules.StatementAdapter.evaluate(StatementAdapter.java:36)
	at com.carrotsearch.randomizedtesting.ThreadLeakControl$StatementRunner.run(ThreadLeakControl.java:368)
	at java.base/java.lang.Thread.run(Thread.java:844)
Caused by: java.lang.RuntimeException: REQUEST FAILED: xpath=//result[@numFound=1]
	xml response was: <?xml version="1.0" encoding="UTF-8"?>
<response>
<lst name="responseHeader"><int name="status">0</int><int name="QTime">2</int></lst><result
name="response" numFound="0" start="0"></result>
</response>

	request was:q=letter0:lett&wt=xml
	at org.apache.solr.SolrTestCaseJ4.assertQ(SolrTestCaseJ4.java:888)
	... 39 more




Build Log:
[...truncated 11511 lines...]
   [junit4] Suite: org.apache.solr.util.TestMaxTokenLenTokenizer
   [junit4]   2> Creating dataDir: /home/jenkins/workspace/Lucene-Solr-6.x-Linux/solr/build/solr-core/test/J1/temp/solr.util.TestMaxTokenLenTokenizer_C9C07427AC3AB277-001/init-core-data-001
   [junit4]   2> 324796 INFO  (SUITE-TestMaxTokenLenTokenizer-seed#[C9C07427AC3AB277]-worker)
[    ] o.a.s.SolrTestCaseJ4 Using PointFields
   [junit4]   2> 324796 INFO  (SUITE-TestMaxTokenLenTokenizer-seed#[C9C07427AC3AB277]-worker)
[    ] o.a.s.SolrTestCaseJ4 Randomized ssl (false) and clientAuth (true) via: @org.apache.solr.util.RandomizeSSL(reason="",
value=0.0/0.0, ssl=0.0/0.0, clientAuth=0.0/0.0)
   [junit4]   2> 324796 INFO  (SUITE-TestMaxTokenLenTokenizer-seed#[C9C07427AC3AB277]-worker)
[    ] o.a.s.SolrTestCaseJ4 ####initCore
   [junit4]   2> 324797 INFO  (SUITE-TestMaxTokenLenTokenizer-seed#[C9C07427AC3AB277]-worker)
[    ] o.a.s.c.SolrResourceLoader [null] Added 2 libs to classloader, from paths: [/home/jenkins/workspace/Lucene-Solr-6.x-Linux/solr/core/src/test-files/solr/collection1/lib,
/home/jenkins/workspace/Lucene-Solr-6.x-Linux/solr/core/src/test-files/solr/collection1/lib/classes]
   [junit4]   2> 324818 INFO  (SUITE-TestMaxTokenLenTokenizer-seed#[C9C07427AC3AB277]-worker)
[    ] o.a.s.c.SolrConfig Using Lucene MatchVersion: 6.7.0
   [junit4]   2> 324833 INFO  (SUITE-TestMaxTokenLenTokenizer-seed#[C9C07427AC3AB277]-worker)
[    ] o.a.s.s.IndexSchema [null] Schema name=test
   [junit4]   2> 324845 INFO  (SUITE-TestMaxTokenLenTokenizer-seed#[C9C07427AC3AB277]-worker)
[    ] o.a.s.s.IndexSchema Loaded schema test/1.0 with uniqueid field id
   [junit4]   2> 324846 INFO  (SUITE-TestMaxTokenLenTokenizer-seed#[C9C07427AC3AB277]-worker)
[    ] o.a.s.u.UpdateShardHandler Creating UpdateShardHandler HTTP client with params: socketTimeout=30000&connTimeout=30000&retry=true
   [junit4]   2> 324860 INFO  (SUITE-TestMaxTokenLenTokenizer-seed#[C9C07427AC3AB277]-worker)
[    ] o.a.s.m.r.SolrJmxReporter JMX monitoring for 'solr.node' (registry 'solr.node') enabled
at server: com.sun.jmx.mbeanserver.JmxMBeanServer@17546337
   [junit4]   2> 324862 INFO  (SUITE-TestMaxTokenLenTokenizer-seed#[C9C07427AC3AB277]-worker)
[    ] o.a.s.m.r.SolrJmxReporter JMX monitoring for 'solr.jvm' (registry 'solr.jvm') enabled
at server: com.sun.jmx.mbeanserver.JmxMBeanServer@17546337
   [junit4]   2> 324862 INFO  (SUITE-TestMaxTokenLenTokenizer-seed#[C9C07427AC3AB277]-worker)
[    ] o.a.s.m.r.SolrJmxReporter JMX monitoring for 'solr.jetty' (registry 'solr.jetty') enabled
at server: com.sun.jmx.mbeanserver.JmxMBeanServer@17546337
   [junit4]   2> 324863 INFO  (coreLoadExecutor-1897-thread-1) [    ] o.a.s.c.SolrResourceLoader
[null] Added 2 libs to classloader, from paths: [/home/jenkins/workspace/Lucene-Solr-6.x-Linux/solr/core/src/test-files/solr/collection1/lib,
/home/jenkins/workspace/Lucene-Solr-6.x-Linux/solr/core/src/test-files/solr/collection1/lib/classes]
   [junit4]   2> 324879 INFO  (coreLoadExecutor-1897-thread-1) [    ] o.a.s.c.SolrConfig
Using Lucene MatchVersion: 6.7.0
   [junit4]   2> 324894 INFO  (coreLoadExecutor-1897-thread-1) [    ] o.a.s.s.IndexSchema
[collection1] Schema name=test
   [junit4]   2> 324906 INFO  (coreLoadExecutor-1897-thread-1) [    ] o.a.s.s.IndexSchema
Loaded schema test/1.0 with uniqueid field id
   [junit4]   2> 324906 INFO  (coreLoadExecutor-1897-thread-1) [    ] o.a.s.c.CoreContainer
Creating SolrCore 'collection1' using configuration from instancedir /home/jenkins/workspace/Lucene-Solr-6.x-Linux/solr/core/src/test-files/solr/collection1,
trusted=true
   [junit4]   2> 324907 INFO  (coreLoadExecutor-1897-thread-1) [    ] o.a.s.m.r.SolrJmxReporter
JMX monitoring for 'solr.core.collection1' (registry 'solr.core.collection1') enabled at server:
com.sun.jmx.mbeanserver.JmxMBeanServer@17546337
   [junit4]   2> 324907 INFO  (coreLoadExecutor-1897-thread-1) [    ] o.a.s.c.SolrCore
solr.RecoveryStrategy.Builder
   [junit4]   2> 324907 INFO  (coreLoadExecutor-1897-thread-1) [    ] o.a.s.c.SolrCore
[[collection1] ] Opening new SolrCore at [/home/jenkins/workspace/Lucene-Solr-6.x-Linux/solr/core/src/test-files/solr/collection1],
dataDir=[/home/jenkins/workspace/Lucene-Solr-6.x-Linux/solr/build/solr-core/test/J1/temp/solr.util.TestMaxTokenLenTokenizer_C9C07427AC3AB277-001/init-core-data-001/]
   [junit4]   2> 324908 INFO  (coreLoadExecutor-1897-thread-1) [    ] o.a.s.u.RandomMergePolicy
RandomMergePolicy wrapping class org.apache.lucene.index.TieredMergePolicy: [TieredMergePolicy:
maxMergeAtOnce=23, maxMergeAtOnceExplicit=27, maxMergedSegmentMB=25.669921875, floorSegmentMB=0.6474609375,
forceMergeDeletesPctAllowed=12.302540068684038, segmentsPerTier=10.0, maxCFSSegmentSizeMB=8.796093022207999E12,
noCFSRatio=1.0
   [junit4]   2> 324927 INFO  (coreLoadExecutor-1897-thread-1) [    ] o.a.s.u.CommitTracker
Hard AutoCommit: disabled
   [junit4]   2> 324927 INFO  (coreLoadExecutor-1897-thread-1) [    ] o.a.s.u.CommitTracker
Soft AutoCommit: disabled
   [junit4]   2> 324928 INFO  (coreLoadExecutor-1897-thread-1) [    ] o.a.s.u.RandomMergePolicy
RandomMergePolicy wrapping class org.apache.lucene.index.LogByteSizeMergePolicy: [LogByteSizeMergePolicy:
minMergeSize=1677721, mergeFactor=39, maxMergeSize=2147483648, maxMergeSizeForForcedMerge=9223372036854775807,
calibrateSizeByDeletes=false, maxMergeDocs=2147483647, maxCFSSegmentSizeMB=8.796093022207999E12,
noCFSRatio=0.0]
   [junit4]   2> 324928 INFO  (coreLoadExecutor-1897-thread-1) [    ] o.a.s.s.SolrIndexSearcher
Opening [Searcher@40cec234[collection1] main]
   [junit4]   2> 324928 WARN  (coreLoadExecutor-1897-thread-1) [    ] o.a.s.r.ManagedResourceStorage
Cannot write to config directory /home/jenkins/workspace/Lucene-Solr-6.x-Linux/solr/core/src/test-files/solr/collection1/conf;
switching to use InMemory storage instead.
   [junit4]   2> 324928 INFO  (coreLoadExecutor-1897-thread-1) [    ] o.a.s.h.ReplicationHandler
Commits will be reserved for  10000
   [junit4]   2> 324929 INFO  (searcherExecutor-1898-thread-1) [    ] o.a.s.c.SolrCore
[collection1] Registered new searcher Searcher@40cec234[collection1] main{ExitableDirectoryReader(UninvertingDirectoryReader())}
   [junit4]   2> 324929 INFO  (SUITE-TestMaxTokenLenTokenizer-seed#[C9C07427AC3AB277]-worker)
[    ] o.a.s.SolrTestCaseJ4 ####initCore end
   [junit4]   2> 324930 INFO  (TEST-TestMaxTokenLenTokenizer.testSingleFieldDiffAnalyzers-seed#[C9C07427AC3AB277])
[    ] o.a.s.SolrTestCaseJ4 ###Starting testSingleFieldDiffAnalyzers
   [junit4]   2> 324931 INFO  (TEST-TestMaxTokenLenTokenizer.testSingleFieldDiffAnalyzers-seed#[C9C07427AC3AB277])
[    ] o.a.s.u.DirectUpdateHandler2 [collection1] REMOVING ALL DOCUMENTS FROM INDEX
   [junit4]   2> 324931 INFO  (TEST-TestMaxTokenLenTokenizer.testSingleFieldDiffAnalyzers-seed#[C9C07427AC3AB277])
[    ] o.a.s.u.p.LogUpdateProcessorFactory [collection1]  webapp=null path=null params={_version_=-9223372036854775807&update.distrib=FROMLEADER&versions=true&wt=json&indent=true}{deleteByQuery=*:*}
0 0
   [junit4]   2> 324932 INFO  (TEST-TestMaxTokenLenTokenizer.testSingleFieldDiffAnalyzers-seed#[C9C07427AC3AB277])
[    ] o.a.s.u.DirectUpdateHandler2 start commit{,optimize=false,openSearcher=true,waitSearcher=true,expungeDeletes=false,softCommit=false,prepareCommit=false}
   [junit4]   2> 324932 INFO  (TEST-TestMaxTokenLenTokenizer.testSingleFieldDiffAnalyzers-seed#[C9C07427AC3AB277])
[    ] o.a.s.u.SolrIndexWriter Calling setCommitData with IW:org.apache.solr.update.SolrIndexWriter@76ac2db6
   [junit4]   2> 324933 INFO  (TEST-TestMaxTokenLenTokenizer.testSingleFieldDiffAnalyzers-seed#[C9C07427AC3AB277])
[    ] o.a.s.s.SolrIndexSearcher Opening [Searcher@7766922d[collection1] main]
   [junit4]   2> 324933 INFO  (TEST-TestMaxTokenLenTokenizer.testSingleFieldDiffAnalyzers-seed#[C9C07427AC3AB277])
[    ] o.a.s.u.DirectUpdateHandler2 end_commit_flush
   [junit4]   2> 324933 INFO  (searcherExecutor-1898-thread-1) [    ] o.a.s.c.SolrCore
[collection1] Registered new searcher Searcher@7766922d[collection1] main{ExitableDirectoryReader(UninvertingDirectoryReader(Uninverting(_0(6.7.0):C1)))}
   [junit4]   2> 324933 INFO  (TEST-TestMaxTokenLenTokenizer.testSingleFieldDiffAnalyzers-seed#[C9C07427AC3AB277])
[    ] o.a.s.u.p.LogUpdateProcessorFactory [collection1]  webapp=null path=null params={wt=json&indent=true}{add=[1],commit=}
0 2
   [junit4]   2> 324933 INFO  (TEST-TestMaxTokenLenTokenizer.testSingleFieldDiffAnalyzers-seed#[C9C07427AC3AB277])
[    ] o.a.s.u.DirectUpdateHandler2 start commit{,optimize=false,openSearcher=true,waitSearcher=true,expungeDeletes=false,softCommit=false,prepareCommit=false}
   [junit4]   2> 324933 INFO  (TEST-TestMaxTokenLenTokenizer.testSingleFieldDiffAnalyzers-seed#[C9C07427AC3AB277])
[    ] o.a.s.u.SolrIndexWriter Calling setCommitData with IW:org.apache.solr.update.SolrIndexWriter@76ac2db6
   [junit4]   2> 324934 INFO  (TEST-TestMaxTokenLenTokenizer.testSingleFieldDiffAnalyzers-seed#[C9C07427AC3AB277])
[    ] o.a.s.s.SolrIndexSearcher Opening [Searcher@6ee20383[collection1] main]
   [junit4]   2> 324934 INFO  (TEST-TestMaxTokenLenTokenizer.testSingleFieldDiffAnalyzers-seed#[C9C07427AC3AB277])
[    ] o.a.s.u.DirectUpdateHandler2 end_commit_flush
   [junit4]   2> 324934 INFO  (searcherExecutor-1898-thread-1) [    ] o.a.s.c.SolrCore
[collection1] Registered new searcher Searcher@6ee20383[collection1] main{ExitableDirectoryReader(UninvertingDirectoryReader(Uninverting(_0(6.7.0):C1)
Uninverting(_1(6.7.0):C1)))}
   [junit4]   2> 324934 INFO  (TEST-TestMaxTokenLenTokenizer.testSingleFieldDiffAnalyzers-seed#[C9C07427AC3AB277])
[    ] o.a.s.u.p.LogUpdateProcessorFactory [collection1]  webapp=null path=null params={wt=json&indent=true}{add=[2],commit=}
0 1
   [junit4]   2> 324934 INFO  (TEST-TestMaxTokenLenTokenizer.testSingleFieldDiffAnalyzers-seed#[C9C07427AC3AB277])
[    ] o.a.s.u.DirectUpdateHandler2 start commit{,optimize=false,openSearcher=true,waitSearcher=true,expungeDeletes=false,softCommit=false,prepareCommit=false}
   [junit4]   2> 324934 INFO  (TEST-TestMaxTokenLenTokenizer.testSingleFieldDiffAnalyzers-seed#[C9C07427AC3AB277])
[    ] o.a.s.u.SolrIndexWriter Calling setCommitData with IW:org.apache.solr.update.SolrIndexWriter@76ac2db6
   [junit4]   2> 324935 INFO  (TEST-TestMaxTokenLenTokenizer.testSingleFieldDiffAnalyzers-seed#[C9C07427AC3AB277])
[    ] o.a.s.s.SolrIndexSearcher Opening [Searcher@197648e4[collection1] main]
   [junit4]   2> 324935 INFO  (TEST-TestMaxTokenLenTokenizer.testSingleFieldDiffAnalyzers-seed#[C9C07427AC3AB277])
[    ] o.a.s.u.DirectUpdateHandler2 end_commit_flush
   [junit4]   2> 324935 INFO  (searcherExecutor-1898-thread-1) [    ] o.a.s.c.SolrCore
[collection1] Registered new searcher Searcher@197648e4[collection1] main{ExitableDirectoryReader(UninvertingDirectoryReader(Uninverting(_0(6.7.0):C1)
Uninverting(_1(6.7.0):C1) Uninverting(_2(6.7.0):C1)))}
   [junit4]   2> 324935 INFO  (TEST-TestMaxTokenLenTokenizer.testSingleFieldDiffAnalyzers-seed#[C9C07427AC3AB277])
[    ] o.a.s.u.p.LogUpdateProcessorFactory [collection1]  webapp=null path=null params={wt=json&indent=true}{add=[3],commit=}
0 1
   [junit4]   2> 324936 INFO  (TEST-TestMaxTokenLenTokenizer.testSingleFieldDiffAnalyzers-seed#[C9C07427AC3AB277])
[    ] o.a.s.u.DirectUpdateHandler2 start commit{,optimize=false,openSearcher=true,waitSearcher=true,expungeDeletes=false,softCommit=false,prepareCommit=false}
   [junit4]   2> 324936 INFO  (TEST-TestMaxTokenLenTokenizer.testSingleFieldDiffAnalyzers-seed#[C9C07427AC3AB277])
[    ] o.a.s.u.SolrIndexWriter Calling setCommitData with IW:org.apache.solr.update.SolrIndexWriter@76ac2db6
   [junit4]   2> 324936 INFO  (TEST-TestMaxTokenLenTokenizer.testSingleFieldDiffAnalyzers-seed#[C9C07427AC3AB277])
[    ] o.a.s.s.SolrIndexSearcher Opening [Searcher@58a25620[collection1] main]
   [junit4]   2> 324937 INFO  (TEST-TestMaxTokenLenTokenizer.testSingleFieldDiffAnalyzers-seed#[C9C07427AC3AB277])
[    ] o.a.s.u.DirectUpdateHandler2 end_commit_flush
   [junit4]   2> 324937 INFO  (searcherExecutor-1898-thread-1) [    ] o.a.s.c.SolrCore
[collection1] Registered new searcher Searcher@58a25620[collection1] main{ExitableDirectoryReader(UninvertingDirectoryReader(Uninverting(_0(6.7.0):C1)
Uninverting(_1(6.7.0):C1) Uninverting(_2(6.7.0):C1) Uninverting(_3(6.7.0):C1)))}
   [junit4]   2> 324937 INFO  (TEST-TestMaxTokenLenTokenizer.testSingleFieldDiffAnalyzers-seed#[C9C07427AC3AB277])
[    ] o.a.s.u.p.LogUpdateProcessorFactory [collection1]  webapp=null path=null params={wt=json&indent=true}{add=[4],commit=}
0 1
   [junit4]   2> 324937 INFO  (TEST-TestMaxTokenLenTokenizer.testSingleFieldDiffAnalyzers-seed#[C9C07427AC3AB277])
[    ] o.a.s.u.DirectUpdateHandler2 start commit{,optimize=false,openSearcher=true,waitSearcher=true,expungeDeletes=false,softCommit=false,prepareCommit=false}
   [junit4]   2> 324937 INFO  (TEST-TestMaxTokenLenTokenizer.testSingleFieldDiffAnalyzers-seed#[C9C07427AC3AB277])
[    ] o.a.s.u.SolrIndexWriter Calling setCommitData with IW:org.apache.solr.update.SolrIndexWriter@76ac2db6
   [junit4]   2> 324938 INFO  (TEST-TestMaxTokenLenTokenizer.testSingleFieldDiffAnalyzers-seed#[C9C07427AC3AB277])
[    ] o.a.s.s.SolrIndexSearcher Opening [Searcher@41812e5c[collection1] main]
   [junit4]   2> 324938 INFO  (TEST-TestMaxTokenLenTokenizer.testSingleFieldDiffAnalyzers-seed#[C9C07427AC3AB277])
[    ] o.a.s.u.DirectUpdateHandler2 end_commit_flush
   [junit4]   2> 324938 INFO  (searcherExecutor-1898-thread-1) [    ] o.a.s.c.SolrCore
[collection1] Registered new searcher Searcher@41812e5c[collection1] main{ExitableDirectoryReader(UninvertingDirectoryReader(Uninverting(_0(6.7.0):C1)
Uninverting(_1(6.7.0):C1) Uninverting(_2(6.7.0):C1) Uninverting(_3(6.7.0):C1) Uninverting(_4(6.7.0):C1)))}
   [junit4]   2> 324938 INFO  (TEST-TestMaxTokenLenTokenizer.testSingleFieldDiffAnalyzers-seed#[C9C07427AC3AB277])
[    ] o.a.s.u.p.LogUpdateProcessorFactory [collection1]  webapp=null path=null params={wt=json&indent=true}{add=[5],commit=}
0 1
   [junit4]   2> 324938 INFO  (TEST-TestMaxTokenLenTokenizer.testSingleFieldDiffAnalyzers-seed#[C9C07427AC3AB277])
[    ] o.a.s.u.DirectUpdateHandler2 start commit{,optimize=false,openSearcher=true,waitSearcher=true,expungeDeletes=false,softCommit=false,prepareCommit=false}
   [junit4]   2> 324938 INFO  (TEST-TestMaxTokenLenTokenizer.testSingleFieldDiffAnalyzers-seed#[C9C07427AC3AB277])
[    ] o.a.s.u.DirectUpdateHandler2 No uncommitted changes. Skipping IW.commit.
   [junit4]   2> 324938 INFO  (TEST-TestMaxTokenLenTokenizer.testSingleFieldDiffAnalyzers-seed#[C9C07427AC3AB277])
[    ] o.a.s.u.DirectUpdateHandler2 end_commit_flush
   [junit4]   2> 324938 INFO  (TEST-TestMaxTokenLenTokenizer.testSingleFieldDiffAnalyzers-seed#[C9C07427AC3AB277])
[    ] o.a.s.u.p.LogUpdateProcessorFactory [collection1]  webapp=null path=null params={}{commit=}
0 0
   [junit4]   2> 324939 INFO  (TEST-TestMaxTokenLenTokenizer.testSingleFieldDiffAnalyzers-seed#[C9C07427AC3AB277])
[    ] o.a.s.c.S.Request [collection1]  webapp=null path=null params={q=*:*&wt=xml} hits=5
status=0 QTime=0
   [junit4]   2> 324940 INFO  (TEST-TestMaxTokenLenTokenizer.testSingleFieldDiffAnalyzers-seed#[C9C07427AC3AB277])
[    ] o.a.s.c.S.Request [collection1]  webapp=null path=null params={q=letter:let&wt=xml}
hits=1 status=0 QTime=0
   [junit4]   2> 324940 INFO  (TEST-TestMaxTokenLenTokenizer.testSingleFieldDiffAnalyzers-seed#[C9C07427AC3AB277])
[    ] o.a.s.c.S.Request [collection1]  webapp=null path=null params={q=letter:lett&wt=xml}
hits=0 status=0 QTime=0
   [junit4]   2> 324940 INFO  (TEST-TestMaxTokenLenTokenizer.testSingleFieldDiffAnalyzers-seed#[C9C07427AC3AB277])
[    ] o.a.s.c.S.Request [collection1]  webapp=null path=null params={q=lowerCase:low&wt=xml}
hits=1 status=0 QTime=0
   [junit4]   2> 324941 INFO  (TEST-TestMaxTokenLenTokenizer.testSingleFieldDiffAnalyzers-seed#[C9C07427AC3AB277])
[    ] o.a.s.c.S.Request [collection1]  webapp=null path=null params={q=lowerCase:l&wt=xml}
hits=0 status=0 QTime=0
   [junit4]   2> 324941 INFO  (TEST-TestMaxTokenLenTokenizer.testSingleFieldDiffAnalyzers-seed#[C9C07427AC3AB277])
[    ] o.a.s.c.S.Request [collection1]  webapp=null path=null params={q=lowerCase:lo&wt=xml}
hits=0 status=0 QTime=0
   [junit4]   2> 324941 INFO  (TEST-TestMaxTokenLenTokenizer.testSingleFieldDiffAnalyzers-seed#[C9C07427AC3AB277])
[    ] o.a.s.c.S.Request [collection1]  webapp=null path=null params={q=lowerCase:lower&wt=xml}
hits=0 status=0 QTime=0
   [junit4]   2> 324941 INFO  (TEST-TestMaxTokenLenTokenizer.testSingleFieldDiffAnalyzers-seed#[C9C07427AC3AB277])
[    ] o.a.s.c.S.Request [collection1]  webapp=null path=null params={q=whiteSpace:whi&wt=xml}
hits=1 status=0 QTime=0
   [junit4]   2> 324941 INFO  (TEST-TestMaxTokenLenTokenizer.testSingleFieldDiffAnalyzers-seed#[C9C07427AC3AB277])
[    ] o.a.s.c.S.Request [collection1]  webapp=null path=null params={q=whiteSpace:teS&wt=xml}
hits=1 status=0 QTime=0
   [junit4]   2> 324941 INFO  (TEST-TestMaxTokenLenTokenizer.testSingleFieldDiffAnalyzers-seed#[C9C07427AC3AB277])
[    ] o.a.s.c.S.Request [collection1]  webapp=null path=null params={q=whiteSpace:in&wt=xml}
hits=1 status=0 QTime=0
   [junit4]   2> 324942 INFO  (TEST-TestMaxTokenLenTokenizer.testSingleFieldDiffAnalyzers-seed#[C9C07427AC3AB277])
[    ] o.a.s.c.S.Request [collection1]  webapp=null path=null params={q=whiteSpace:white&wt=xml}
hits=0 status=0 QTime=0
   [junit4]   2> 324942 INFO  (TEST-TestMaxTokenLenTokenizer.testSingleFieldDiffAnalyzers-seed#[C9C07427AC3AB277])
[    ] o.a.s.c.S.Request [collection1]  webapp=null path=null params={q=unicodeWhiteSpace:uni&wt=xml}
hits=1 status=0 QTime=0
   [junit4]   2> 324942 INFO  (TEST-TestMaxTokenLenTokenizer.testSingleFieldDiffAnalyzers-seed#[C9C07427AC3AB277])
[    ] o.a.s.c.S.Request [collection1]  webapp=null path=null params={q=unicodeWhiteSpace:cod&wt=xml}
hits=1 status=0 QTime=0
   [junit4]   2> 324942 INFO  (TEST-TestMaxTokenLenTokenizer.testSingleFieldDiffAnalyzers-seed#[C9C07427AC3AB277])
[    ] o.a.s.c.S.Request [collection1]  webapp=null path=null params={q=unicodeWhiteSpace:e&wt=xml}
hits=1 status=0 QTime=0
   [junit4]   2> 324942 INFO  (TEST-TestMaxTokenLenTokenizer.testSingleFieldDiffAnalyzers-seed#[C9C07427AC3AB277])
[    ] o.a.s.c.S.Request [collection1]  webapp=null path=null params={q=unicodeWhiteSpace:unico&wt=xml}
hits=0 status=0 QTime=0
   [junit4]   2> 324942 INFO  (TEST-TestMaxTokenLenTokenizer.testSingleFieldDiffAnalyzers-seed#[C9C07427AC3AB277])
[    ] o.a.s.c.S.Request [collection1]  webapp=null path=null params={q=keyword:keyword&wt=xml}
hits=1 status=0 QTime=0
   [junit4]   2> 324943 INFO  (TEST-TestMaxTokenLenTokenizer.testSingleFieldDiffAnalyzers-seed#[C9C07427AC3AB277])
[    ] o.a.s.c.S.Request [collection1]  webapp=null path=null params={q=keyword:key&wt=xml}
hits=0 status=0 QTime=0
   [junit4]   2> 324943 INFO  (TEST-TestMaxTokenLenTokenizer.testSingleFieldDiffAnalyzers-seed#[C9C07427AC3AB277])
[    ] o.a.s.SolrTestCaseJ4 ###Ending testSingleFieldDiffAnalyzers
   [junit4]   2> 324944 INFO  (TEST-TestMaxTokenLenTokenizer.testSingleFieldSameAnalyzers-seed#[C9C07427AC3AB277])
[    ] o.a.s.SolrTestCaseJ4 ###Starting testSingleFieldSameAnalyzers
   [junit4]   2> 324944 INFO  (TEST-TestMaxTokenLenTokenizer.testSingleFieldSameAnalyzers-seed#[C9C07427AC3AB277])
[    ] o.a.s.u.DirectUpdateHandler2 [collection1] REMOVING ALL DOCUMENTS FROM INDEX
   [junit4]   2> 324944 INFO  (TEST-TestMaxTokenLenTokenizer.testSingleFieldSameAnalyzers-seed#[C9C07427AC3AB277])
[    ] o.a.s.u.p.LogUpdateProcessorFactory [collection1]  webapp=null path=null params={_version_=-9223372036854775807&update.distrib=FROMLEADER&versions=true&wt=json&indent=true}{deleteByQuery=*:*}
0 0
   [junit4]   2> 324944 INFO  (TEST-TestMaxTokenLenTokenizer.testSingleFieldSameAnalyzers-seed#[C9C07427AC3AB277])
[    ] o.a.s.u.DirectUpdateHandler2 start commit{,optimize=false,openSearcher=true,waitSearcher=true,expungeDeletes=false,softCommit=false,prepareCommit=false}
   [junit4]   2> 324944 INFO  (TEST-TestMaxTokenLenTokenizer.testSingleFieldSameAnalyzers-seed#[C9C07427AC3AB277])
[    ] o.a.s.u.SolrIndexWriter Calling setCommitData with IW:org.apache.solr.update.SolrIndexWriter@76ac2db6
   [junit4]   2> 324945 INFO  (TEST-TestMaxTokenLenTokenizer.testSingleFieldSameAnalyzers-seed#[C9C07427AC3AB277])
[    ] o.a.s.s.SolrIndexSearcher Opening [Searcher@5e24ee11[collection1] main]
   [junit4]   2> 324945 INFO  (TEST-TestMaxTokenLenTokenizer.testSingleFieldSameAnalyzers-seed#[C9C07427AC3AB277])
[    ] o.a.s.u.DirectUpdateHandler2 end_commit_flush
   [junit4]   2> 324945 INFO  (searcherExecutor-1898-thread-1) [    ] o.a.s.c.SolrCore
[collection1] Registered new searcher Searcher@5e24ee11[collection1] main{ExitableDirectoryReader(UninvertingDirectoryReader(Uninverting(_5(6.7.0):C1)))}
   [junit4]   2> 324946 INFO  (TEST-TestMaxTokenLenTokenizer.testSingleFieldSameAnalyzers-seed#[C9C07427AC3AB277])
[    ] o.a.s.u.p.LogUpdateProcessorFactory [collection1]  webapp=null path=null params={wt=json&indent=true}{add=[1],commit=}
0 1
   [junit4]   2> 324946 INFO  (TEST-TestMaxTokenLenTokenizer.testSingleFieldSameAnalyzers-seed#[C9C07427AC3AB277])
[    ] o.a.s.u.DirectUpdateHandler2 start commit{,optimize=false,openSearcher=true,waitSearcher=true,expungeDeletes=false,softCommit=false,prepareCommit=false}
   [junit4]   2> 324946 INFO  (TEST-TestMaxTokenLenTokenizer.testSingleFieldSameAnalyzers-seed#[C9C07427AC3AB277])
[    ] o.a.s.u.SolrIndexWriter Calling setCommitData with IW:org.apache.solr.update.SolrIndexWriter@76ac2db6
   [junit4]   2> 324947 INFO  (TEST-TestMaxTokenLenTokenizer.testSingleFieldSameAnalyzers-seed#[C9C07427AC3AB277])
[    ] o.a.s.s.SolrIndexSearcher Opening [Searcher@203cdf07[collection1] main]
   [junit4]   2> 324947 INFO  (TEST-TestMaxTokenLenTokenizer.testSingleFieldSameAnalyzers-seed#[C9C07427AC3AB277])
[    ] o.a.s.u.DirectUpdateHandler2 end_commit_flush
   [junit4]   2> 324947 INFO  (searcherExecutor-1898-thread-1) [    ] o.a.s.c.SolrCore
[collection1] Registered new searcher Searcher@203cdf07[collection1] main{ExitableDirectoryReader(UninvertingDirectoryReader(Uninverting(_5(6.7.0):C1)
Uninverting(_6(6.7.0):C1)))}
   [junit4]   2> 324947 INFO  (TEST-TestMaxTokenLenTokenizer.testSingleFieldSameAnalyzers-seed#[C9C07427AC3AB277])
[    ] o.a.s.u.p.LogUpdateProcessorFactory [collection1]  webapp=null path=null params={wt=json&indent=true}{add=[2],commit=}
0 1
   [junit4]   2> 324948 INFO  (TEST-TestMaxTokenLenTokenizer.testSingleFieldSameAnalyzers-seed#[C9C07427AC3AB277])
[    ] o.a.s.u.DirectUpdateHandler2 start commit{,optimize=false,openSearcher=true,waitSearcher=true,expungeDeletes=false,softCommit=false,prepareCommit=false}
   [junit4]   2> 324948 INFO  (TEST-TestMaxTokenLenTokenizer.testSingleFieldSameAnalyzers-seed#[C9C07427AC3AB277])
[    ] o.a.s.u.SolrIndexWriter Calling setCommitData with IW:org.apache.solr.update.SolrIndexWriter@76ac2db6
   [junit4]   2> 324948 INFO  (TEST-TestMaxTokenLenTokenizer.testSingleFieldSameAnalyzers-seed#[C9C07427AC3AB277])
[    ] o.a.s.s.SolrIndexSearcher Opening [Searcher@12793d54[collection1] main]
   [junit4]   2> 324949 INFO  (TEST-TestMaxTokenLenTokenizer.testSingleFieldSameAnalyzers-seed#[C9C07427AC3AB277])
[    ] o.a.s.u.DirectUpdateHandler2 end_commit_flush
   [junit4]   2> 324949 INFO  (searcherExecutor-1898-thread-1) [    ] o.a.s.c.SolrCore
[collection1] Registered new searcher Searcher@12793d54[collection1] main{ExitableDirectoryReader(UninvertingDirectoryReader(Uninverting(_5(6.7.0):C1)
Uninverting(_6(6.7.0):C1) Uninverting(_7(6.7.0):C1)))}
   [junit4]   2> 324949 INFO  (TEST-TestMaxTokenLenTokenizer.testSingleFieldSameAnalyzers-seed#[C9C07427AC3AB277])
[    ] o.a.s.u.p.LogUpdateProcessorFactory [collection1]  webapp=null path=null params={wt=json&indent=true}{add=[3],commit=}
0 1
   [junit4]   2> 324949 INFO  (TEST-TestMaxTokenLenTokenizer.testSingleFieldSameAnalyzers-seed#[C9C07427AC3AB277])
[    ] o.a.s.u.DirectUpdateHandler2 start commit{,optimize=false,openSearcher=true,waitSearcher=true,expungeDeletes=false,softCommit=false,prepareCommit=false}
   [junit4]   2> 324949 INFO  (TEST-TestMaxTokenLenTokenizer.testSingleFieldSameAnalyzers-seed#[C9C07427AC3AB277])
[    ] o.a.s.u.SolrIndexWriter Calling setCommitData with IW:org.apache.solr.update.SolrIndexWriter@76ac2db6
   [junit4]   2> 324950 INFO  (TEST-TestMaxTokenLenTokenizer.testSingleFieldSameAnalyzers-seed#[C9C07427AC3AB277])
[    ] o.a.s.s.SolrIndexSearcher Opening [Searcher@31240223[collection1] main]
   [junit4]   2> 324950 INFO  (TEST-TestMaxTokenLenTokenizer.testSingleFieldSameAnalyzers-seed#[C9C07427AC3AB277])
[    ] o.a.s.u.DirectUpdateHandler2 end_commit_flush
   [junit4]   2> 324950 INFO  (searcherExecutor-1898-thread-1) [    ] o.a.s.c.SolrCore
[collection1] Registered new searcher Searcher@31240223[collection1] main{ExitableDirectoryReader(UninvertingDirectoryReader(Uninverting(_5(6.7.0):C1)
Uninverting(_6(6.7.0):C1) Uninverting(_7(6.7.0):C1) Uninverting(_8(6.7.0):C1)))}
   [junit4]   2> 324950 INFO  (TEST-TestMaxTokenLenTokenizer.testSingleFieldSameAnalyzers-seed#[C9C07427AC3AB277])
[    ] o.a.s.u.p.LogUpdateProcessorFactory [collection1]  webapp=null path=null params={wt=json&indent=true}{add=[4],commit=}
0 1
   [junit4]   2> 324950 INFO  (TEST-TestMaxTokenLenTokenizer.testSingleFieldSameAnalyzers-seed#[C9C07427AC3AB277])
[    ] o.a.s.u.DirectUpdateHandler2 start commit{,optimize=false,openSearcher=true,waitSearcher=true,expungeDeletes=false,softCommit=false,prepareCommit=false}
   [junit4]   2> 324951 INFO  (TEST-TestMaxTokenLenTokenizer.testSingleFieldSameAnalyzers-seed#[C9C07427AC3AB277])
[    ] o.a.s.u.SolrIndexWriter Calling setCommitData with IW:org.apache.solr.update.SolrIndexWriter@76ac2db6
   [junit4]   2> 324951 INFO  (TEST-TestMaxTokenLenTokenizer.testSingleFieldSameAnalyzers-seed#[C9C07427AC3AB277])
[    ] o.a.s.s.SolrIndexSearcher Opening [Searcher@5c3a269a[collection1] main]
   [junit4]   2> 324952 INFO  (TEST-TestMaxTokenLenTokenizer.testSingleFieldSameAnalyzers-seed#[C9C07427AC3AB277])
[    ] o.a.s.u.DirectUpdateHandler2 end_commit_flush
   [junit4]   2> 324952 INFO  (searcherExecutor-1898-thread-1) [    ] o.a.s.c.SolrCore
[collection1] Registered new searcher Searcher@5c3a269a[collection1] main{ExitableDirectoryReader(UninvertingDirectoryReader(Uninverting(_5(6.7.0):C1)
Uninverting(_6(6.7.0):C1) Uninverting(_7(6.7.0):C1) Uninverting(_8(6.7.0):C1) Uninverting(_9(6.7.0):C1)))}
   [junit4]   2> 324952 INFO  (TEST-TestMaxTokenLenTokenizer.testSingleFieldSameAnalyzers-seed#[C9C07427AC3AB277])
[    ] o.a.s.u.p.LogUpdateProcessorFactory [collection1]  webapp=null path=null params={wt=json&indent=true}{add=[5],commit=}
0 1
   [junit4]   2> 324952 INFO  (TEST-TestMaxTokenLenTokenizer.testSingleFieldSameAnalyzers-seed#[C9C07427AC3AB277])
[    ] o.a.s.u.DirectUpdateHandler2 start commit{,optimize=false,openSearcher=true,waitSearcher=true,expungeDeletes=false,softCommit=false,prepareCommit=false}
   [junit4]   2> 324952 INFO  (TEST-TestMaxTokenLenTokenizer.testSingleFieldSameAnalyzers-seed#[C9C07427AC3AB277])
[    ] o.a.s.u.DirectUpdateHandler2 No uncommitted changes. Skipping IW.commit.
   [junit4]   2> 324952 INFO  (TEST-TestMaxTokenLenTokenizer.testSingleFieldSameAnalyzers-seed#[C9C07427AC3AB277])
[    ] o.a.s.u.DirectUpdateHandler2 end_commit_flush
   [junit4]   2> 324952 INFO  (TEST-TestMaxTokenLenTokenizer.testSingleFieldSameAnalyzers-seed#[C9C07427AC3AB277])
[    ] o.a.s.u.p.LogUpdateProcessorFactory [collection1]  webapp=null path=null params={}{commit=}
0 0
   [junit4]   2> 324952 INFO  (TEST-TestMaxTokenLenTokenizer.testSingleFieldSameAnalyzers-seed#[C9C07427AC3AB277])
[    ] o.a.s.c.S.Request [collection1]  webapp=null path=null params={q=*:*&wt=xml} hits=5
status=0 QTime=0
   [junit4]   2> 324953 INFO  (TEST-TestMaxTokenLenTokenizer.testSingleFieldSameAnalyzers-seed#[C9C07427AC3AB277])
[    ] o.a.s.c.S.Request [collection1]  webapp=null path=null params={q=letter0:l&wt=xml}
hits=0 status=0 QTime=0
   [junit4]   2> 324953 INFO  (TEST-TestMaxTokenLenTokenizer.testSingleFieldSameAnalyzers-seed#[C9C07427AC3AB277])
[    ] o.a.s.c.S.Request [collection1]  webapp=null path=null params={q=letter0:let&wt=xml}
hits=1 status=0 QTime=0
   [junit4]   2> 324955 INFO  (TEST-TestMaxTokenLenTokenizer.testSingleFieldSameAnalyzers-seed#[C9C07427AC3AB277])
[    ] o.a.s.c.S.Request [collection1]  webapp=null path=null params={q=letter0:lett&wt=xml}
hits=0 status=0 QTime=2
   [junit4]   2> 324955 ERROR (TEST-TestMaxTokenLenTokenizer.testSingleFieldSameAnalyzers-seed#[C9C07427AC3AB277])
[    ] o.a.s.SolrTestCaseJ4 REQUEST FAILED: xpath=//result[@numFound=1]
   [junit4]   2> 	xml response was: <?xml version="1.0" encoding="UTF-8"?>
   [junit4]   2> <response>
   [junit4]   2> <lst name="responseHeader"><int name="status">0</int><int
name="QTime">2</int></lst><result name="response" numFound="0" start="0"></result>
   [junit4]   2> </response>
   [junit4]   2> 
   [junit4]   2> 	request was:q=letter0:lett&wt=xml
   [junit4]   2> 324956 ERROR (TEST-TestMaxTokenLenTokenizer.testSingleFieldSameAnalyzers-seed#[C9C07427AC3AB277])
[    ] o.a.s.SolrTestCaseJ4 REQUEST FAILED: q=letter0:lett&wt=xml:java.lang.RuntimeException:
REQUEST FAILED: xpath=//result[@numFound=1]
   [junit4]   2> 	xml response was: <?xml version="1.0" encoding="UTF-8"?>
   [junit4]   2> <response>
   [junit4]   2> <lst name="responseHeader"><int name="status">0</int><int
name="QTime">2</int></lst><result name="response" numFound="0" start="0"></result>
   [junit4]   2> </response>
   [junit4]   2> 
   [junit4]   2> 	request was:q=letter0:lett&wt=xml
   [junit4]   2> 	at org.apache.solr.SolrTestCaseJ4.assertQ(SolrTestCaseJ4.java:888)
   [junit4]   2> 	at org.apache.solr.util.TestMaxTokenLenTokenizer.testSingleFieldSameAnalyzers(TestMaxTokenLenTokenizer.java:104)
   [junit4]   2> 	at java.base/jdk.internal.reflect.NativeMethodAccessorImpl.invoke0(Native
Method)
   [junit4]   2> 	at java.base/jdk.internal.reflect.NativeMethodAccessorImpl.invoke(NativeMethodAccessorImpl.java:62)
   [junit4]   2> 	at java.base/jdk.internal.reflect.DelegatingMethodAccessorImpl.invoke(DelegatingMethodAccessorImpl.java:43)
   [junit4]   2> 	at java.base/java.lang.reflect.Method.invoke(Method.java:563)
   [junit4]   2> 	at com.carrotsearch.randomizedtesting.RandomizedRunner.invoke(RandomizedRunner.java:1713)
   [junit4]   2> 	at com.carrotsearch.randomizedtesting.RandomizedRunner$8.evaluate(RandomizedRunner.java:907)
   [junit4]   2> 	at com.carrotsearch.randomizedtesting.RandomizedRunner$9.evaluate(RandomizedRunner.java:943)
   [junit4]   2> 	at com.carrotsearch.randomizedtesting.RandomizedRunner$10.evaluate(RandomizedRunner.java:957)
   [junit4]   2> 	at com.carrotsearch.randomizedtesting.rules.SystemPropertiesRestoreRule$1.evaluate(SystemPropertiesRestoreRule.java:57)
   [junit4]   2> 	at org.apache.lucene.util.TestRuleSetupTeardownChained$1.evaluate(TestRuleSetupTeardownChained.java:49)
   [junit4]   2> 	at org.apache.lucene.util.AbstractBeforeAfterRule$1.evaluate(AbstractBeforeAfterRule.java:45)
   [junit4]   2> 	at org.apache.lucene.util.TestRuleThreadAndTestName$1.evaluate(TestRuleThreadAndTestName.java:48)
   [junit4]   2> 	at org.apache.lucene.util.TestRuleIgnoreAfterMaxFailures$1.evaluate(TestRuleIgnoreAfterMaxFailures.java:64)
   [junit4]   2> 	at org.apache.lucene.util.TestRuleMarkFailure$1.evaluate(TestRuleMarkFailure.java:47)
   [junit4]   2> 	at com.carrotsearch.randomizedtesting.rules.StatementAdapter.evaluate(StatementAdapter.java:36)
   [junit4]   2> 	at com.carrotsearch.randomizedtesting.ThreadLeakControl$StatementRunner.run(ThreadLeakControl.java:368)
   [junit4]   2> 	at com.carrotsearch.randomizedtesting.ThreadLeakControl.forkTimeoutingTask(ThreadLeakControl.java:817)
   [junit4]   2> 	at com.carrotsearch.randomizedtesting.ThreadLeakControl$3.evaluate(ThreadLeakControl.java:468)
   [junit4]   2> 	at com.carrotsearch.randomizedtesting.RandomizedRunner.runSingleTest(RandomizedRunner.java:916)
   [junit4]   2> 	at com.carrotsearch.randomizedtesting.RandomizedRunner$5.evaluate(RandomizedRunner.java:802)
   [junit4]   2> 	at com.carrotsearch.randomizedtesting.RandomizedRunner$6.evaluate(RandomizedRunner.java:852)
   [junit4]   2> 	at com.carrotsearch.randomizedtesting.RandomizedRunner$7.evaluate(RandomizedRunner.java:863)
   [junit4]   2> 	at com.carrotsearch.randomizedtesting.rules.StatementAdapter.evaluate(StatementAdapter.java:36)
   [junit4]   2> 	at com.carrotsearch.randomizedtesting.rules.SystemPropertiesRestoreRule$1.evaluate(SystemPropertiesRestoreRule.java:57)
   [junit4]   2> 	at org.apache.lucene.util.AbstractBeforeAfterRule$1.evaluate(AbstractBeforeAfterRule.java:45)
   [junit4]   2> 	at com.carrotsearch.randomizedtesting.rules.StatementAdapter.evaluate(StatementAdapter.java:36)
   [junit4]   2> 	at org.apache.lucene.util.TestRuleStoreClassName$1.evaluate(TestRuleStoreClassName.java:41)
   [junit4]   2> 	at com.carrotsearch.randomizedtesting.rules.NoShadowingOrOverridesOnMethodsRule$1.evaluate(NoShadowingOrOverridesOnMethodsRule.java:40)
   [junit4]   2> 	at com.carrotsearch.randomizedtesting.rules.NoShadowingOrOverridesOnMethodsRule$1.evaluate(NoShadowingOrOverridesOnMethodsRule.java:40)
   [junit4]   2> 	at com.carrotsearch.randomizedtesting.rules.StatementAdapter.evaluate(StatementAdapter.java:36)
   [junit4]   2> 	at com.carrotsearch.randomizedtesting.rules.StatementAdapter.evaluate(StatementAdapter.java:36)
   [junit4]   2> 	at org.apache.lucene.util.TestRuleAssertionsRequired$1.evaluate(TestRuleAssertionsRequired.java:53)
   [junit4]   2> 	at org.apache.lucene.util.TestRuleMarkFailure$1.evaluate(TestRuleMarkFailure.java:47)
   [junit4]   2> 	at org.apache.lucene.util.TestRuleIgnoreAfterMaxFailures$1.evaluate(TestRuleIgnoreAfterMaxFailures.java:64)
   [junit4]   2> 	at org.apache.lucene.util.TestRuleIgnoreTestSuites$1.evaluate(TestRuleIgnoreTestSuites.java:54)
   [junit4]   2> 	at com.carrotsearch.randomizedtesting.rules.StatementAdapter.evaluate(StatementAdapter.java:36)
   [junit4]   2> 	at com.carrotsearch.randomizedtesting.ThreadLeakControl$StatementRunner.run(ThreadLeakControl.java:368)
   [junit4]   2> 	at java.base/java.lang.Thread.run(Thread.java:844)
   [junit4]   2> 
   [junit4]   2> 324956 INFO  (TEST-TestMaxTokenLenTokenizer.testSingleFieldSameAnalyzers-seed#[C9C07427AC3AB277])
[    ] o.a.s.SolrTestCaseJ4 ###Ending testSingleFieldSameAnalyzers
   [junit4]   2> NOTE: reproduce with: ant test  -Dtestcase=TestMaxTokenLenTokenizer -Dtests.method=testSingleFieldSameAnalyzers
-Dtests.seed=C9C07427AC3AB277 -Dtests.multiplier=3 -Dtests.slow=true -Dtests.locale=ar-EG
-Dtests.timezone=Africa/Brazzaville -Dtests.asserts=true -Dtests.file.encoding=UTF-8
   [junit4] ERROR   0.01s J1 | TestMaxTokenLenTokenizer.testSingleFieldSameAnalyzers <<<
   [junit4]    > Throwable #1: java.lang.RuntimeException: Exception during query
   [junit4]    > 	at __randomizedtesting.SeedInfo.seed([C9C07427AC3AB277:A3124B48F4D962B8]:0)
   [junit4]    > 	at org.apache.solr.SolrTestCaseJ4.assertQ(SolrTestCaseJ4.java:895)
   [junit4]    > 	at org.apache.solr.util.TestMaxTokenLenTokenizer.testSingleFieldSameAnalyzers(TestMaxTokenLenTokenizer.java:104)
   [junit4]    > 	at java.base/jdk.internal.reflect.NativeMethodAccessorImpl.invoke0(Native
Method)
   [junit4]    > 	at java.base/jdk.internal.reflect.NativeMethodAccessorImpl.invoke(NativeMethodAccessorImpl.java:62)
   [junit4]    > 	at java.base/jdk.internal.reflect.DelegatingMethodAccessorImpl.invoke(DelegatingMethodAccessorImpl.java:43)
   [junit4]    > 	at java.base/java.lang.reflect.Method.invoke(Method.java:563)
   [junit4]    > 	at java.base/java.lang.Thread.run(Thread.java:844)
   [junit4]    > Caused by: java.lang.RuntimeException: REQUEST FAILED: xpath=//result[@numFound=1]
   [junit4]    > 	xml response was: <?xml version="1.0" encoding="UTF-8"?>
   [junit4]    > <response>
   [junit4]    > <lst name="responseHeader"><int name="status">0</int><int
name="QTime">2</int></lst><result name="response" numFound="0" start="0"></result>
   [junit4]    > </response>
   [junit4]    > 	request was:q=letter0:lett&wt=xml
   [junit4]    > 	at org.apache.solr.SolrTestCaseJ4.assertQ(SolrTestCaseJ4.java:888)
   [junit4]    > 	... 39 more
   [junit4]   2> 324957 INFO  (SUITE-TestMaxTokenLenTokenizer-seed#[C9C07427AC3AB277]-worker)
[    ] o.a.s.SolrTestCaseJ4 ###deleteCore
   [junit4]   2> 324957 INFO  (SUITE-TestMaxTokenLenTokenizer-seed#[C9C07427AC3AB277]-worker)
[    ] o.a.s.c.CoreContainer Shutting down CoreContainer instance=299707539
   [junit4]   2> 324957 INFO  (SUITE-TestMaxTokenLenTokenizer-seed#[C9C07427AC3AB277]-worker)
[    ] o.a.s.m.SolrMetricManager Closing metric reporters for: solr.node
   [junit4]   2> 324957 INFO  (SUITE-TestMaxTokenLenTokenizer-seed#[C9C07427AC3AB277]-worker)
[    ] o.a.s.m.SolrMetricManager Closing metric reporters for: solr.jvm
   [junit4]   2> 324958 INFO  (SUITE-TestMaxTokenLenTokenizer-seed#[C9C07427AC3AB277]-worker)
[    ] o.a.s.m.SolrMetricManager Closing metric reporters for: solr.jetty
   [junit4]   2> 324958 INFO  (SUITE-TestMaxTokenLenTokenizer-seed#[C9C07427AC3AB277]-worker)
[    ] o.a.s.c.TransientSolrCoreCacheDefault Allocating transient cache for 2147483647 transient
cores
   [junit4]   2> 324958 INFO  (coreCloseExecutor-1902-thread-1) [    ] o.a.s.c.SolrCore
[collection1]  CLOSING SolrCore org.apache.solr.core.SolrCore@2bf1bdbd
   [junit4]   2> 324959 INFO  (coreCloseExecutor-1902-thread-1) [    ] o.a.s.m.SolrMetricManager
Closing metric reporters for: solr.core.collection1
   [junit4]   2> NOTE: leaving temporary files on disk at: /home/jenkins/workspace/Lucene-Solr-6.x-Linux/solr/build/solr-core/test/J1/temp/solr.util.TestMaxTokenLenTokenizer_C9C07427AC3AB277-001
   [junit4]   2> NOTE: test params are: codec=Asserting(Lucene62): {lowerCase0=PostingsFormat(name=LuceneVarGapFixedInterval),
whiteSpace=PostingsFormat(name=Memory doPackFST= false), letter=BlockTreeOrds(blocksize=128),
lowerCase=PostingsFormat(name=LuceneVarGapFixedInterval), unicodeWhiteSpace=BlockTreeOrds(blocksize=128),
letter0=BlockTreeOrds(blocksize=128), unicodeWhiteSpace0=BlockTreeOrds(blocksize=128), keyword0=PostingsFormat(name=LuceneVarGapFixedInterval),
id=PostingsFormat(name=LuceneVarGapFixedInterval), keyword=PostingsFormat(name=LuceneVarGapFixedInterval),
whiteSpace0=PostingsFormat(name=Memory doPackFST= false)}, docValues:{}, maxPointsInLeafNode=68,
maxMBSortInHeap=5.639866349293024, sim=RandomSimilarity(queryNorm=false,coord=yes): {}, locale=ar-EG,
timezone=Africa/Brazzaville
   [junit4]   2> NOTE: Linux 4.10.0-21-generic amd64/Oracle Corporation 9-ea (64-bit)/cpus=8,threads=1,free=153082424,total=518979584
   [junit4]   2> NOTE: All tests run in this JVM: [DistributedDebugComponentTest, TestSystemCollAutoCreate,
SolrIndexConfigTest, BlockJoinFacetSimpleTest, HdfsWriteToMultipleCollectionsTest, RuleEngineTest,
TestSimpleTrackingShardHandler, ManagedSchemaRoundRobinCloudTest, TestSchemaSimilarityResource,
SimplePostToolTest, TestMiniSolrCloudClusterSSL, TestFieldCacheSort, TestStressVersions, TestNestedDocsSort,
WrapperMergePolicyFactoryTest, InfixSuggestersTest, TestDeleteCollectionOnDownNodes, TestDynamicLoading,
TestClassicSimilarityFactory, BasicAuthStandaloneTest, TestCloudPivotFacet, HdfsDirectoryFactoryTest,
TestShardHandlerFactory, TestIntervalFaceting, DistributedFacetPivotSmallTest, TestCollectionAPIs,
TestUseDocValuesAsStored, SchemaVersionSpecificBehaviorTest, UUIDUpdateProcessorFallbackTest,
TestFuzzyAnalyzedSuggestions, DistributedTermsComponentTest, HdfsCollectionsAPIDistributedZkTest,
TestDefaultStatsCache, TestRawResponseWriter, HttpSolrCallGetCoreTest, AddSchemaFieldsUpdateProcessorFactoryTest,
TestRandomCollapseQParserPlugin, TestFilteredDocIdSet, SearchHandlerTest, SolrInfoMBeanTest,
LeaderFailoverAfterPartitionTest, OutOfBoxZkACLAndCredentialsProvidersTest, TestMaxTokenLenTokenizer]
   [junit4] Completed [156/715 (1!)] on J1 in 0.17s, 2 tests, 1 error <<< FAILURES!

[...truncated 38158 lines...]

Mime
View raw message