lucene-dev mailing list archives

Site index · List index
Message view « Date » · « Thread »
Top « Date » · « Thread »
From Erick Erickson <erickerick...@gmail.com>
Subject Re: [JENKINS-EA] Lucene-Solr-6.x-Linux (32bit/jdk-9-ea+171) - Build # 3629 - Still Unstable!
Date Thu, 01 Jun 2017 02:04:34 GMT
Do note that we understand where this is coming from and are working
on a fix that should be in place soon See LUCENE-7857

Sorry for the noise meanwhile.

Erick

On Wed, May 31, 2017 at 3:22 AM, Policeman Jenkins Server
<jenkins@thetaphi.de> wrote:
> Build: https://jenkins.thetaphi.de/job/Lucene-Solr-6.x-Linux/3629/
> Java: 32bit/jdk-9-ea+171 -client -XX:+UseConcMarkSweepGC
>
> 1 tests failed.
> FAILED:  org.apache.solr.util.TestMaxTokenLenTokenizer.testSingleFieldSameAnalyzers
>
> Error Message:
> Exception during query
>
> Stack Trace:
> java.lang.RuntimeException: Exception during query
>         at __randomizedtesting.SeedInfo.seed([6A12DFC046B6CA7B:C0E0AF1E551AB4]:0)
>         at org.apache.solr.SolrTestCaseJ4.assertQ(SolrTestCaseJ4.java:895)
>         at org.apache.solr.util.TestMaxTokenLenTokenizer.testSingleFieldSameAnalyzers(TestMaxTokenLenTokenizer.java:104)
>         at java.base/jdk.internal.reflect.NativeMethodAccessorImpl.invoke0(Native Method)
>         at java.base/jdk.internal.reflect.NativeMethodAccessorImpl.invoke(NativeMethodAccessorImpl.java:62)
>         at java.base/jdk.internal.reflect.DelegatingMethodAccessorImpl.invoke(DelegatingMethodAccessorImpl.java:43)
>         at java.base/java.lang.reflect.Method.invoke(Method.java:563)
>         at com.carrotsearch.randomizedtesting.RandomizedRunner.invoke(RandomizedRunner.java:1713)
>         at com.carrotsearch.randomizedtesting.RandomizedRunner$8.evaluate(RandomizedRunner.java:907)
>         at com.carrotsearch.randomizedtesting.RandomizedRunner$9.evaluate(RandomizedRunner.java:943)
>         at com.carrotsearch.randomizedtesting.RandomizedRunner$10.evaluate(RandomizedRunner.java:957)
>         at com.carrotsearch.randomizedtesting.rules.SystemPropertiesRestoreRule$1.evaluate(SystemPropertiesRestoreRule.java:57)
>         at org.apache.lucene.util.TestRuleSetupTeardownChained$1.evaluate(TestRuleSetupTeardownChained.java:49)
>         at org.apache.lucene.util.AbstractBeforeAfterRule$1.evaluate(AbstractBeforeAfterRule.java:45)
>         at org.apache.lucene.util.TestRuleThreadAndTestName$1.evaluate(TestRuleThreadAndTestName.java:48)
>         at org.apache.lucene.util.TestRuleIgnoreAfterMaxFailures$1.evaluate(TestRuleIgnoreAfterMaxFailures.java:64)
>         at org.apache.lucene.util.TestRuleMarkFailure$1.evaluate(TestRuleMarkFailure.java:47)
>         at com.carrotsearch.randomizedtesting.rules.StatementAdapter.evaluate(StatementAdapter.java:36)
>         at com.carrotsearch.randomizedtesting.ThreadLeakControl$StatementRunner.run(ThreadLeakControl.java:368)
>         at com.carrotsearch.randomizedtesting.ThreadLeakControl.forkTimeoutingTask(ThreadLeakControl.java:817)
>         at com.carrotsearch.randomizedtesting.ThreadLeakControl$3.evaluate(ThreadLeakControl.java:468)
>         at com.carrotsearch.randomizedtesting.RandomizedRunner.runSingleTest(RandomizedRunner.java:916)
>         at com.carrotsearch.randomizedtesting.RandomizedRunner$5.evaluate(RandomizedRunner.java:802)
>         at com.carrotsearch.randomizedtesting.RandomizedRunner$6.evaluate(RandomizedRunner.java:852)
>         at com.carrotsearch.randomizedtesting.RandomizedRunner$7.evaluate(RandomizedRunner.java:863)
>         at com.carrotsearch.randomizedtesting.rules.StatementAdapter.evaluate(StatementAdapter.java:36)
>         at com.carrotsearch.randomizedtesting.rules.SystemPropertiesRestoreRule$1.evaluate(SystemPropertiesRestoreRule.java:57)
>         at org.apache.lucene.util.AbstractBeforeAfterRule$1.evaluate(AbstractBeforeAfterRule.java:45)
>         at com.carrotsearch.randomizedtesting.rules.StatementAdapter.evaluate(StatementAdapter.java:36)
>         at org.apache.lucene.util.TestRuleStoreClassName$1.evaluate(TestRuleStoreClassName.java:41)
>         at com.carrotsearch.randomizedtesting.rules.NoShadowingOrOverridesOnMethodsRule$1.evaluate(NoShadowingOrOverridesOnMethodsRule.java:40)
>         at com.carrotsearch.randomizedtesting.rules.NoShadowingOrOverridesOnMethodsRule$1.evaluate(NoShadowingOrOverridesOnMethodsRule.java:40)
>         at com.carrotsearch.randomizedtesting.rules.StatementAdapter.evaluate(StatementAdapter.java:36)
>         at com.carrotsearch.randomizedtesting.rules.StatementAdapter.evaluate(StatementAdapter.java:36)
>         at org.apache.lucene.util.TestRuleAssertionsRequired$1.evaluate(TestRuleAssertionsRequired.java:53)
>         at org.apache.lucene.util.TestRuleMarkFailure$1.evaluate(TestRuleMarkFailure.java:47)
>         at org.apache.lucene.util.TestRuleIgnoreAfterMaxFailures$1.evaluate(TestRuleIgnoreAfterMaxFailures.java:64)
>         at org.apache.lucene.util.TestRuleIgnoreTestSuites$1.evaluate(TestRuleIgnoreTestSuites.java:54)
>         at com.carrotsearch.randomizedtesting.rules.StatementAdapter.evaluate(StatementAdapter.java:36)
>         at com.carrotsearch.randomizedtesting.ThreadLeakControl$StatementRunner.run(ThreadLeakControl.java:368)
>         at java.base/java.lang.Thread.run(Thread.java:844)
> Caused by: java.lang.RuntimeException: REQUEST FAILED: xpath=//result[@numFound=1]
>         xml response was: <?xml version="1.0" encoding="UTF-8"?>
> <response>
> <lst name="responseHeader"><int name="status">0</int><int name="QTime">0</int></lst><result name="response" numFound="0" start="0"></result>
> </response>
>
>         request was:q=letter0:lett&wt=xml
>         at org.apache.solr.SolrTestCaseJ4.assertQ(SolrTestCaseJ4.java:888)
>         ... 39 more
>
>
>
>
> Build Log:
> [...truncated 1703 lines...]
>    [junit4] JVM J2: stderr was not empty, see: /home/jenkins/workspace/Lucene-Solr-6.x-Linux/lucene/build/core/test/temp/junit4-J2-20170531_092626_54015818048636578913675.syserr
>    [junit4] >>> JVM J2 emitted unexpected output (verbatim) ----
>    [junit4] Java HotSpot(TM) Server VM warning: Option UseConcMarkSweepGC was deprecated in version 9.0 and will likely be removed in a future release.
>    [junit4] <<< JVM J2: EOF ----
>
> [...truncated 3 lines...]
>    [junit4] JVM J0: stderr was not empty, see: /home/jenkins/workspace/Lucene-Solr-6.x-Linux/lucene/build/core/test/temp/junit4-J0-20170531_092626_54010687221948260011309.syserr
>    [junit4] >>> JVM J0 emitted unexpected output (verbatim) ----
>    [junit4] Java HotSpot(TM) Server VM warning: Option UseConcMarkSweepGC was deprecated in version 9.0 and will likely be removed in a future release.
>    [junit4] <<< JVM J0: EOF ----
>
> [...truncated 9 lines...]
>    [junit4] JVM J1: stderr was not empty, see: /home/jenkins/workspace/Lucene-Solr-6.x-Linux/lucene/build/core/test/temp/junit4-J1-20170531_092626_5407148306073643401769.syserr
>    [junit4] >>> JVM J1 emitted unexpected output (verbatim) ----
>    [junit4] Java HotSpot(TM) Server VM warning: Option UseConcMarkSweepGC was deprecated in version 9.0 and will likely be removed in a future release.
>    [junit4] <<< JVM J1: EOF ----
>
> [...truncated 287 lines...]
>    [junit4] JVM J1: stderr was not empty, see: /home/jenkins/workspace/Lucene-Solr-6.x-Linux/lucene/build/test-framework/test/temp/junit4-J1-20170531_093155_61111321158366041361839.syserr
>    [junit4] >>> JVM J1 emitted unexpected output (verbatim) ----
>    [junit4] Java HotSpot(TM) Server VM warning: Option UseConcMarkSweepGC was deprecated in version 9.0 and will likely be removed in a future release.
>    [junit4] <<< JVM J1: EOF ----
>
>    [junit4] JVM J2: stderr was not empty, see: /home/jenkins/workspace/Lucene-Solr-6.x-Linux/lucene/build/test-framework/test/temp/junit4-J2-20170531_093155_6115465470336994636915.syserr
>    [junit4] >>> JVM J2 emitted unexpected output (verbatim) ----
>    [junit4] Java HotSpot(TM) Server VM warning: Option UseConcMarkSweepGC was deprecated in version 9.0 and will likely be removed in a future release.
>    [junit4] <<< JVM J2: EOF ----
>
>    [junit4] JVM J0: stderr was not empty, see: /home/jenkins/workspace/Lucene-Solr-6.x-Linux/lucene/build/test-framework/test/temp/junit4-J0-20170531_093155_6113997305970741155525.syserr
>    [junit4] >>> JVM J0 emitted unexpected output (verbatim) ----
>    [junit4] Java HotSpot(TM) Server VM warning: Option UseConcMarkSweepGC was deprecated in version 9.0 and will likely be removed in a future release.
>    [junit4] <<< JVM J0: EOF ----
>
> [...truncated 1048 lines...]
>    [junit4] JVM J0: stderr was not empty, see: /home/jenkins/workspace/Lucene-Solr-6.x-Linux/lucene/build/analysis/common/test/temp/junit4-J0-20170531_093253_86214622975203189557810.syserr
>    [junit4] >>> JVM J0 emitted unexpected output (verbatim) ----
>    [junit4] Java HotSpot(TM) Server VM warning: Option UseConcMarkSweepGC was deprecated in version 9.0 and will likely be removed in a future release.
>    [junit4] <<< JVM J0: EOF ----
>
> [...truncated 3 lines...]
>    [junit4] JVM J1: stderr was not empty, see: /home/jenkins/workspace/Lucene-Solr-6.x-Linux/lucene/build/analysis/common/test/temp/junit4-J1-20170531_093253_86217613373266479375608.syserr
>    [junit4] >>> JVM J1 emitted unexpected output (verbatim) ----
>    [junit4] Java HotSpot(TM) Server VM warning: Option UseConcMarkSweepGC was deprecated in version 9.0 and will likely be removed in a future release.
>    [junit4] <<< JVM J1: EOF ----
>
> [...truncated 3 lines...]
>    [junit4] JVM J2: stderr was not empty, see: /home/jenkins/workspace/Lucene-Solr-6.x-Linux/lucene/build/analysis/common/test/temp/junit4-J2-20170531_093253_8764936058418288903028.syserr
>    [junit4] >>> JVM J2 emitted unexpected output (verbatim) ----
>    [junit4] Java HotSpot(TM) Server VM warning: Option UseConcMarkSweepGC was deprecated in version 9.0 and will likely be removed in a future release.
>    [junit4] <<< JVM J2: EOF ----
>
> [...truncated 218 lines...]
>    [junit4] JVM J0: stderr was not empty, see: /home/jenkins/workspace/Lucene-Solr-6.x-Linux/lucene/build/analysis/icu/test/temp/junit4-J0-20170531_093456_16116609878775355050734.syserr
>    [junit4] >>> JVM J0 emitted unexpected output (verbatim) ----
>    [junit4] Java HotSpot(TM) Server VM warning: Option UseConcMarkSweepGC was deprecated in version 9.0 and will likely be removed in a future release.
>    [junit4] <<< JVM J0: EOF ----
>
>    [junit4] JVM J2: stderr was not empty, see: /home/jenkins/workspace/Lucene-Solr-6.x-Linux/lucene/build/analysis/icu/test/temp/junit4-J2-20170531_093456_16111286137048323364150.syserr
>    [junit4] >>> JVM J2 emitted unexpected output (verbatim) ----
>    [junit4] Java HotSpot(TM) Server VM warning: Option UseConcMarkSweepGC was deprecated in version 9.0 and will likely be removed in a future release.
>    [junit4] <<< JVM J2: EOF ----
>
> [...truncated 3 lines...]
>    [junit4] JVM J1: stderr was not empty, see: /home/jenkins/workspace/Lucene-Solr-6.x-Linux/lucene/build/analysis/icu/test/temp/junit4-J1-20170531_093456_16115211296497778388253.syserr
>    [junit4] >>> JVM J1 emitted unexpected output (verbatim) ----
>    [junit4] Java HotSpot(TM) Server VM warning: Option UseConcMarkSweepGC was deprecated in version 9.0 and will likely be removed in a future release.
>    [junit4] <<< JVM J1: EOF ----
>
> [...truncated 237 lines...]
>    [junit4] JVM J2: stderr was not empty, see: /home/jenkins/workspace/Lucene-Solr-6.x-Linux/lucene/build/analysis/kuromoji/test/temp/junit4-J2-20170531_093506_3885522012172367561153.syserr
>    [junit4] >>> JVM J2 emitted unexpected output (verbatim) ----
>    [junit4] Java HotSpot(TM) Server VM warning: Option UseConcMarkSweepGC was deprecated in version 9.0 and will likely be removed in a future release.
>    [junit4] <<< JVM J2: EOF ----
>
>    [junit4] JVM J0: stderr was not empty, see: /home/jenkins/workspace/Lucene-Solr-6.x-Linux/lucene/build/analysis/kuromoji/test/temp/junit4-J0-20170531_093506_3889331033854298680862.syserr
>    [junit4] >>> JVM J0 emitted unexpected output (verbatim) ----
>    [junit4] Java HotSpot(TM) Server VM warning: Option UseConcMarkSweepGC was deprecated in version 9.0 and will likely be removed in a future release.
>    [junit4] <<< JVM J0: EOF ----
>
> [...truncated 6 lines...]
>    [junit4] JVM J1: stderr was not empty, see: /home/jenkins/workspace/Lucene-Solr-6.x-Linux/lucene/build/analysis/kuromoji/test/temp/junit4-J1-20170531_093506_38811419396190150184864.syserr
>    [junit4] >>> JVM J1 emitted unexpected output (verbatim) ----
>    [junit4] Java HotSpot(TM) Server VM warning: Option UseConcMarkSweepGC was deprecated in version 9.0 and will likely be removed in a future release.
>    [junit4] <<< JVM J1: EOF ----
>
> [...truncated 146 lines...]
>    [junit4] JVM J1: stderr was not empty, see: /home/jenkins/workspace/Lucene-Solr-6.x-Linux/lucene/build/analysis/morfologik/test/temp/junit4-J1-20170531_093526_33215450879552475423357.syserr
>    [junit4] >>> JVM J1 emitted unexpected output (verbatim) ----
>    [junit4] Java HotSpot(TM) Server VM warning: Option UseConcMarkSweepGC was deprecated in version 9.0 and will likely be removed in a future release.
>    [junit4] <<< JVM J1: EOF ----
>
> [...truncated 3 lines...]
>    [junit4] JVM J2: stderr was not empty, see: /home/jenkins/workspace/Lucene-Solr-6.x-Linux/lucene/build/analysis/morfologik/test/temp/junit4-J2-20170531_093526_3329478294795039108360.syserr
>    [junit4] >>> JVM J2 emitted unexpected output (verbatim) ----
>    [junit4] Java HotSpot(TM) Server VM warning: Option UseConcMarkSweepGC was deprecated in version 9.0 and will likely be removed in a future release.
>    [junit4] <<< JVM J2: EOF ----
>
> [...truncated 3 lines...]
>    [junit4] JVM J0: stderr was not empty, see: /home/jenkins/workspace/Lucene-Solr-6.x-Linux/lucene/build/analysis/morfologik/test/temp/junit4-J0-20170531_093526_33212123010336699126324.syserr
>    [junit4] >>> JVM J0 emitted unexpected output (verbatim) ----
>    [junit4] Java HotSpot(TM) Server VM warning: Option UseConcMarkSweepGC was deprecated in version 9.0 and will likely be removed in a future release.
>    [junit4] <<< JVM J0: EOF ----
>
> [...truncated 158 lines...]
>    [junit4] JVM J2: stderr was not empty, see: /home/jenkins/workspace/Lucene-Solr-6.x-Linux/lucene/build/analysis/phonetic/test/temp/junit4-J2-20170531_093529_4361686383247646115749.syserr
>    [junit4] >>> JVM J2 emitted unexpected output (verbatim) ----
>    [junit4] Java HotSpot(TM) Server VM warning: Option UseConcMarkSweepGC was deprecated in version 9.0 and will likely be removed in a future release.
>    [junit4] <<< JVM J2: EOF ----
>
> [...truncated 3 lines...]
>    [junit4] JVM J0: stderr was not empty, see: /home/jenkins/workspace/Lucene-Solr-6.x-Linux/lucene/build/analysis/phonetic/test/temp/junit4-J0-20170531_093529_4356406234908224963301.syserr
>    [junit4] >>> JVM J0 emitted unexpected output (verbatim) ----
>    [junit4] Java HotSpot(TM) Server VM warning: Option UseConcMarkSweepGC was deprecated in version 9.0 and will likely be removed in a future release.
>    [junit4] <<< JVM J0: EOF ----
>
> [...truncated 3 lines...]
>    [junit4] JVM J1: stderr was not empty, see: /home/jenkins/workspace/Lucene-Solr-6.x-Linux/lucene/build/analysis/phonetic/test/temp/junit4-J1-20170531_093529_43513831236985894097923.syserr
>    [junit4] >>> JVM J1 emitted unexpected output (verbatim) ----
>    [junit4] Java HotSpot(TM) Server VM warning: Option UseConcMarkSweepGC was deprecated in version 9.0 and will likely be removed in a future release.
>    [junit4] <<< JVM J1: EOF ----
>
> [...truncated 145 lines...]
>    [junit4] JVM J0: stderr was not empty, see: /home/jenkins/workspace/Lucene-Solr-6.x-Linux/lucene/build/analysis/smartcn/test/temp/junit4-J0-20170531_093537_74613862615203048498513.syserr
>    [junit4] >>> JVM J0 emitted unexpected output (verbatim) ----
>    [junit4] Java HotSpot(TM) Server VM warning: Option UseConcMarkSweepGC was deprecated in version 9.0 and will likely be removed in a future release.
>    [junit4] <<< JVM J0: EOF ----
>
> [...truncated 3 lines...]
>    [junit4] JVM J1: stderr was not empty, see: /home/jenkins/workspace/Lucene-Solr-6.x-Linux/lucene/build/analysis/smartcn/test/temp/junit4-J1-20170531_093537_7463449369781232720201.syserr
>    [junit4] >>> JVM J1 emitted unexpected output (verbatim) ----
>    [junit4] Java HotSpot(TM) Server VM warning: Option UseConcMarkSweepGC was deprecated in version 9.0 and will likely be removed in a future release.
>    [junit4] <<< JVM J1: EOF ----
>
> [...truncated 149 lines...]
>    [junit4] JVM J2: stderr was not empty, see: /home/jenkins/workspace/Lucene-Solr-6.x-Linux/lucene/build/analysis/stempel/test/temp/junit4-J2-20170531_093546_30711813819792003667594.syserr
>    [junit4] >>> JVM J2 emitted unexpected output (verbatim) ----
>    [junit4] Java HotSpot(TM) Server VM warning: Option UseConcMarkSweepGC was deprecated in version 9.0 and will likely be removed in a future release.
>    [junit4] <<< JVM J2: EOF ----
>
> [...truncated 3 lines...]
>    [junit4] JVM J1: stderr was not empty, see: /home/jenkins/workspace/Lucene-Solr-6.x-Linux/lucene/build/analysis/stempel/test/temp/junit4-J1-20170531_093546_30715485335415848590888.syserr
>    [junit4] >>> JVM J1 emitted unexpected output (verbatim) ----
>    [junit4] Java HotSpot(TM) Server VM warning: Option UseConcMarkSweepGC was deprecated in version 9.0 and will likely be removed in a future release.
>    [junit4] <<< JVM J1: EOF ----
>
>    [junit4] JVM J0: stderr was not empty, see: /home/jenkins/workspace/Lucene-Solr-6.x-Linux/lucene/build/analysis/stempel/test/temp/junit4-J0-20170531_093546_3077037051458465235181.syserr
>    [junit4] >>> JVM J0 emitted unexpected output (verbatim) ----
>    [junit4] Java HotSpot(TM) Server VM warning: Option UseConcMarkSweepGC was deprecated in version 9.0 and will likely be removed in a future release.
>    [junit4] <<< JVM J0: EOF ----
>
> [...truncated 161 lines...]
>    [junit4] JVM J0: stderr was not empty, see: /home/jenkins/workspace/Lucene-Solr-6.x-Linux/lucene/build/analysis/uima/test/temp/junit4-J0-20170531_093548_6223470968261704045801.syserr
>    [junit4] >>> JVM J0 emitted unexpected output (verbatim) ----
>    [junit4] Java HotSpot(TM) Server VM warning: Option UseConcMarkSweepGC was deprecated in version 9.0 and will likely be removed in a future release.
>    [junit4] <<< JVM J0: EOF ----
>
> [...truncated 157 lines...]
>    [junit4] JVM J1: stderr was not empty, see: /home/jenkins/workspace/Lucene-Solr-6.x-Linux/lucene/build/backward-codecs/test/temp/junit4-J1-20170531_093555_8568809820064272321801.syserr
>    [junit4] >>> JVM J1 emitted unexpected output (verbatim) ----
>    [junit4] Java HotSpot(TM) Server VM warning: Option UseConcMarkSweepGC was deprecated in version 9.0 and will likely be removed in a future release.
>    [junit4] <<< JVM J1: EOF ----
>
> [...truncated 17 lines...]
>    [junit4] JVM J0: stderr was not empty, see: /home/jenkins/workspace/Lucene-Solr-6.x-Linux/lucene/build/backward-codecs/test/temp/junit4-J0-20170531_093555_8565423267184788081836.syserr
>    [junit4] >>> JVM J0 emitted unexpected output (verbatim) ----
>    [junit4] Java HotSpot(TM) Server VM warning: Option UseConcMarkSweepGC was deprecated in version 9.0 and will likely be removed in a future release.
>    [junit4] <<< JVM J0: EOF ----
>
> [...truncated 9 lines...]
>    [junit4] JVM J2: stderr was not empty, see: /home/jenkins/workspace/Lucene-Solr-6.x-Linux/lucene/build/backward-codecs/test/temp/junit4-J2-20170531_093555_85611438732659887372704.syserr
>    [junit4] >>> JVM J2 emitted unexpected output (verbatim) ----
>    [junit4] Java HotSpot(TM) Server VM warning: Option UseConcMarkSweepGC was deprecated in version 9.0 and will likely be removed in a future release.
>    [junit4] <<< JVM J2: EOF ----
>
> [...truncated 1344 lines...]
>    [junit4] JVM J1: stderr was not empty, see: /home/jenkins/workspace/Lucene-Solr-6.x-Linux/lucene/build/benchmark/test/temp/junit4-J1-20170531_093709_71914095365120898182475.syserr
>    [junit4] >>> JVM J1 emitted unexpected output (verbatim) ----
>    [junit4] Java HotSpot(TM) Server VM warning: Option UseConcMarkSweepGC was deprecated in version 9.0 and will likely be removed in a future release.
>    [junit4] <<< JVM J1: EOF ----
>
>    [junit4] JVM J2: stderr was not empty, see: /home/jenkins/workspace/Lucene-Solr-6.x-Linux/lucene/build/benchmark/test/temp/junit4-J2-20170531_093709_7193027254773017218118.syserr
>    [junit4] >>> JVM J2 emitted unexpected output (verbatim) ----
>    [junit4] Java HotSpot(TM) Server VM warning: Option UseConcMarkSweepGC was deprecated in version 9.0 and will likely be removed in a future release.
>    [junit4] <<< JVM J2: EOF ----
>
> [...truncated 3 lines...]
>    [junit4] JVM J0: stderr was not empty, see: /home/jenkins/workspace/Lucene-Solr-6.x-Linux/lucene/build/benchmark/test/temp/junit4-J0-20170531_093709_7192810280629202603682.syserr
>    [junit4] >>> JVM J0 emitted unexpected output (verbatim) ----
>    [junit4] Java HotSpot(TM) Server VM warning: Option UseConcMarkSweepGC was deprecated in version 9.0 and will likely be removed in a future release.
>    [junit4] <<< JVM J0: EOF ----
>
> [...truncated 223 lines...]
>    [junit4] JVM J1: stderr was not empty, see: /home/jenkins/workspace/Lucene-Solr-6.x-Linux/lucene/build/classification/test/temp/junit4-J1-20170531_093717_18913501279114703847447.syserr
>    [junit4] >>> JVM J1 emitted unexpected output (verbatim) ----
>    [junit4] Java HotSpot(TM) Server VM warning: Option UseConcMarkSweepGC was deprecated in version 9.0 and will likely be removed in a future release.
>    [junit4] <<< JVM J1: EOF ----
>
> [...truncated 3 lines...]
>    [junit4] JVM J0: stderr was not empty, see: /home/jenkins/workspace/Lucene-Solr-6.x-Linux/lucene/build/classification/test/temp/junit4-J0-20170531_093717_1896589007592446005858.syserr
>    [junit4] >>> JVM J0 emitted unexpected output (verbatim) ----
>    [junit4] Java HotSpot(TM) Server VM warning: Option UseConcMarkSweepGC was deprecated in version 9.0 and will likely be removed in a future release.
>    [junit4] <<< JVM J0: EOF ----
>
> [...truncated 3 lines...]
>    [junit4] JVM J2: stderr was not empty, see: /home/jenkins/workspace/Lucene-Solr-6.x-Linux/lucene/build/classification/test/temp/junit4-J2-20170531_093717_1902571416033993710582.syserr
>    [junit4] >>> JVM J2 emitted unexpected output (verbatim) ----
>    [junit4] Java HotSpot(TM) Server VM warning: Option UseConcMarkSweepGC was deprecated in version 9.0 and will likely be removed in a future release.
>    [junit4] <<< JVM J2: EOF ----
>
> [...truncated 249 lines...]
>    [junit4] JVM J1: stderr was not empty, see: /home/jenkins/workspace/Lucene-Solr-6.x-Linux/lucene/build/codecs/test/temp/junit4-J1-20170531_093724_3704750829960049030483.syserr
>    [junit4] >>> JVM J1 emitted unexpected output (verbatim) ----
>    [junit4] Java HotSpot(TM) Server VM warning: Option UseConcMarkSweepGC was deprecated in version 9.0 and will likely be removed in a future release.
>    [junit4] <<< JVM J1: EOF ----
>
> [...truncated 3 lines...]
>    [junit4] JVM J2: stderr was not empty, see: /home/jenkins/workspace/Lucene-Solr-6.x-Linux/lucene/build/codecs/test/temp/junit4-J2-20170531_093724_3703195046647609744258.syserr
>    [junit4] >>> JVM J2 emitted unexpected output (verbatim) ----
>    [junit4] Java HotSpot(TM) Server VM warning: Option UseConcMarkSweepGC was deprecated in version 9.0 and will likely be removed in a future release.
>    [junit4] <<< JVM J2: EOF ----
>
> [...truncated 4 lines...]
>    [junit4] JVM J0: stderr was not empty, see: /home/jenkins/workspace/Lucene-Solr-6.x-Linux/lucene/build/codecs/test/temp/junit4-J0-20170531_093724_37015300927820108968567.syserr
>    [junit4] >>> JVM J0 emitted unexpected output (verbatim) ----
>    [junit4] Java HotSpot(TM) Server VM warning: Option UseConcMarkSweepGC was deprecated in version 9.0 and will likely be removed in a future release.
>    [junit4] <<< JVM J0: EOF ----
>
> [...truncated 229 lines...]
>    [junit4] JVM J0: stderr was not empty, see: /home/jenkins/workspace/Lucene-Solr-6.x-Linux/lucene/build/demo/test/temp/junit4-J0-20170531_093952_2649410911110460389795.syserr
>    [junit4] >>> JVM J0 emitted unexpected output (verbatim) ----
>    [junit4] Java HotSpot(TM) Server VM warning: Option UseConcMarkSweepGC was deprecated in version 9.0 and will likely be removed in a future release.
>    [junit4] <<< JVM J0: EOF ----
>
>    [junit4] JVM J2: stderr was not empty, see: /home/jenkins/workspace/Lucene-Solr-6.x-Linux/lucene/build/demo/test/temp/junit4-J2-20170531_093952_26417041146497922893847.syserr
>    [junit4] >>> JVM J2 emitted unexpected output (verbatim) ----
>    [junit4] Java HotSpot(TM) Server VM warning: Option UseConcMarkSweepGC was deprecated in version 9.0 and will likely be removed in a future release.
>    [junit4] <<< JVM J2: EOF ----
>
>    [junit4] JVM J1: stderr was not empty, see: /home/jenkins/workspace/Lucene-Solr-6.x-Linux/lucene/build/demo/test/temp/junit4-J1-20170531_093952_26412646883615550006857.syserr
>    [junit4] >>> JVM J1 emitted unexpected output (verbatim) ----
>    [junit4] Java HotSpot(TM) Server VM warning: Option UseConcMarkSweepGC was deprecated in version 9.0 and will likely be removed in a future release.
>    [junit4] <<< JVM J1: EOF ----
>
> [...truncated 162 lines...]
>    [junit4] JVM J2: stderr was not empty, see: /home/jenkins/workspace/Lucene-Solr-6.x-Linux/lucene/build/expressions/test/temp/junit4-J2-20170531_093954_8203516180152038219680.syserr
>    [junit4] >>> JVM J2 emitted unexpected output (verbatim) ----
>    [junit4] Java HotSpot(TM) Server VM warning: Option UseConcMarkSweepGC was deprecated in version 9.0 and will likely be removed in a future release.
>    [junit4] <<< JVM J2: EOF ----
>
> [...truncated 3 lines...]
>    [junit4] JVM J1: stderr was not empty, see: /home/jenkins/workspace/Lucene-Solr-6.x-Linux/lucene/build/expressions/test/temp/junit4-J1-20170531_093954_820580309405359339253.syserr
>    [junit4] >>> JVM J1 emitted unexpected output (verbatim) ----
>    [junit4] Java HotSpot(TM) Server VM warning: Option UseConcMarkSweepGC was deprecated in version 9.0 and will likely be removed in a future release.
>    [junit4] <<< JVM J1: EOF ----
>
> [...truncated 3 lines...]
>    [junit4] JVM J0: stderr was not empty, see: /home/jenkins/workspace/Lucene-Solr-6.x-Linux/lucene/build/expressions/test/temp/junit4-J0-20170531_093954_8202159767767263675766.syserr
>    [junit4] >>> JVM J0 emitted unexpected output (verbatim) ----
>    [junit4] Java HotSpot(TM) Server VM warning: Option UseConcMarkSweepGC was deprecated in version 9.0 and will likely be removed in a future release.
>    [junit4] <<< JVM J0: EOF ----
>
> [...truncated 212 lines...]
>    [junit4] JVM J0: stderr was not empty, see: /home/jenkins/workspace/Lucene-Solr-6.x-Linux/lucene/build/facet/test/temp/junit4-J0-20170531_094000_0219238126888103332904.syserr
>    [junit4] >>> JVM J0 emitted unexpected output (verbatim) ----
>    [junit4] Java HotSpot(TM) Server VM warning: Option UseConcMarkSweepGC was deprecated in version 9.0 and will likely be removed in a future release.
>    [junit4] <<< JVM J0: EOF ----
>
>    [junit4] JVM J2: stderr was not empty, see: /home/jenkins/workspace/Lucene-Solr-6.x-Linux/lucene/build/facet/test/temp/junit4-J2-20170531_094000_0211566442322651065322.syserr
>    [junit4] >>> JVM J2 emitted unexpected output (verbatim) ----
>    [junit4] Java HotSpot(TM) Server VM warning: Option UseConcMarkSweepGC was deprecated in version 9.0 and will likely be removed in a future release.
>    [junit4] <<< JVM J2: EOF ----
>
> [...truncated 3 lines...]
>    [junit4] JVM J1: stderr was not empty, see: /home/jenkins/workspace/Lucene-Solr-6.x-Linux/lucene/build/facet/test/temp/junit4-J1-20170531_094000_02114977365629636902300.syserr
>    [junit4] >>> JVM J1 emitted unexpected output (verbatim) ----
>    [junit4] Java HotSpot(TM) Server VM warning: Option UseConcMarkSweepGC was deprecated in version 9.0 and will likely be removed in a future release.
>    [junit4] <<< JVM J1: EOF ----
>
> [...truncated 156 lines...]
>    [junit4] JVM J1: stderr was not empty, see: /home/jenkins/workspace/Lucene-Solr-6.x-Linux/lucene/build/grouping/test/temp/junit4-J1-20170531_094024_35515749791354410780465.syserr
>    [junit4] >>> JVM J1 emitted unexpected output (verbatim) ----
>    [junit4] Java HotSpot(TM) Server VM warning: Option UseConcMarkSweepGC was deprecated in version 9.0 and will likely be removed in a future release.
>    [junit4] <<< JVM J1: EOF ----
>
> [...truncated 3 lines...]
>    [junit4] JVM J2: stderr was not empty, see: /home/jenkins/workspace/Lucene-Solr-6.x-Linux/lucene/build/grouping/test/temp/junit4-J2-20170531_094024_355741886027637037142.syserr
>    [junit4] >>> JVM J2 emitted unexpected output (verbatim) ----
>    [junit4] Java HotSpot(TM) Server VM warning: Option UseConcMarkSweepGC was deprecated in version 9.0 and will likely be removed in a future release.
>    [junit4] <<< JVM J2: EOF ----
>
> [...truncated 3 lines...]
>    [junit4] JVM J0: stderr was not empty, see: /home/jenkins/workspace/Lucene-Solr-6.x-Linux/lucene/build/grouping/test/temp/junit4-J0-20170531_094024_35514840607102216177491.syserr
>    [junit4] >>> JVM J0 emitted unexpected output (verbatim) ----
>    [junit4] Java HotSpot(TM) Server VM warning: Option UseConcMarkSweepGC was deprecated in version 9.0 and will likely be removed in a future release.
>    [junit4] <<< JVM J0: EOF ----
>
> [...truncated 244 lines...]
>    [junit4] JVM J1: stderr was not empty, see: /home/jenkins/workspace/Lucene-Solr-6.x-Linux/lucene/build/highlighter/test/temp/junit4-J1-20170531_094031_2285997905657067029050.syserr
>    [junit4] >>> JVM J1 emitted unexpected output (verbatim) ----
>    [junit4] Java HotSpot(TM) Server VM warning: Option UseConcMarkSweepGC was deprecated in version 9.0 and will likely be removed in a future release.
>    [junit4] <<< JVM J1: EOF ----
>
> [...truncated 3 lines...]
>    [junit4] JVM J0: stderr was not empty, see: /home/jenkins/workspace/Lucene-Solr-6.x-Linux/lucene/build/highlighter/test/temp/junit4-J0-20170531_094031_2288617763404879102316.syserr
>    [junit4] >>> JVM J0 emitted unexpected output (verbatim) ----
>    [junit4] Java HotSpot(TM) Server VM warning: Option UseConcMarkSweepGC was deprecated in version 9.0 and will likely be removed in a future release.
>    [junit4] <<< JVM J0: EOF ----
>
> [...truncated 3 lines...]
>    [junit4] JVM J2: stderr was not empty, see: /home/jenkins/workspace/Lucene-Solr-6.x-Linux/lucene/build/highlighter/test/temp/junit4-J2-20170531_094031_2288165417192757360402.syserr
>    [junit4] >>> JVM J2 emitted unexpected output (verbatim) ----
>    [junit4] Java HotSpot(TM) Server VM warning: Option UseConcMarkSweepGC was deprecated in version 9.0 and will likely be removed in a future release.
>    [junit4] <<< JVM J2: EOF ----
>
> [...truncated 149 lines...]
>    [junit4] JVM J2: stderr was not empty, see: /home/jenkins/workspace/Lucene-Solr-6.x-Linux/lucene/build/join/test/temp/junit4-J2-20170531_094050_6872644110653374253486.syserr
>    [junit4] >>> JVM J2 emitted unexpected output (verbatim) ----
>    [junit4] Java HotSpot(TM) Server VM warning: Option UseConcMarkSweepGC was deprecated in version 9.0 and will likely be removed in a future release.
>    [junit4] <<< JVM J2: EOF ----
>
> [...truncated 6 lines...]
>    [junit4] JVM J0: stderr was not empty, see: /home/jenkins/workspace/Lucene-Solr-6.x-Linux/lucene/build/join/test/temp/junit4-J0-20170531_094050_68712348484123979669607.syserr
>    [junit4] >>> JVM J0 emitted unexpected output (verbatim) ----
>    [junit4] Java HotSpot(TM) Server VM warning: Option UseConcMarkSweepGC was deprecated in version 9.0 and will likely be removed in a future release.
>    [junit4] <<< JVM J0: EOF ----
>
> [...truncated 3 lines...]
>    [junit4] JVM J1: stderr was not empty, see: /home/jenkins/workspace/Lucene-Solr-6.x-Linux/lucene/build/join/test/temp/junit4-J1-20170531_094050_6874956554649712041367.syserr
>    [junit4] >>> JVM J1 emitted unexpected output (verbatim) ----
>    [junit4] Java HotSpot(TM) Server VM warning: Option UseConcMarkSweepGC was deprecated in version 9.0 and will likely be removed in a future release.
>    [junit4] <<< JVM J1: EOF ----
>
> [...truncated 143 lines...]
>    [junit4] JVM J0: stderr was not empty, see: /home/jenkins/workspace/Lucene-Solr-6.x-Linux/lucene/build/memory/test/temp/junit4-J0-20170531_094103_522801668677795426746.syserr
>    [junit4] >>> JVM J0 emitted unexpected output (verbatim) ----
>    [junit4] Java HotSpot(TM) Server VM warning: Option UseConcMarkSweepGC was deprecated in version 9.0 and will likely be removed in a future release.
>    [junit4] <<< JVM J0: EOF ----
>
> [...truncated 3 lines...]
>    [junit4] JVM J1: stderr was not empty, see: /home/jenkins/workspace/Lucene-Solr-6.x-Linux/lucene/build/memory/test/temp/junit4-J1-20170531_094103_5228458876903945167583.syserr
>    [junit4] >>> JVM J1 emitted unexpected output (verbatim) ----
>    [junit4] Java HotSpot(TM) Server VM warning: Option UseConcMarkSweepGC was deprecated in version 9.0 and will likely be removed in a future release.
>    [junit4] <<< JVM J1: EOF ----
>
> [...truncated 210 lines...]
>    [junit4] JVM J2: stderr was not empty, see: /home/jenkins/workspace/Lucene-Solr-6.x-Linux/lucene/build/misc/test/temp/junit4-J2-20170531_094112_67317534022735279949739.syserr
>    [junit4] >>> JVM J2 emitted unexpected output (verbatim) ----
>    [junit4] Java HotSpot(TM) Server VM warning: Option UseConcMarkSweepGC was deprecated in version 9.0 and will likely be removed in a future release.
>    [junit4] <<< JVM J2: EOF ----
>
> [...truncated 5 lines...]
>    [junit4] JVM J1: stderr was not empty, see: /home/jenkins/workspace/Lucene-Solr-6.x-Linux/lucene/build/misc/test/temp/junit4-J1-20170531_094112_6736902742748129747186.syserr
>    [junit4] >>> JVM J1 emitted unexpected output (verbatim) ----
>    [junit4] Java HotSpot(TM) Server VM warning: Option UseConcMarkSweepGC was deprecated in version 9.0 and will likely be removed in a future release.
>    [junit4] <<< JVM J1: EOF ----
>
> [...truncated 3 lines...]
>    [junit4] JVM J0: stderr was not empty, see: /home/jenkins/workspace/Lucene-Solr-6.x-Linux/lucene/build/misc/test/temp/junit4-J0-20170531_094112_67316042483139095737027.syserr
>    [junit4] >>> JVM J0 emitted unexpected output (verbatim) ----
>    [junit4] Java HotSpot(TM) Server VM warning: Option UseConcMarkSweepGC was deprecated in version 9.0 and will likely be removed in a future release.
>    [junit4] <<< JVM J0: EOF ----
>
> [...truncated 309 lines...]
>    [junit4] JVM J1: stderr was not empty, see: /home/jenkins/workspace/Lucene-Solr-6.x-Linux/lucene/build/queries/test/temp/junit4-J1-20170531_094131_8781083156483930445580.syserr
>    [junit4] >>> JVM J1 emitted unexpected output (verbatim) ----
>    [junit4] Java HotSpot(TM) Server VM warning: Option UseConcMarkSweepGC was deprecated in version 9.0 and will likely be removed in a future release.
>    [junit4] <<< JVM J1: EOF ----
>
> [...truncated 6 lines...]
>    [junit4] JVM J2: stderr was not empty, see: /home/jenkins/workspace/Lucene-Solr-6.x-Linux/lucene/build/queries/test/temp/junit4-J2-20170531_094131_8781267930807783450385.syserr
>    [junit4] >>> JVM J2 emitted unexpected output (verbatim) ----
>    [junit4] Java HotSpot(TM) Server VM warning: Option UseConcMarkSweepGC was deprecated in version 9.0 and will likely be removed in a future release.
>    [junit4] <<< JVM J2: EOF ----
>
>    [junit4] JVM J0: stderr was not empty, see: /home/jenkins/workspace/Lucene-Solr-6.x-Linux/lucene/build/queries/test/temp/junit4-J0-20170531_094131_8789121135995137487051.syserr
>    [junit4] >>> JVM J0 emitted unexpected output (verbatim) ----
>    [junit4] Java HotSpot(TM) Server VM warning: Option UseConcMarkSweepGC was deprecated in version 9.0 and will likely be removed in a future release.
>    [junit4] <<< JVM J0: EOF ----
>
> [...truncated 230 lines...]
>    [junit4] JVM J2: stderr was not empty, see: /home/jenkins/workspace/Lucene-Solr-6.x-Linux/lucene/build/queryparser/test/temp/junit4-J2-20170531_094138_59010357831692429545140.syserr
>    [junit4] >>> JVM J2 emitted unexpected output (verbatim) ----
>    [junit4] Java HotSpot(TM) Server VM warning: Option UseConcMarkSweepGC was deprecated in version 9.0 and will likely be removed in a future release.
>    [junit4] <<< JVM J2: EOF ----
>
>    [junit4] JVM J0: stderr was not empty, see: /home/jenkins/workspace/Lucene-Solr-6.x-Linux/lucene/build/queryparser/test/temp/junit4-J0-20170531_094138_59011067851334576699249.syserr
>    [junit4] >>> JVM J0 emitted unexpected output (verbatim) ----
>    [junit4] Java HotSpot(TM) Server VM warning: Option UseConcMarkSweepGC was deprecated in version 9.0 and will likely be removed in a future release.
>    [junit4] <<< JVM J0: EOF ----
>
> [...truncated 3 lines...]
>    [junit4] JVM J1: stderr was not empty, see: /home/jenkins/workspace/Lucene-Solr-6.x-Linux/lucene/build/queryparser/test/temp/junit4-J1-20170531_094138_59013853839280114680272.syserr
>    [junit4] >>> JVM J1 emitted unexpected output (verbatim) ----
>    [junit4] Java HotSpot(TM) Server VM warning: Option UseConcMarkSweepGC was deprecated in version 9.0 and will likely be removed in a future release.
>    [junit4] <<< JVM J1: EOF ----
>
> [...truncated 193 lines...]
>    [junit4] JVM J1: stderr was not empty, see: /home/jenkins/workspace/Lucene-Solr-6.x-Linux/lucene/build/replicator/test/temp/junit4-J1-20170531_094144_0293856304206578506122.syserr
>    [junit4] >>> JVM J1 emitted unexpected output (verbatim) ----
>    [junit4] Java HotSpot(TM) Server VM warning: Option UseConcMarkSweepGC was deprecated in version 9.0 and will likely be removed in a future release.
>    [junit4] <<< JVM J1: EOF ----
>
> [...truncated 6 lines...]
>    [junit4] JVM J2: stderr was not empty, see: /home/jenkins/workspace/Lucene-Solr-6.x-Linux/lucene/build/replicator/test/temp/junit4-J2-20170531_094144_02913281766204415765398.syserr
>    [junit4] >>> JVM J2 emitted unexpected output (verbatim) ----
>    [junit4] Java HotSpot(TM) Server VM warning: Option UseConcMarkSweepGC was deprecated in version 9.0 and will likely be removed in a future release.
>    [junit4] <<< JVM J2: EOF ----
>
> [...truncated 6 lines...]
>    [junit4] JVM J0: stderr was not empty, see: /home/jenkins/workspace/Lucene-Solr-6.x-Linux/lucene/build/replicator/test/temp/junit4-J0-20170531_094144_02917852083392609701168.syserr
>    [junit4] >>> JVM J0 emitted unexpected output (verbatim) ----
>    [junit4] Java HotSpot(TM) Server VM warning: Option UseConcMarkSweepGC was deprecated in version 9.0 and will likely be removed in a future release.
>    [junit4] <<< JVM J0: EOF ----
>
> [...truncated 203 lines...]
>    [junit4] JVM J0: stderr was not empty, see: /home/jenkins/workspace/Lucene-Solr-6.x-Linux/lucene/build/sandbox/test/temp/junit4-J0-20170531_094154_11111698187251458441497.syserr
>    [junit4] >>> JVM J0 emitted unexpected output (verbatim) ----
>    [junit4] Java HotSpot(TM) Server VM warning: Option UseConcMarkSweepGC was deprecated in version 9.0 and will likely be removed in a future release.
>    [junit4] <<< JVM J0: EOF ----
>
> [...truncated 13 lines...]
>    [junit4] JVM J1: stderr was not empty, see: /home/jenkins/workspace/Lucene-Solr-6.x-Linux/lucene/build/sandbox/test/temp/junit4-J1-20170531_094154_1119717815174543129728.syserr
>    [junit4] >>> JVM J1 emitted unexpected output (verbatim) ----
>    [junit4] Java HotSpot(TM) Server VM warning: Option UseConcMarkSweepGC was deprecated in version 9.0 and will likely be removed in a future release.
>    [junit4] <<< JVM J1: EOF ----
>
> [...truncated 3 lines...]
>    [junit4] JVM J2: stderr was not empty, see: /home/jenkins/workspace/Lucene-Solr-6.x-Linux/lucene/build/sandbox/test/temp/junit4-J2-20170531_094154_11113183399914414852411.syserr
>    [junit4] >>> JVM J2 emitted unexpected output (verbatim) ----
>    [junit4] Java HotSpot(TM) Server VM warning: Option UseConcMarkSweepGC was deprecated in version 9.0 and will likely be removed in a future release.
>    [junit4] <<< JVM J2: EOF ----
>
> [...truncated 208 lines...]
>    [junit4] JVM J0: stderr was not empty, see: /home/jenkins/workspace/Lucene-Solr-6.x-Linux/lucene/build/spatial-extras/test/temp/junit4-J0-20170531_094232_43910644259075142523881.syserr
>    [junit4] >>> JVM J0 emitted unexpected output (verbatim) ----
>    [junit4] Java HotSpot(TM) Server VM warning: Option UseConcMarkSweepGC was deprecated in version 9.0 and will likely be removed in a future release.
>    [junit4] <<< JVM J0: EOF ----
>
> [...truncated 3 lines...]
>    [junit4] JVM J2: stderr was not empty, see: /home/jenkins/workspace/Lucene-Solr-6.x-Linux/lucene/build/spatial-extras/test/temp/junit4-J2-20170531_094232_4391778219444513095461.syserr
>    [junit4] >>> JVM J2 emitted unexpected output (verbatim) ----
>    [junit4] Java HotSpot(TM) Server VM warning: Option UseConcMarkSweepGC was deprecated in version 9.0 and will likely be removed in a future release.
>    [junit4] <<< JVM J2: EOF ----
>
> [...truncated 3 lines...]
>    [junit4] JVM J1: stderr was not empty, see: /home/jenkins/workspace/Lucene-Solr-6.x-Linux/lucene/build/spatial-extras/test/temp/junit4-J1-20170531_094232_4398487315501091123042.syserr
>    [junit4] >>> JVM J1 emitted unexpected output (verbatim) ----
>    [junit4] Java HotSpot(TM) Server VM warning: Option UseConcMarkSweepGC was deprecated in version 9.0 and will likely be removed in a future release.
>    [junit4] <<< JVM J1: EOF ----
>
> [...truncated 151 lines...]
>    [junit4] JVM J0: stderr was not empty, see: /home/jenkins/workspace/Lucene-Solr-6.x-Linux/lucene/build/spatial/test/temp/junit4-J0-20170531_094241_3815119139224864844670.syserr
>    [junit4] >>> JVM J0 emitted unexpected output (verbatim) ----
>    [junit4] Java HotSpot(TM) Server VM warning: Option UseConcMarkSweepGC was deprecated in version 9.0 and will likely be removed in a future release.
>    [junit4] <<< JVM J0: EOF ----
>
> [...truncated 7 lines...]
>    [junit4] JVM J2: stderr was not empty, see: /home/jenkins/workspace/Lucene-Solr-6.x-Linux/lucene/build/spatial/test/temp/junit4-J2-20170531_094241_381299830338076254243.syserr
>    [junit4] >>> JVM J2 emitted unexpected output (verbatim) ----
>    [junit4] Java HotSpot(TM) Server VM warning: Option UseConcMarkSweepGC was deprecated in version 9.0 and will likely be removed in a future release.
>    [junit4] <<< JVM J2: EOF ----
>
> [...truncated 11 lines...]
>    [junit4] JVM J1: stderr was not empty, see: /home/jenkins/workspace/Lucene-Solr-6.x-Linux/lucene/build/spatial/test/temp/junit4-J1-20170531_094241_38112600153529859336675.syserr
>    [junit4] >>> JVM J1 emitted unexpected output (verbatim) ----
>    [junit4] Java HotSpot(TM) Server VM warning: Option UseConcMarkSweepGC was deprecated in version 9.0 and will likely be removed in a future release.
>    [junit4] <<< JVM J1: EOF ----
>
> [...truncated 164 lines...]
>    [junit4] JVM J0: stderr was not empty, see: /home/jenkins/workspace/Lucene-Solr-6.x-Linux/lucene/build/spatial3d/test/temp/junit4-J0-20170531_094319_20416759961187815529417.syserr
>    [junit4] >>> JVM J0 emitted unexpected output (verbatim) ----
>    [junit4] Java HotSpot(TM) Server VM warning: Option UseConcMarkSweepGC was deprecated in version 9.0 and will likely be removed in a future release.
>    [junit4] <<< JVM J0: EOF ----
>
>    [junit4] JVM J2: stderr was not empty, see: /home/jenkins/workspace/Lucene-Solr-6.x-Linux/lucene/build/spatial3d/test/temp/junit4-J2-20170531_094319_20410024343240869489847.syserr
>    [junit4] >>> JVM J2 emitted unexpected output (verbatim) ----
>    [junit4] Java HotSpot(TM) Server VM warning: Option UseConcMarkSweepGC was deprecated in version 9.0 and will likely be removed in a future release.
>    [junit4] <<< JVM J2: EOF ----
>
> [...truncated 5 lines...]
>    [junit4] JVM J1: stderr was not empty, see: /home/jenkins/workspace/Lucene-Solr-6.x-Linux/lucene/build/spatial3d/test/temp/junit4-J1-20170531_094319_20414636471685091123470.syserr
>    [junit4] >>> JVM J1 emitted unexpected output (verbatim) ----
>    [junit4] Java HotSpot(TM) Server VM warning: Option UseConcMarkSweepGC was deprecated in version 9.0 and will likely be removed in a future release.
>    [junit4] <<< JVM J1: EOF ----
>
> [...truncated 305 lines...]
>    [junit4] JVM J2: stderr was not empty, see: /home/jenkins/workspace/Lucene-Solr-6.x-Linux/lucene/build/suggest/test/temp/junit4-J2-20170531_094432_51014324127383486379867.syserr
>    [junit4] >>> JVM J2 emitted unexpected output (verbatim) ----
>    [junit4] Java HotSpot(TM) Server VM warning: Option UseConcMarkSweepGC was deprecated in version 9.0 and will likely be removed in a future release.
>    [junit4] <<< JVM J2: EOF ----
>
> [...truncated 3 lines...]
>    [junit4] JVM J0: stderr was not empty, see: /home/jenkins/workspace/Lucene-Solr-6.x-Linux/lucene/build/suggest/test/temp/junit4-J0-20170531_094432_5104874424074735873241.syserr
>    [junit4] >>> JVM J0 emitted unexpected output (verbatim) ----
>    [junit4] Java HotSpot(TM) Server VM warning: Option UseConcMarkSweepGC was deprecated in version 9.0 and will likely be removed in a future release.
>    [junit4] <<< JVM J0: EOF ----
>
> [...truncated 3 lines...]
>    [junit4] JVM J1: stderr was not empty, see: /home/jenkins/workspace/Lucene-Solr-6.x-Linux/lucene/build/suggest/test/temp/junit4-J1-20170531_094432_5102107958979306235757.syserr
>    [junit4] >>> JVM J1 emitted unexpected output (verbatim) ----
>    [junit4] Java HotSpot(TM) Server VM warning: Option UseConcMarkSweepGC was deprecated in version 9.0 and will likely be removed in a future release.
>    [junit4] <<< JVM J1: EOF ----
>
> [...truncated 1921 lines...]
>    [junit4] Suite: org.apache.solr.util.TestMaxTokenLenTokenizer
>    [junit4]   2> Creating dataDir: /home/jenkins/workspace/Lucene-Solr-6.x-Linux/solr/build/solr-core/test/J1/temp/solr.util.TestMaxTokenLenTokenizer_6A12DFC046B6CA7B-001/init-core-data-001
>    [junit4]   2> 573174 WARN  (SUITE-TestMaxTokenLenTokenizer-seed#[6A12DFC046B6CA7B]-worker) [    ] o.a.s.SolrTestCaseJ4 startTrackingSearchers: numOpens=13 numCloses=13
>    [junit4]   2> 573174 INFO  (SUITE-TestMaxTokenLenTokenizer-seed#[6A12DFC046B6CA7B]-worker) [    ] o.a.s.SolrTestCaseJ4 Using TrieFields
>    [junit4]   2> 573175 INFO  (SUITE-TestMaxTokenLenTokenizer-seed#[6A12DFC046B6CA7B]-worker) [    ] o.a.s.SolrTestCaseJ4 Randomized ssl (true) and clientAuth (true) via: @org.apache.solr.util.RandomizeSSL(reason="", ssl=0.0/0.0, value=0.0/0.0, clientAuth=0.0/0.0)
>    [junit4]   2> 573175 INFO  (SUITE-TestMaxTokenLenTokenizer-seed#[6A12DFC046B6CA7B]-worker) [    ] o.a.s.SolrTestCaseJ4 ####initCore
>    [junit4]   2> 573176 INFO  (SUITE-TestMaxTokenLenTokenizer-seed#[6A12DFC046B6CA7B]-worker) [    ] o.a.s.c.SolrResourceLoader [null] Added 2 libs to classloader, from paths: [/home/jenkins/workspace/Lucene-Solr-6.x-Linux/solr/core/src/test-files/solr/collection1/lib, /home/jenkins/workspace/Lucene-Solr-6.x-Linux/solr/core/src/test-files/solr/collection1/lib/classes]
>    [junit4]   2> 573192 WARN  (SUITE-TestMaxTokenLenTokenizer-seed#[6A12DFC046B6CA7B]-worker) [    ] o.a.s.c.Config Beginning with Solr 5.5, <mergePolicy> is deprecated, use <mergePolicyFactory> instead.
>    [junit4]   2> 573194 INFO  (SUITE-TestMaxTokenLenTokenizer-seed#[6A12DFC046B6CA7B]-worker) [    ] o.a.s.c.SolrConfig Using Lucene MatchVersion: 6.7.0
>    [junit4]   2> 573212 INFO  (SUITE-TestMaxTokenLenTokenizer-seed#[6A12DFC046B6CA7B]-worker) [    ] o.a.s.s.IndexSchema [null] Schema name=test
>    [junit4]   2> 573219 INFO  (SUITE-TestMaxTokenLenTokenizer-seed#[6A12DFC046B6CA7B]-worker) [    ] o.a.s.s.IndexSchema Loaded schema test/1.0 with uniqueid field id
>    [junit4]   2> 573221 INFO  (SUITE-TestMaxTokenLenTokenizer-seed#[6A12DFC046B6CA7B]-worker) [    ] o.a.s.u.UpdateShardHandler Creating UpdateShardHandler HTTP client with params: socketTimeout=30000&connTimeout=30000&retry=true
>    [junit4]   2> 573236 INFO  (SUITE-TestMaxTokenLenTokenizer-seed#[6A12DFC046B6CA7B]-worker) [    ] o.a.s.m.r.SolrJmxReporter JMX monitoring for 'solr.node' (registry 'solr.node') enabled at server: com.sun.jmx.mbeanserver.JmxMBeanServer@19bcd92
>    [junit4]   2> 573238 INFO  (SUITE-TestMaxTokenLenTokenizer-seed#[6A12DFC046B6CA7B]-worker) [    ] o.a.s.m.r.SolrJmxReporter JMX monitoring for 'solr.jvm' (registry 'solr.jvm') enabled at server: com.sun.jmx.mbeanserver.JmxMBeanServer@19bcd92
>    [junit4]   2> 573238 INFO  (SUITE-TestMaxTokenLenTokenizer-seed#[6A12DFC046B6CA7B]-worker) [    ] o.a.s.m.r.SolrJmxReporter JMX monitoring for 'solr.jetty' (registry 'solr.jetty') enabled at server: com.sun.jmx.mbeanserver.JmxMBeanServer@19bcd92
>    [junit4]   2> 573239 INFO  (coreLoadExecutor-1778-thread-1) [    ] o.a.s.c.SolrResourceLoader [null] Added 2 libs to classloader, from paths: [/home/jenkins/workspace/Lucene-Solr-6.x-Linux/solr/core/src/test-files/solr/collection1/lib, /home/jenkins/workspace/Lucene-Solr-6.x-Linux/solr/core/src/test-files/solr/collection1/lib/classes]
>    [junit4]   2> 573258 WARN  (coreLoadExecutor-1778-thread-1) [    ] o.a.s.c.Config Beginning with Solr 5.5, <mergePolicy> is deprecated, use <mergePolicyFactory> instead.
>    [junit4]   2> 573259 INFO  (coreLoadExecutor-1778-thread-1) [    ] o.a.s.c.SolrConfig Using Lucene MatchVersion: 6.7.0
>    [junit4]   2> 573288 INFO  (coreLoadExecutor-1778-thread-1) [    ] o.a.s.s.IndexSchema [collection1] Schema name=test
>    [junit4]   2> 573303 INFO  (coreLoadExecutor-1778-thread-1) [    ] o.a.s.s.IndexSchema Loaded schema test/1.0 with uniqueid field id
>    [junit4]   2> 573303 INFO  (coreLoadExecutor-1778-thread-1) [    ] o.a.s.c.CoreContainer Creating SolrCore 'collection1' using configuration from instancedir /home/jenkins/workspace/Lucene-Solr-6.x-Linux/solr/core/src/test-files/solr/collection1, trusted=true
>    [junit4]   2> 573304 INFO  (coreLoadExecutor-1778-thread-1) [    ] o.a.s.m.r.SolrJmxReporter JMX monitoring for 'solr.core.collection1' (registry 'solr.core.collection1') enabled at server: com.sun.jmx.mbeanserver.JmxMBeanServer@19bcd92
>    [junit4]   2> 573304 INFO  (coreLoadExecutor-1778-thread-1) [    ] o.a.s.c.SolrCore solr.RecoveryStrategy.Builder
>    [junit4]   2> 573304 INFO  (coreLoadExecutor-1778-thread-1) [    ] o.a.s.c.SolrCore [[collection1] ] Opening new SolrCore at [/home/jenkins/workspace/Lucene-Solr-6.x-Linux/solr/core/src/test-files/solr/collection1], dataDir=[/home/jenkins/workspace/Lucene-Solr-6.x-Linux/solr/build/solr-core/test/J1/temp/solr.util.TestMaxTokenLenTokenizer_6A12DFC046B6CA7B-001/init-core-data-001/]
>    [junit4]   2> 573305 INFO  (coreLoadExecutor-1778-thread-1) [    ] o.a.s.u.RandomMergePolicy RandomMergePolicy wrapping class org.apache.lucene.index.LogByteSizeMergePolicy: [LogByteSizeMergePolicy: minMergeSize=1677721, mergeFactor=17, maxMergeSize=2147483648, maxMergeSizeForForcedMerge=9223372036854775807, calibrateSizeByDeletes=false, maxMergeDocs=2147483647, maxCFSSegmentSizeMB=8.796093022207999E12, noCFSRatio=0.15007102874080902]
>    [junit4]   2> 573346 INFO  (coreLoadExecutor-1778-thread-1) [    ] o.a.s.u.CommitTracker Hard AutoCommit: disabled
>    [junit4]   2> 573346 INFO  (coreLoadExecutor-1778-thread-1) [    ] o.a.s.u.CommitTracker Soft AutoCommit: disabled
>    [junit4]   2> 573347 INFO  (coreLoadExecutor-1778-thread-1) [    ] o.a.s.u.RandomMergePolicy RandomMergePolicy wrapping class org.apache.lucene.index.LogDocMergePolicy: [LogDocMergePolicy: minMergeSize=1000, mergeFactor=11, maxMergeSize=9223372036854775807, maxMergeSizeForForcedMerge=9223372036854775807, calibrateSizeByDeletes=true, maxMergeDocs=2147483647, maxCFSSegmentSizeMB=8.796093022207999E12, noCFSRatio=0.0]
>    [junit4]   2> 573347 INFO  (coreLoadExecutor-1778-thread-1) [    ] o.a.s.s.SolrIndexSearcher Opening [Searcher@c910df[collection1] main]
>    [junit4]   2> 573348 WARN  (coreLoadExecutor-1778-thread-1) [    ] o.a.s.r.ManagedResourceStorage Cannot write to config directory /home/jenkins/workspace/Lucene-Solr-6.x-Linux/solr/core/src/test-files/solr/collection1/conf; switching to use InMemory storage instead.
>    [junit4]   2> 573348 INFO  (coreLoadExecutor-1778-thread-1) [    ] o.a.s.h.ReplicationHandler Commits will be reserved for  10000
>    [junit4]   2> 573348 INFO  (searcherExecutor-1779-thread-1) [    ] o.a.s.c.SolrCore [collection1] Registered new searcher Searcher@c910df[collection1] main{ExitableDirectoryReader(UninvertingDirectoryReader())}
>    [junit4]   2> 573349 INFO  (SUITE-TestMaxTokenLenTokenizer-seed#[6A12DFC046B6CA7B]-worker) [    ] o.a.s.SolrTestCaseJ4 ####initCore end
>    [junit4]   2> 573350 INFO  (TEST-TestMaxTokenLenTokenizer.testSingleFieldSameAnalyzers-seed#[6A12DFC046B6CA7B]) [    ] o.a.s.SolrTestCaseJ4 ###Starting testSingleFieldSameAnalyzers
>    [junit4]   2> 573350 INFO  (TEST-TestMaxTokenLenTokenizer.testSingleFieldSameAnalyzers-seed#[6A12DFC046B6CA7B]) [    ] o.a.s.u.DirectUpdateHandler2 [collection1] REMOVING ALL DOCUMENTS FROM INDEX
>    [junit4]   2> 573350 INFO  (TEST-TestMaxTokenLenTokenizer.testSingleFieldSameAnalyzers-seed#[6A12DFC046B6CA7B]) [    ] o.a.s.u.p.LogUpdateProcessorFactory [collection1]  webapp=null path=null params={_version_=-9223372036854775807&update.distrib=FROMLEADER&versions=true&wt=json&indent=true}{deleteByQuery=*:*} 0 0
>    [junit4]   2> 573351 INFO  (TEST-TestMaxTokenLenTokenizer.testSingleFieldSameAnalyzers-seed#[6A12DFC046B6CA7B]) [    ] o.a.s.u.DirectUpdateHandler2 start commit{,optimize=false,openSearcher=true,waitSearcher=true,expungeDeletes=false,softCommit=false,prepareCommit=false}
>    [junit4]   2> 573351 INFO  (TEST-TestMaxTokenLenTokenizer.testSingleFieldSameAnalyzers-seed#[6A12DFC046B6CA7B]) [    ] o.a.s.u.SolrIndexWriter Calling setCommitData with IW:org.apache.solr.update.SolrIndexWriter@a17117
>    [junit4]   2> 573355 INFO  (TEST-TestMaxTokenLenTokenizer.testSingleFieldSameAnalyzers-seed#[6A12DFC046B6CA7B]) [    ] o.a.s.s.SolrIndexSearcher Opening [Searcher@1b59e2e[collection1] main]
>    [junit4]   2> 573355 INFO  (TEST-TestMaxTokenLenTokenizer.testSingleFieldSameAnalyzers-seed#[6A12DFC046B6CA7B]) [    ] o.a.s.u.DirectUpdateHandler2 end_commit_flush
>    [junit4]   2> 573355 INFO  (searcherExecutor-1779-thread-1) [    ] o.a.s.c.SolrCore [collection1] Registered new searcher Searcher@1b59e2e[collection1] main{ExitableDirectoryReader(UninvertingDirectoryReader(Uninverting(_0(6.7.0):C1)))}
>    [junit4]   2> 573355 INFO  (TEST-TestMaxTokenLenTokenizer.testSingleFieldSameAnalyzers-seed#[6A12DFC046B6CA7B]) [    ] o.a.s.u.p.LogUpdateProcessorFactory [collection1]  webapp=null path=null params={wt=json&indent=true}{add=[1],commit=} 0 5
>    [junit4]   2> 573356 INFO  (TEST-TestMaxTokenLenTokenizer.testSingleFieldSameAnalyzers-seed#[6A12DFC046B6CA7B]) [    ] o.a.s.u.DirectUpdateHandler2 start commit{,optimize=false,openSearcher=true,waitSearcher=true,expungeDeletes=false,softCommit=false,prepareCommit=false}
>    [junit4]   2> 573356 INFO  (TEST-TestMaxTokenLenTokenizer.testSingleFieldSameAnalyzers-seed#[6A12DFC046B6CA7B]) [    ] o.a.s.u.SolrIndexWriter Calling setCommitData with IW:org.apache.solr.update.SolrIndexWriter@a17117
>    [junit4]   2> 573359 INFO  (TEST-TestMaxTokenLenTokenizer.testSingleFieldSameAnalyzers-seed#[6A12DFC046B6CA7B]) [    ] o.a.s.s.SolrIndexSearcher Opening [Searcher@1af70c9[collection1] main]
>    [junit4]   2> 573360 INFO  (TEST-TestMaxTokenLenTokenizer.testSingleFieldSameAnalyzers-seed#[6A12DFC046B6CA7B]) [    ] o.a.s.u.DirectUpdateHandler2 end_commit_flush
>    [junit4]   2> 573360 INFO  (searcherExecutor-1779-thread-1) [    ] o.a.s.c.SolrCore [collection1] Registered new searcher Searcher@1af70c9[collection1] main{ExitableDirectoryReader(UninvertingDirectoryReader(Uninverting(_0(6.7.0):C1) Uninverting(_1(6.7.0):C1)))}
>    [junit4]   2> 573360 INFO  (TEST-TestMaxTokenLenTokenizer.testSingleFieldSameAnalyzers-seed#[6A12DFC046B6CA7B]) [    ] o.a.s.u.p.LogUpdateProcessorFactory [collection1]  webapp=null path=null params={wt=json&indent=true}{add=[2],commit=} 0 4
>    [junit4]   2> 573361 INFO  (TEST-TestMaxTokenLenTokenizer.testSingleFieldSameAnalyzers-seed#[6A12DFC046B6CA7B]) [    ] o.a.s.u.DirectUpdateHandler2 start commit{,optimize=false,openSearcher=true,waitSearcher=true,expungeDeletes=false,softCommit=false,prepareCommit=false}
>    [junit4]   2> 573361 INFO  (TEST-TestMaxTokenLenTokenizer.testSingleFieldSameAnalyzers-seed#[6A12DFC046B6CA7B]) [    ] o.a.s.u.SolrIndexWriter Calling setCommitData with IW:org.apache.solr.update.SolrIndexWriter@a17117
>    [junit4]   2> 573367 INFO  (TEST-TestMaxTokenLenTokenizer.testSingleFieldSameAnalyzers-seed#[6A12DFC046B6CA7B]) [    ] o.a.s.s.SolrIndexSearcher Opening [Searcher@a0ff2a[collection1] main]
>    [junit4]   2> 573367 INFO  (TEST-TestMaxTokenLenTokenizer.testSingleFieldSameAnalyzers-seed#[6A12DFC046B6CA7B]) [    ] o.a.s.u.DirectUpdateHandler2 end_commit_flush
>    [junit4]   2> 573368 INFO  (searcherExecutor-1779-thread-1) [    ] o.a.s.c.SolrCore [collection1] Registered new searcher Searcher@a0ff2a[collection1] main{ExitableDirectoryReader(UninvertingDirectoryReader(Uninverting(_0(6.7.0):C1) Uninverting(_1(6.7.0):C1) Uninverting(_2(6.7.0):C1)))}
>    [junit4]   2> 573368 INFO  (TEST-TestMaxTokenLenTokenizer.testSingleFieldSameAnalyzers-seed#[6A12DFC046B6CA7B]) [    ] o.a.s.u.p.LogUpdateProcessorFactory [collection1]  webapp=null path=null params={wt=json&indent=true}{add=[3],commit=} 0 7
>    [junit4]   2> 573368 INFO  (TEST-TestMaxTokenLenTokenizer.testSingleFieldSameAnalyzers-seed#[6A12DFC046B6CA7B]) [    ] o.a.s.u.DirectUpdateHandler2 start commit{,optimize=false,openSearcher=true,waitSearcher=true,expungeDeletes=false,softCommit=false,prepareCommit=false}
>    [junit4]   2> 573368 INFO  (TEST-TestMaxTokenLenTokenizer.testSingleFieldSameAnalyzers-seed#[6A12DFC046B6CA7B]) [    ] o.a.s.u.SolrIndexWriter Calling setCommitData with IW:org.apache.solr.update.SolrIndexWriter@a17117
>    [junit4]   2> 573375 INFO  (TEST-TestMaxTokenLenTokenizer.testSingleFieldSameAnalyzers-seed#[6A12DFC046B6CA7B]) [    ] o.a.s.s.SolrIndexSearcher Opening [Searcher@171eaa7[collection1] main]
>    [junit4]   2> 573376 INFO  (TEST-TestMaxTokenLenTokenizer.testSingleFieldSameAnalyzers-seed#[6A12DFC046B6CA7B]) [    ] o.a.s.u.DirectUpdateHandler2 end_commit_flush
>    [junit4]   2> 573376 INFO  (searcherExecutor-1779-thread-1) [    ] o.a.s.c.SolrCore [collection1] Registered new searcher Searcher@171eaa7[collection1] main{ExitableDirectoryReader(UninvertingDirectoryReader(Uninverting(_0(6.7.0):C1) Uninverting(_1(6.7.0):C1) Uninverting(_2(6.7.0):C1) Uninverting(_3(6.7.0):C1)))}
>    [junit4]   2> 573376 INFO  (TEST-TestMaxTokenLenTokenizer.testSingleFieldSameAnalyzers-seed#[6A12DFC046B6CA7B]) [    ] o.a.s.u.p.LogUpdateProcessorFactory [collection1]  webapp=null path=null params={wt=json&indent=true}{add=[4],commit=} 0 8
>    [junit4]   2> 573377 INFO  (TEST-TestMaxTokenLenTokenizer.testSingleFieldSameAnalyzers-seed#[6A12DFC046B6CA7B]) [    ] o.a.s.u.DirectUpdateHandler2 start commit{,optimize=false,openSearcher=true,waitSearcher=true,expungeDeletes=false,softCommit=false,prepareCommit=false}
>    [junit4]   2> 573377 INFO  (TEST-TestMaxTokenLenTokenizer.testSingleFieldSameAnalyzers-seed#[6A12DFC046B6CA7B]) [    ] o.a.s.u.SolrIndexWriter Calling setCommitData with IW:org.apache.solr.update.SolrIndexWriter@a17117
>    [junit4]   2> 573384 INFO  (TEST-TestMaxTokenLenTokenizer.testSingleFieldSameAnalyzers-seed#[6A12DFC046B6CA7B]) [    ] o.a.s.s.SolrIndexSearcher Opening [Searcher@3773ec[collection1] main]
>    [junit4]   2> 573384 INFO  (TEST-TestMaxTokenLenTokenizer.testSingleFieldSameAnalyzers-seed#[6A12DFC046B6CA7B]) [    ] o.a.s.u.DirectUpdateHandler2 end_commit_flush
>    [junit4]   2> 573385 INFO  (searcherExecutor-1779-thread-1) [    ] o.a.s.c.SolrCore [collection1] Registered new searcher Searcher@3773ec[collection1] main{ExitableDirectoryReader(UninvertingDirectoryReader(Uninverting(_0(6.7.0):C1) Uninverting(_1(6.7.0):C1) Uninverting(_2(6.7.0):C1) Uninverting(_3(6.7.0):C1) Uninverting(_4(6.7.0):C1)))}
>    [junit4]   2> 573385 INFO  (TEST-TestMaxTokenLenTokenizer.testSingleFieldSameAnalyzers-seed#[6A12DFC046B6CA7B]) [    ] o.a.s.u.p.LogUpdateProcessorFactory [collection1]  webapp=null path=null params={wt=json&indent=true}{add=[5],commit=} 0 8
>    [junit4]   2> 573385 INFO  (TEST-TestMaxTokenLenTokenizer.testSingleFieldSameAnalyzers-seed#[6A12DFC046B6CA7B]) [    ] o.a.s.u.DirectUpdateHandler2 start commit{,optimize=false,openSearcher=true,waitSearcher=true,expungeDeletes=false,softCommit=false,prepareCommit=false}
>    [junit4]   2> 573385 INFO  (TEST-TestMaxTokenLenTokenizer.testSingleFieldSameAnalyzers-seed#[6A12DFC046B6CA7B]) [    ] o.a.s.u.DirectUpdateHandler2 No uncommitted changes. Skipping IW.commit.
>    [junit4]   2> 573385 INFO  (TEST-TestMaxTokenLenTokenizer.testSingleFieldSameAnalyzers-seed#[6A12DFC046B6CA7B]) [    ] o.a.s.u.DirectUpdateHandler2 end_commit_flush
>    [junit4]   2> 573385 INFO  (TEST-TestMaxTokenLenTokenizer.testSingleFieldSameAnalyzers-seed#[6A12DFC046B6CA7B]) [    ] o.a.s.u.p.LogUpdateProcessorFactory [collection1]  webapp=null path=null params={}{commit=} 0 0
>    [junit4]   2> 573386 INFO  (TEST-TestMaxTokenLenTokenizer.testSingleFieldSameAnalyzers-seed#[6A12DFC046B6CA7B]) [    ] o.a.s.c.S.Request [collection1]  webapp=null path=null params={q=*:*&wt=xml} hits=5 status=0 QTime=0
>    [junit4]   2> 573387 INFO  (TEST-TestMaxTokenLenTokenizer.testSingleFieldSameAnalyzers-seed#[6A12DFC046B6CA7B]) [    ] o.a.s.c.S.Request [collection1]  webapp=null path=null params={q=letter0:l&wt=xml} hits=0 status=0 QTime=0
>    [junit4]   2> 573387 INFO  (TEST-TestMaxTokenLenTokenizer.testSingleFieldSameAnalyzers-seed#[6A12DFC046B6CA7B]) [    ] o.a.s.c.S.Request [collection1]  webapp=null path=null params={q=letter0:let&wt=xml} hits=1 status=0 QTime=0
>    [junit4]   2> 573388 INFO  (TEST-TestMaxTokenLenTokenizer.testSingleFieldSameAnalyzers-seed#[6A12DFC046B6CA7B]) [    ] o.a.s.c.S.Request [collection1]  webapp=null path=null params={q=letter0:lett&wt=xml} hits=0 status=0 QTime=0
>    [junit4]   2> 573388 ERROR (TEST-TestMaxTokenLenTokenizer.testSingleFieldSameAnalyzers-seed#[6A12DFC046B6CA7B]) [    ] o.a.s.SolrTestCaseJ4 REQUEST FAILED: xpath=//result[@numFound=1]
>    [junit4]   2>        xml response was: <?xml version="1.0" encoding="UTF-8"?>
>    [junit4]   2> <response>
>    [junit4]   2> <lst name="responseHeader"><int name="status">0</int><int name="QTime">0</int></lst><result name="response" numFound="0" start="0"></result>
>    [junit4]   2> </response>
>    [junit4]   2>
>    [junit4]   2>        request was:q=letter0:lett&wt=xml
>    [junit4]   2> 573388 ERROR (TEST-TestMaxTokenLenTokenizer.testSingleFieldSameAnalyzers-seed#[6A12DFC046B6CA7B]) [    ] o.a.s.SolrTestCaseJ4 REQUEST FAILED: q=letter0:lett&wt=xml:java.lang.RuntimeException: REQUEST FAILED: xpath=//result[@numFound=1]
>    [junit4]   2>        xml response was: <?xml version="1.0" encoding="UTF-8"?>
>    [junit4]   2> <response>
>    [junit4]   2> <lst name="responseHeader"><int name="status">0</int><int name="QTime">0</int></lst><result name="response" numFound="0" start="0"></result>
>    [junit4]   2> </response>
>    [junit4]   2>
>    [junit4]   2>        request was:q=letter0:lett&wt=xml
>    [junit4]   2>        at org.apache.solr.SolrTestCaseJ4.assertQ(SolrTestCaseJ4.java:888)
>    [junit4]   2>        at org.apache.solr.util.TestMaxTokenLenTokenizer.testSingleFieldSameAnalyzers(TestMaxTokenLenTokenizer.java:104)
>    [junit4]   2>        at java.base/jdk.internal.reflect.NativeMethodAccessorImpl.invoke0(Native Method)
>    [junit4]   2>        at java.base/jdk.internal.reflect.NativeMethodAccessorImpl.invoke(NativeMethodAccessorImpl.java:62)
>    [junit4]   2>        at java.base/jdk.internal.reflect.DelegatingMethodAccessorImpl.invoke(DelegatingMethodAccessorImpl.java:43)
>    [junit4]   2>        at java.base/java.lang.reflect.Method.invoke(Method.java:563)
>    [junit4]   2>        at com.carrotsearch.randomizedtesting.RandomizedRunner.invoke(RandomizedRunner.java:1713)
>    [junit4]   2>        at com.carrotsearch.randomizedtesting.RandomizedRunner$8.evaluate(RandomizedRunner.java:907)
>    [junit4]   2>        at com.carrotsearch.randomizedtesting.RandomizedRunner$9.evaluate(RandomizedRunner.java:943)
>    [junit4]   2>        at com.carrotsearch.randomizedtesting.RandomizedRunner$10.evaluate(RandomizedRunner.java:957)
>    [junit4]   2>        at com.carrotsearch.randomizedtesting.rules.SystemPropertiesRestoreRule$1.evaluate(SystemPropertiesRestoreRule.java:57)
>    [junit4]   2>        at org.apache.lucene.util.TestRuleSetupTeardownChained$1.evaluate(TestRuleSetupTeardownChained.java:49)
>    [junit4]   2>        at org.apache.lucene.util.AbstractBeforeAfterRule$1.evaluate(AbstractBeforeAfterRule.java:45)
>    [junit4]   2>        at org.apache.lucene.util.TestRuleThreadAndTestName$1.evaluate(TestRuleThreadAndTestName.java:48)
>    [junit4]   2>        at org.apache.lucene.util.TestRuleIgnoreAfterMaxFailures$1.evaluate(TestRuleIgnoreAfterMaxFailures.java:64)
>    [junit4]   2>        at org.apache.lucene.util.TestRuleMarkFailure$1.evaluate(TestRuleMarkFailure.java:47)
>    [junit4]   2>        at com.carrotsearch.randomizedtesting.rules.StatementAdapter.evaluate(StatementAdapter.java:36)
>    [junit4]   2>        at com.carrotsearch.randomizedtesting.ThreadLeakControl$StatementRunner.run(ThreadLeakControl.java:368)
>    [junit4]   2>        at com.carrotsearch.randomizedtesting.ThreadLeakControl.forkTimeoutingTask(ThreadLeakControl.java:817)
>    [junit4]   2>        at com.carrotsearch.randomizedtesting.ThreadLeakControl$3.evaluate(ThreadLeakControl.java:468)
>    [junit4]   2>        at com.carrotsearch.randomizedtesting.RandomizedRunner.runSingleTest(RandomizedRunner.java:916)
>    [junit4]   2>        at com.carrotsearch.randomizedtesting.RandomizedRunner$5.evaluate(RandomizedRunner.java:802)
>    [junit4]   2>        at com.carrotsearch.randomizedtesting.RandomizedRunner$6.evaluate(RandomizedRunner.java:852)
>    [junit4]   2>        at com.carrotsearch.randomizedtesting.RandomizedRunner$7.evaluate(RandomizedRunner.java:863)
>    [junit4]   2>        at com.carrotsearch.randomizedtesting.rules.StatementAdapter.evaluate(StatementAdapter.java:36)
>    [junit4]   2>        at com.carrotsearch.randomizedtesting.rules.SystemPropertiesRestoreRule$1.evaluate(SystemPropertiesRestoreRule.java:57)
>    [junit4]   2>        at org.apache.lucene.util.AbstractBeforeAfterRule$1.evaluate(AbstractBeforeAfterRule.java:45)
>    [junit4]   2>        at com.carrotsearch.randomizedtesting.rules.StatementAdapter.evaluate(StatementAdapter.java:36)
>    [junit4]   2>        at org.apache.lucene.util.TestRuleStoreClassName$1.evaluate(TestRuleStoreClassName.java:41)
>    [junit4]   2>        at com.carrotsearch.randomizedtesting.rules.NoShadowingOrOverridesOnMethodsRule$1.evaluate(NoShadowingOrOverridesOnMethodsRule.java:40)
>    [junit4]   2>        at com.carrotsearch.randomizedtesting.rules.NoShadowingOrOverridesOnMethodsRule$1.evaluate(NoShadowingOrOverridesOnMethodsRule.java:40)
>    [junit4]   2>        at com.carrotsearch.randomizedtesting.rules.StatementAdapter.evaluate(StatementAdapter.java:36)
>    [junit4]   2>        at com.carrotsearch.randomizedtesting.rules.StatementAdapter.evaluate(StatementAdapter.java:36)
>    [junit4]   2>        at org.apache.lucene.util.TestRuleAssertionsRequired$1.evaluate(TestRuleAssertionsRequired.java:53)
>    [junit4]   2>        at org.apache.lucene.util.TestRuleMarkFailure$1.evaluate(TestRuleMarkFailure.java:47)
>    [junit4]   2>        at org.apache.lucene.util.TestRuleIgnoreAfterMaxFailures$1.evaluate(TestRuleIgnoreAfterMaxFailures.java:64)
>    [junit4]   2>        at org.apache.lucene.util.TestRuleIgnoreTestSuites$1.evaluate(TestRuleIgnoreTestSuites.java:54)
>    [junit4]   2>        at com.carrotsearch.randomizedtesting.rules.StatementAdapter.evaluate(StatementAdapter.java:36)
>    [junit4]   2>        at com.carrotsearch.randomizedtesting.ThreadLeakControl$StatementRunner.run(ThreadLeakControl.java:368)
>    [junit4]   2>        at java.base/java.lang.Thread.run(Thread.java:844)
>    [junit4]   2>
>    [junit4]   2> 573389 INFO  (TEST-TestMaxTokenLenTokenizer.testSingleFieldSameAnalyzers-seed#[6A12DFC046B6CA7B]) [    ] o.a.s.SolrTestCaseJ4 ###Ending testSingleFieldSameAnalyzers
>    [junit4]   2> NOTE: reproduce with: ant test  -Dtestcase=TestMaxTokenLenTokenizer -Dtests.method=testSingleFieldSameAnalyzers -Dtests.seed=6A12DFC046B6CA7B -Dtests.multiplier=3 -Dtests.slow=true -Dtests.locale=fo -Dtests.timezone=America/Indiana/Indianapolis -Dtests.asserts=true -Dtests.file.encoding=ISO-8859-1
>    [junit4] ERROR   0.04s J1 | TestMaxTokenLenTokenizer.testSingleFieldSameAnalyzers <<<
>    [junit4]    > Throwable #1: java.lang.RuntimeException: Exception during query
>    [junit4]    >        at __randomizedtesting.SeedInfo.seed([6A12DFC046B6CA7B:C0E0AF1E551AB4]:0)
>    [junit4]    >        at org.apache.solr.SolrTestCaseJ4.assertQ(SolrTestCaseJ4.java:895)
>    [junit4]    >        at org.apache.solr.util.TestMaxTokenLenTokenizer.testSingleFieldSameAnalyzers(TestMaxTokenLenTokenizer.java:104)
>    [junit4]    >        at java.base/jdk.internal.reflect.NativeMethodAccessorImpl.invoke0(Native Method)
>    [junit4]    >        at java.base/jdk.internal.reflect.NativeMethodAccessorImpl.invoke(NativeMethodAccessorImpl.java:62)
>    [junit4]    >        at java.base/jdk.internal.reflect.DelegatingMethodAccessorImpl.invoke(DelegatingMethodAccessorImpl.java:43)
>    [junit4]    >        at java.base/java.lang.reflect.Method.invoke(Method.java:563)
>    [junit4]    >        at java.base/java.lang.Thread.run(Thread.java:844)
>    [junit4]    > Caused by: java.lang.RuntimeException: REQUEST FAILED: xpath=//result[@numFound=1]
>    [junit4]    >        xml response was: <?xml version="1.0" encoding="UTF-8"?>
>    [junit4]    > <response>
>    [junit4]    > <lst name="responseHeader"><int name="status">0</int><int name="QTime">0</int></lst><result name="response" numFound="0" start="0"></result>
>    [junit4]    > </response>
>    [junit4]    >        request was:q=letter0:lett&wt=xml
>    [junit4]    >        at org.apache.solr.SolrTestCaseJ4.assertQ(SolrTestCaseJ4.java:888)
>    [junit4]    >        ... 39 more
>    [junit4]   2> 573393 INFO  (TEST-TestMaxTokenLenTokenizer.testSingleFieldDiffAnalyzers-seed#[6A12DFC046B6CA7B]) [    ] o.a.s.SolrTestCaseJ4 ###Starting testSingleFieldDiffAnalyzers
>    [junit4]   2> 573393 INFO  (TEST-TestMaxTokenLenTokenizer.testSingleFieldDiffAnalyzers-seed#[6A12DFC046B6CA7B]) [    ] o.a.s.u.DirectUpdateHandler2 [collection1] REMOVING ALL DOCUMENTS FROM INDEX
>    [junit4]   2> 573393 INFO  (TEST-TestMaxTokenLenTokenizer.testSingleFieldDiffAnalyzers-seed#[6A12DFC046B6CA7B]) [    ] o.a.s.u.p.LogUpdateProcessorFactory [collection1]  webapp=null path=null params={_version_=-9223372036854775807&update.distrib=FROMLEADER&versions=true&wt=json&indent=true}{deleteByQuery=*:*} 0 0
>    [junit4]   2> 573394 INFO  (TEST-TestMaxTokenLenTokenizer.testSingleFieldDiffAnalyzers-seed#[6A12DFC046B6CA7B]) [    ] o.a.s.u.DirectUpdateHandler2 start commit{,optimize=false,openSearcher=true,waitSearcher=true,expungeDeletes=false,softCommit=false,prepareCommit=false}
>    [junit4]   2> 573394 INFO  (TEST-TestMaxTokenLenTokenizer.testSingleFieldDiffAnalyzers-seed#[6A12DFC046B6CA7B]) [    ] o.a.s.u.SolrIndexWriter Calling setCommitData with IW:org.apache.solr.update.SolrIndexWriter@a17117
>    [junit4]   2> 573397 INFO  (TEST-TestMaxTokenLenTokenizer.testSingleFieldDiffAnalyzers-seed#[6A12DFC046B6CA7B]) [    ] o.a.s.s.SolrIndexSearcher Opening [Searcher@105a624[collection1] main]
>    [junit4]   2> 573398 INFO  (TEST-TestMaxTokenLenTokenizer.testSingleFieldDiffAnalyzers-seed#[6A12DFC046B6CA7B]) [    ] o.a.s.u.DirectUpdateHandler2 end_commit_flush
>    [junit4]   2> 573398 INFO  (searcherExecutor-1779-thread-1) [    ] o.a.s.c.SolrCore [collection1] Registered new searcher Searcher@105a624[collection1] main{ExitableDirectoryReader(UninvertingDirectoryReader(Uninverting(_5(6.7.0):C1)))}
>    [junit4]   2> 573401 INFO  (TEST-TestMaxTokenLenTokenizer.testSingleFieldDiffAnalyzers-seed#[6A12DFC046B6CA7B]) [    ] o.a.s.u.p.LogUpdateProcessorFactory [collection1]  webapp=null path=null params={wt=json&indent=true}{add=[1],commit=} 0 7
>    [junit4]   2> 573401 INFO  (TEST-TestMaxTokenLenTokenizer.testSingleFieldDiffAnalyzers-seed#[6A12DFC046B6CA7B]) [    ] o.a.s.u.DirectUpdateHandler2 start commit{,optimize=false,openSearcher=true,waitSearcher=true,expungeDeletes=false,softCommit=false,prepareCommit=false}
>    [junit4]   2> 573401 INFO  (TEST-TestMaxTokenLenTokenizer.testSingleFieldDiffAnalyzers-seed#[6A12DFC046B6CA7B]) [    ] o.a.s.u.SolrIndexWriter Calling setCommitData with IW:org.apache.solr.update.SolrIndexWriter@a17117
>    [junit4]   2> 573405 INFO  (TEST-TestMaxTokenLenTokenizer.testSingleFieldDiffAnalyzers-seed#[6A12DFC046B6CA7B]) [    ] o.a.s.s.SolrIndexSearcher Opening [Searcher@14b13[collection1] main]
>    [junit4]   2> 573405 INFO  (TEST-TestMaxTokenLenTokenizer.testSingleFieldDiffAnalyzers-seed#[6A12DFC046B6CA7B]) [    ] o.a.s.u.DirectUpdateHandler2 end_commit_flush
>    [junit4]   2> 573405 INFO  (searcherExecutor-1779-thread-1) [    ] o.a.s.c.SolrCore [collection1] Registered new searcher Searcher@14b13[collection1] main{ExitableDirectoryReader(UninvertingDirectoryReader(Uninverting(_5(6.7.0):C1) Uninverting(_6(6.7.0):C1)))}
>    [junit4]   2> 573406 INFO  (TEST-TestMaxTokenLenTokenizer.testSingleFieldDiffAnalyzers-seed#[6A12DFC046B6CA7B]) [    ] o.a.s.u.p.LogUpdateProcessorFactory [collection1]  webapp=null path=null params={wt=json&indent=true}{add=[2],commit=} 0 4
>    [junit4]   2> 573406 INFO  (TEST-TestMaxTokenLenTokenizer.testSingleFieldDiffAnalyzers-seed#[6A12DFC046B6CA7B]) [    ] o.a.s.u.DirectUpdateHandler2 start commit{,optimize=false,openSearcher=true,waitSearcher=true,expungeDeletes=false,softCommit=false,prepareCommit=false}
>    [junit4]   2> 573406 INFO  (TEST-TestMaxTokenLenTokenizer.testSingleFieldDiffAnalyzers-seed#[6A12DFC046B6CA7B]) [    ] o.a.s.u.SolrIndexWriter Calling setCommitData with IW:org.apache.solr.update.SolrIndexWriter@a17117
>    [junit4]   2> 573410 INFO  (TEST-TestMaxTokenLenTokenizer.testSingleFieldDiffAnalyzers-seed#[6A12DFC046B6CA7B]) [    ] o.a.s.s.SolrIndexSearcher Opening [Searcher@1fb9f50[collection1] main]
>    [junit4]   2> 573410 INFO  (TEST-TestMaxTokenLenTokenizer.testSingleFieldDiffAnalyzers-seed#[6A12DFC046B6CA7B]) [    ] o.a.s.u.DirectUpdateHandler2 end_commit_flush
>    [junit4]   2> 573411 INFO  (searcherExecutor-1779-thread-1) [    ] o.a.s.c.SolrCore [collection1] Registered new searcher Searcher@1fb9f50[collection1] main{ExitableDirectoryReader(UninvertingDirectoryReader(Uninverting(_5(6.7.0):C1) Uninverting(_6(6.7.0):C1) Uninverting(_7(6.7.0):C1)))}
>    [junit4]   2> 573411 INFO  (TEST-TestMaxTokenLenTokenizer.testSingleFieldDiffAnalyzers-seed#[6A12DFC046B6CA7B]) [    ] o.a.s.u.p.LogUpdateProcessorFactory [collection1]  webapp=null path=null params={wt=json&indent=true}{add=[3],commit=} 0 5
>    [junit4]   2> 573411 INFO  (TEST-TestMaxTokenLenTokenizer.testSingleFieldDiffAnalyzers-seed#[6A12DFC046B6CA7B]) [    ] o.a.s.u.DirectUpdateHandler2 start commit{,optimize=false,openSearcher=true,waitSearcher=true,expungeDeletes=false,softCommit=false,prepareCommit=false}
>    [junit4]   2> 573411 INFO  (TEST-TestMaxTokenLenTokenizer.testSingleFieldDiffAnalyzers-seed#[6A12DFC046B6CA7B]) [    ] o.a.s.u.SolrIndexWriter Calling setCommitData with IW:org.apache.solr.update.SolrIndexWriter@a17117
>    [junit4]   2> 573416 INFO  (TEST-TestMaxTokenLenTokenizer.testSingleFieldDiffAnalyzers-seed#[6A12DFC046B6CA7B]) [    ] o.a.s.s.SolrIndexSearcher Opening [Searcher@e569bb[collection1] main]
>    [junit4]   2> 573416 INFO  (TEST-TestMaxTokenLenTokenizer.testSingleFieldDiffAnalyzers-seed#[6A12DFC046B6CA7B]) [    ] o.a.s.u.DirectUpdateHandler2 end_commit_flush
>    [junit4]   2> 573416 INFO  (searcherExecutor-1779-thread-1) [    ] o.a.s.c.SolrCore [collection1] Registered new searcher Searcher@e569bb[collection1] main{ExitableDirectoryReader(UninvertingDirectoryReader(Uninverting(_5(6.7.0):C1) Uninverting(_6(6.7.0):C1) Uninverting(_7(6.7.0):C1) Uninverting(_8(6.7.0):C1)))}
>    [junit4]   2> 573416 INFO  (TEST-TestMaxTokenLenTokenizer.testSingleFieldDiffAnalyzers-seed#[6A12DFC046B6CA7B]) [    ] o.a.s.u.p.LogUpdateProcessorFactory [collection1]  webapp=null path=null params={wt=json&indent=true}{add=[4],commit=} 0 5
>    [junit4]   2> 573417 INFO  (TEST-TestMaxTokenLenTokenizer.testSingleFieldDiffAnalyzers-seed#[6A12DFC046B6CA7B]) [    ] o.a.s.u.DirectUpdateHandler2 start commit{,optimize=false,openSearcher=true,waitSearcher=true,expungeDeletes=false,softCommit=false,prepareCommit=false}
>    [junit4]   2> 573417 INFO  (TEST-TestMaxTokenLenTokenizer.testSingleFieldDiffAnalyzers-seed#[6A12DFC046B6CA7B]) [    ] o.a.s.u.SolrIndexWriter Calling setCommitData with IW:org.apache.solr.update.SolrIndexWriter@a17117
>    [junit4]   2> 573421 INFO  (TEST-TestMaxTokenLenTokenizer.testSingleFieldDiffAnalyzers-seed#[6A12DFC046B6CA7B]) [    ] o.a.s.s.SolrIndexSearcher Opening [Searcher@75c642[collection1] main]
>    [junit4]   2> 573422 INFO  (TEST-TestMaxTokenLenTokenizer.testSingleFieldDiffAnalyzers-seed#[6A12DFC046B6CA7B]) [    ] o.a.s.u.DirectUpdateHandler2 end_commit_flush
>    [junit4]   2> 573422 INFO  (searcherExecutor-1779-thread-1) [    ] o.a.s.c.SolrCore [collection1] Registered new searcher Searcher@75c642[collection1] main{ExitableDirectoryReader(UninvertingDirectoryReader(Uninverting(_5(6.7.0):C1) Uninverting(_6(6.7.0):C1) Uninverting(_7(6.7.0):C1) Uninverting(_8(6.7.0):C1) Uninverting(_9(6.7.0):C1)))}
>    [junit4]   2> 573422 INFO  (TEST-TestMaxTokenLenTokenizer.testSingleFieldDiffAnalyzers-seed#[6A12DFC046B6CA7B]) [    ] o.a.s.u.p.LogUpdateProcessorFactory [collection1]  webapp=null path=null params={wt=json&indent=true}{add=[5],commit=} 0 5
>    [junit4]   2> 573422 INFO  (TEST-TestMaxTokenLenTokenizer.testSingleFieldDiffAnalyzers-seed#[6A12DFC046B6CA7B]) [    ] o.a.s.u.DirectUpdateHandler2 start commit{,optimize=false,openSearcher=true,waitSearcher=true,expungeDeletes=false,softCommit=false,prepareCommit=false}
>    [junit4]   2> 573422 INFO  (TEST-TestMaxTokenLenTokenizer.testSingleFieldDiffAnalyzers-seed#[6A12DFC046B6CA7B]) [    ] o.a.s.u.DirectUpdateHandler2 No uncommitted changes. Skipping IW.commit.
>    [junit4]   2> 573422 INFO  (TEST-TestMaxTokenLenTokenizer.testSingleFieldDiffAnalyzers-seed#[6A12DFC046B6CA7B]) [    ] o.a.s.u.DirectUpdateHandler2 end_commit_flush
>    [junit4]   2> 573422 INFO  (TEST-TestMaxTokenLenTokenizer.testSingleFieldDiffAnalyzers-seed#[6A12DFC046B6CA7B]) [    ] o.a.s.u.p.LogUpdateProcessorFactory [collection1]  webapp=null path=null params={}{commit=} 0 0
>    [junit4]   2> 573423 INFO  (TEST-TestMaxTokenLenTokenizer.testSingleFieldDiffAnalyzers-seed#[6A12DFC046B6CA7B]) [    ] o.a.s.c.S.Request [collection1]  webapp=null path=null params={q=*:*&wt=xml} hits=5 status=0 QTime=0
>    [junit4]   2> 573423 INFO  (TEST-TestMaxTokenLenTokenizer.testSingleFieldDiffAnalyzers-seed#[6A12DFC046B6CA7B]) [    ] o.a.s.c.S.Request [collection1]  webapp=null path=null params={q=letter:let&wt=xml} hits=1 status=0 QTime=0
>    [junit4]   2> 573423 INFO  (TEST-TestMaxTokenLenTokenizer.testSingleFieldDiffAnalyzers-seed#[6A12DFC046B6CA7B]) [    ] o.a.s.c.S.Request [collection1]  webapp=null path=null params={q=letter:lett&wt=xml} hits=0 status=0 QTime=0
>    [junit4]   2> 573424 INFO  (TEST-TestMaxTokenLenTokenizer.testSingleFieldDiffAnalyzers-seed#[6A12DFC046B6CA7B]) [    ] o.a.s.c.S.Request [collection1]  webapp=null path=null params={q=lowerCase:low&wt=xml} hits=1 status=0 QTime=0
>    [junit4]   2> 573427 INFO  (TEST-TestMaxTokenLenTokenizer.testSingleFieldDiffAnalyzers-seed#[6A12DFC046B6CA7B]) [    ] o.a.s.c.S.Request [collection1]  webapp=null path=null params={q=lowerCase:l&wt=xml} hits=0 status=0 QTime=2
>    [junit4]   2> 573427 INFO  (TEST-TestMaxTokenLenTokenizer.testSingleFieldDiffAnalyzers-seed#[6A12DFC046B6CA7B]) [    ] o.a.s.c.S.Request [collection1]  webapp=null path=null params={q=lowerCase:lo&wt=xml} hits=0 status=0 QTime=0
>    [junit4]   2> 573427 INFO  (TEST-TestMaxTokenLenTokenizer.testSingleFieldDiffAnalyzers-seed#[6A12DFC046B6CA7B]) [    ] o.a.s.c.S.Request [collection1]  webapp=null path=null params={q=lowerCase:lower&wt=xml} hits=0 status=0 QTime=0
>    [junit4]   2> 573428 INFO  (TEST-TestMaxTokenLenTokenizer.testSingleFieldDiffAnalyzers-seed#[6A12DFC046B6CA7B]) [    ] o.a.s.c.S.Request [collection1]  webapp=null path=null params={q=whiteSpace:whi&wt=xml} hits=1 status=0 QTime=0
>    [junit4]   2> 573428 INFO  (TEST-TestMaxTokenLenTokenizer.testSingleFieldDiffAnalyzers-seed#[6A12DFC046B6CA7B]) [    ] o.a.s.c.S.Request [collection1]  webapp=null path=null params={q=whiteSpace:teS&wt=xml} hits=1 status=0 QTime=0
>    [junit4]   2> 573428 INFO  (TEST-TestMaxTokenLenTokenizer.testSingleFieldDiffAnalyzers-seed#[6A12DFC046B6CA7B]) [    ] o.a.s.c.S.Request [collection1]  webapp=null path=null params={q=whiteSpace:in&wt=xml} hits=1 status=0 QTime=0
>    [junit4]   2> 573428 INFO  (TEST-TestMaxTokenLenTokenizer.testSingleFieldDiffAnalyzers-seed#[6A12DFC046B6CA7B]) [    ] o.a.s.c.S.Request [collection1]  webapp=null path=null params={q=whiteSpace:white&wt=xml} hits=0 status=0 QTime=0
>    [junit4]   2> 573428 INFO  (TEST-TestMaxTokenLenTokenizer.testSingleFieldDiffAnalyzers-seed#[6A12DFC046B6CA7B]) [    ] o.a.s.c.S.Request [collection1]  webapp=null path=null params={q=unicodeWhiteSpace:uni&wt=xml} hits=1 status=0 QTime=0
>    [junit4]   2> 573429 INFO  (TEST-TestMaxTokenLenTokenizer.testSingleFieldDiffAnalyzers-seed#[6A12DFC046B6CA7B]) [    ] o.a.s.c.S.Request [collection1]  webapp=null path=null params={q=unicodeWhiteSpace:cod&wt=xml} hits=1 status=0 QTime=0
>    [junit4]   2> 573429 INFO  (TEST-TestMaxTokenLenTokenizer.testSingleFieldDiffAnalyzers-seed#[6A12DFC046B6CA7B]) [    ] o.a.s.c.S.Request [collection1]  webapp=null path=null params={q=unicodeWhiteSpace:e&wt=xml} hits=1 status=0 QTime=0
>    [junit4]   2> 573429 INFO  (TEST-TestMaxTokenLenTokenizer.testSingleFieldDiffAnalyzers-seed#[6A12DFC046B6CA7B]) [    ] o.a.s.c.S.Request [collection1]  webapp=null path=null params={q=unicodeWhiteSpace:unico&wt=xml} hits=0 status=0 QTime=0
>    [junit4]   2> 573429 INFO  (TEST-TestMaxTokenLenTokenizer.testSingleFieldDiffAnalyzers-seed#[6A12DFC046B6CA7B]) [    ] o.a.s.c.S.Request [collection1]  webapp=null path=null params={q=keyword:keyword&wt=xml} hits=1 status=0 QTime=0
>    [junit4]   2> 573430 INFO  (TEST-TestMaxTokenLenTokenizer.testSingleFieldDiffAnalyzers-seed#[6A12DFC046B6CA7B]) [    ] o.a.s.c.S.Request [collection1]  webapp=null path=null params={q=keyword:key&wt=xml} hits=0 status=0 QTime=0
>    [junit4]   2> 573430 INFO  (TEST-TestMaxTokenLenTokenizer.testSingleFieldDiffAnalyzers-seed#[6A12DFC046B6CA7B]) [    ] o.a.s.SolrTestCaseJ4 ###Ending testSingleFieldDiffAnalyzers
>    [junit4]   2> 573430 INFO  (SUITE-TestMaxTokenLenTokenizer-seed#[6A12DFC046B6CA7B]-worker) [    ] o.a.s.SolrTestCaseJ4 ###deleteCore
>    [junit4]   2> 573430 INFO  (SUITE-TestMaxTokenLenTokenizer-seed#[6A12DFC046B6CA7B]-worker) [    ] o.a.s.c.CoreContainer Shutting down CoreContainer instance=12126963
>    [junit4]   2> 573430 INFO  (SUITE-TestMaxTokenLenTokenizer-seed#[6A12DFC046B6CA7B]-worker) [    ] o.a.s.m.SolrMetricManager Closing metric reporters for: solr.node
>    [junit4]   2> 573431 INFO  (SUITE-TestMaxTokenLenTokenizer-seed#[6A12DFC046B6CA7B]-worker) [    ] o.a.s.m.SolrMetricManager Closing metric reporters for: solr.jvm
>    [junit4]   2> 573431 INFO  (SUITE-TestMaxTokenLenTokenizer-seed#[6A12DFC046B6CA7B]-worker) [    ] o.a.s.m.SolrMetricManager Closing metric reporters for: solr.jetty
>    [junit4]   2> 573431 INFO  (SUITE-TestMaxTokenLenTokenizer-seed#[6A12DFC046B6CA7B]-worker) [    ] o.a.s.c.TransientSolrCoreCacheDefault Allocating transient cache for 2147483647 transient cores
>    [junit4]   2> 573431 INFO  (coreCloseExecutor-1783-thread-1) [    ] o.a.s.c.SolrCore [collection1]  CLOSING SolrCore org.apache.solr.core.SolrCore@1ff227c
>    [junit4]   2> 573433 INFO  (coreCloseExecutor-1783-thread-1) [    ] o.a.s.m.SolrMetricManager Closing metric reporters for: solr.core.collection1
>    [junit4]   2> NOTE: leaving temporary files on disk at: /home/jenkins/workspace/Lucene-Solr-6.x-Linux/solr/build/solr-core/test/J1/temp/solr.util.TestMaxTokenLenTokenizer_6A12DFC046B6CA7B-001
>    [junit4]   2> NOTE: test params are: codec=Lucene62, sim=RandomSimilarity(queryNorm=true,coord=crazy): {}, locale=fo, timezone=America/Indiana/Indianapolis
>    [junit4]   2> NOTE: Linux 4.10.0-21-generic i386/Oracle Corporation 9-ea (32-bit)/cpus=8,threads=1,free=94606112,total=159608832
>    [junit4]   2> NOTE: All tests run in this JVM: [DistributedQueryComponentOptimizationTest, TestCloudDeleteByQuery, TestDynamicLoading, TestPayloadCheckQParserPlugin, CopyFieldTest, SolrCloudExampleTest, TestSystemIdResolver, LoggingHandlerTest, BlockCacheTest, TestNumericTerms64, TestNestedDocsSort, TestShardHandlerFactory, TestReqParamsAPI, TestPartialUpdateDeduplication, HdfsWriteToMultipleCollectionsTest, SegmentsInfoRequestHandlerTest, ClusterStateUpdateTest, MultiTermTest, TestRecoveryHdfs, BasicAuthStandaloneTest, TestSearchPerf, MetricsHandlerTest, OverseerTaskQueueTest, TestGraphMLResponseWriter, CoreAdminRequestStatusTest, SuggesterFSTTest, TestUpdate, BitVectorTest, TestFieldCacheSort, RestartWhileUpdatingTest, IndexSchemaRuntimeFieldTest, TestDefaultStatsCache, TestQueryTypes, IndexBasedSpellCheckerTest, WordBreakSolrSpellCheckerTest, UUIDUpdateProcessorFallbackTest, TestSolrIndexConfig, SharedFSAutoReplicaFailoverUtilsTest, TestSchemaSimilarityResource, TestCopyFieldCollectionResource, ConnectionReuseTest, CloneFieldUpdateProcessorFactoryTest, SpatialHeatmapFacetsTest, SolrInfoMBeanTest, BJQParserTest, SearchHandlerTest, ManagedSchemaRoundRobinCloudTest, HdfsRecoveryZkTest, TestClassicSimilarityFactory, TestFuzzyAnalyzedSuggestions, TestComplexPhraseQParserPlugin, DateMathParserTest, TestStressCloudBlindAtomicUpdates, AnalysisErrorHandlingTest, TestConfigSetsAPIExclusivity, TestElisionMultitermQuery, LeaderInitiatedRecoveryOnShardRestartTest, MetricUtilsTest, TestLMDirichletSimilarityFactory, TriLevelCompositeIdRoutingTest, ParsingFieldUpdateProcessorsTest, FileUtilsTest, TestMaxTokenLenTokenizer]
>    [junit4] Completed [199/715 (1!)] on J1 in 0.27s, 2 tests, 1 error <<< FAILURES!
>
> [...truncated 1709 lines...]
>    [junit4] JVM J1: stderr was not empty, see: /home/jenkins/workspace/Lucene-Solr-6.x-Linux/solr/build/solr-core/test/temp/junit4-J1-20170531_094526_20810277165144309092869.syserr
>    [junit4] >>> JVM J1 emitted unexpected output (verbatim) ----
>    [junit4] Java HotSpot(TM) Server VM warning: Option UseConcMarkSweepGC was deprecated in version 9.0 and will likely be removed in a future release.
>    [junit4] <<< JVM J1: EOF ----
>
> [...truncated 3 lines...]
>    [junit4] JVM J0: stderr was not empty, see: /home/jenkins/workspace/Lucene-Solr-6.x-Linux/solr/build/solr-core/test/temp/junit4-J0-20170531_094526_20814799412071020504789.syserr
>    [junit4] >>> JVM J0 emitted unexpected output (verbatim) ----
>    [junit4] Java HotSpot(TM) Server VM warning: Option UseConcMarkSweepGC was deprecated in version 9.0 and will likely be removed in a future release.
>    [junit4] <<< JVM J0: EOF ----
>
> [...truncated 4 lines...]
>    [junit4] JVM J2: stderr was not empty, see: /home/jenkins/workspace/Lucene-Solr-6.x-Linux/solr/build/solr-core/test/temp/junit4-J2-20170531_094526_2088299642706627147802.syserr
>    [junit4] >>> JVM J2 emitted unexpected output (verbatim) ----
>    [junit4] Java HotSpot(TM) Server VM warning: Option UseConcMarkSweepGC was deprecated in version 9.0 and will likely be removed in a future release.
>    [junit4] <<< JVM J2: EOF ----
>
> [...truncated 799 lines...]
>    [junit4] JVM J0: stderr was not empty, see: /home/jenkins/workspace/Lucene-Solr-6.x-Linux/solr/build/solr-solrj/test/temp/junit4-J0-20170531_101602_1579962087335705047678.syserr
>    [junit4] >>> JVM J0 emitted unexpected output (verbatim) ----
>    [junit4] Java HotSpot(TM) Server VM warning: Option UseConcMarkSweepGC was deprecated in version 9.0 and will likely be removed in a future release.
>    [junit4] <<< JVM J0: EOF ----
>
> [...truncated 3 lines...]
>    [junit4] JVM J1: stderr was not empty, see: /home/jenkins/workspace/Lucene-Solr-6.x-Linux/solr/build/solr-solrj/test/temp/junit4-J1-20170531_101602_1579710292897175007495.syserr
>    [junit4] >>> JVM J1 emitted unexpected output (verbatim) ----
>    [junit4] Java HotSpot(TM) Server VM warning: Option UseConcMarkSweepGC was deprecated in version 9.0 and will likely be removed in a future release.
>    [junit4] <<< JVM J1: EOF ----
>
> [...truncated 21 lines...]
>    [junit4] JVM J2: stderr was not empty, see: /home/jenkins/workspace/Lucene-Solr-6.x-Linux/solr/build/solr-solrj/test/temp/junit4-J2-20170531_101602_15712128928550473259273.syserr
>    [junit4] >>> JVM J2 emitted unexpected output (verbatim) ----
>    [junit4] Java HotSpot(TM) Server VM warning: Option UseConcMarkSweepGC was deprecated in version 9.0 and will likely be removed in a future release.
>    [junit4] <<< JVM J2: EOF ----
>
> [...truncated 1238 lines...]
>    [junit4] JVM J2: stderr was not empty, see: /home/jenkins/workspace/Lucene-Solr-6.x-Linux/solr/build/contrib/solr-analysis-extras/test/temp/junit4-J2-20170531_101858_6812648654726751117679.syserr
>    [junit4] >>> JVM J2 emitted unexpected output (verbatim) ----
>    [junit4] Java HotSpot(TM) Server VM warning: Option UseConcMarkSweepGC was deprecated in version 9.0 and will likely be removed in a future release.
>    [junit4] <<< JVM J2: EOF ----
>
>    [junit4] JVM J1: stderr was not empty, see: /home/jenkins/workspace/Lucene-Solr-6.x-Linux/solr/build/contrib/solr-analysis-extras/test/temp/junit4-J1-20170531_101858_6819161214365345619725.syserr
>    [junit4] >>> JVM J1 emitted unexpected output (verbatim) ----
>    [junit4] Java HotSpot(TM) Server VM warning: Option UseConcMarkSweepGC was deprecated in version 9.0 and will likely be removed in a future release.
>    [junit4] <<< JVM J1: EOF ----
>
> [...truncated 3 lines...]
>    [junit4] JVM J0: stderr was not empty, see: /home/jenkins/workspace/Lucene-Solr-6.x-Linux/solr/build/contrib/solr-analysis-extras/test/temp/junit4-J0-20170531_101858_6811302250918501778823.syserr
>    [junit4] >>> JVM J0 emitted unexpected output (verbatim) ----
>    [junit4] Java HotSpot(TM) Server VM warning: Option UseConcMarkSweepGC was deprecated in version 9.0 and will likely be removed in a future release.
>    [junit4] <<< JVM J0: EOF ----
>
> [...truncated 520 lines...]
>    [junit4] JVM J2: stderr was not empty, see: /home/jenkins/workspace/Lucene-Solr-6.x-Linux/solr/build/contrib/solr-analytics/test/temp/junit4-J2-20170531_101905_42710132395080713520947.syserr
>    [junit4] >>> JVM J2 emitted unexpected output (verbatim) ----
>    [junit4] Java HotSpot(TM) Server VM warning: Option UseConcMarkSweepGC was deprecated in version 9.0 and will likely be removed in a future release.
>    [junit4] <<< JVM J2: EOF ----
>
> [...truncated 3 lines...]
>    [junit4] JVM J1: stderr was not empty, see: /home/jenkins/workspace/Lucene-Solr-6.x-Linux/solr/build/contrib/solr-analytics/test/temp/junit4-J1-20170531_101905_427201129098047688083.syserr
>    [junit4] >>> JVM J1 emitted unexpected output (verbatim) ----
>    [junit4] Java HotSpot(TM) Server VM warning: Option UseConcMarkSweepGC was deprecated in version 9.0 and will likely be removed in a future release.
>    [junit4] <<< JVM J1: EOF ----
>
> [...truncated 3 lines...]
>    [junit4] JVM J0: stderr was not empty, see: /home/jenkins/workspace/Lucene-Solr-6.x-Linux/solr/build/contrib/solr-analytics/test/temp/junit4-J0-20170531_101905_42714420401228681195909.syserr
>    [junit4] >>> JVM J0 emitted unexpected output (verbatim) ----
>    [junit4] Java HotSpot(TM) Server VM warning: Option UseConcMarkSweepGC was deprecated in version 9.0 and will likely be removed in a future release.
>    [junit4] <<< JVM J0: EOF ----
>
> [...truncated 499 lines...]
>    [junit4] JVM J2: stderr was not empty, see: /home/jenkins/workspace/Lucene-Solr-6.x-Linux/solr/build/contrib/solr-clustering/test/temp/junit4-J2-20170531_101916_77812459883472551716304.syserr
>    [junit4] >>> JVM J2 emitted unexpected output (verbatim) ----
>    [junit4] Java HotSpot(TM) Server VM warning: Option UseConcMarkSweepGC was deprecated in version 9.0 and will likely be removed in a future release.
>    [junit4] <<< JVM J2: EOF ----
>
> [...truncated 3 lines...]
>    [junit4] JVM J1: stderr was not empty, see: /home/jenkins/workspace/Lucene-Solr-6.x-Linux/solr/build/contrib/solr-clustering/test/temp/junit4-J1-20170531_101916_77810153576768499784630.syserr
>    [junit4] >>> JVM J1 emitted unexpected output (verbatim) ----
>    [junit4] Java HotSpot(TM) Server VM warning: Option UseConcMarkSweepGC was deprecated in version 9.0 and will likely be removed in a future release.
>    [junit4] <<< JVM J1: EOF ----
>
> [...truncated 3 lines...]
>    [junit4] JVM J0: stderr was not empty, see: /home/jenkins/workspace/Lucene-Solr-6.x-Linux/solr/build/contrib/solr-clustering/test/temp/junit4-J0-20170531_101916_778170944861411341461.syserr
>    [junit4] >>> JVM J0 emitted unexpected output (verbatim) ----
>    [junit4] Java HotSpot(TM) Server VM warning: Option UseConcMarkSweepGC was deprecated in version 9.0 and will likely be removed in a future release.
>    [junit4] <<< JVM J0: EOF ----
>
> [...truncated 1136 lines...]
>    [junit4] JVM J1: stderr was not empty, see: /home/jenkins/workspace/Lucene-Solr-6.x-Linux/solr/build/contrib/solr-dataimporthandler-extras/test/temp/junit4-J1-20170531_101932_0677572210707568577553.syserr
>    [junit4] >>> JVM J1 emitted unexpected output (verbatim) ----
>    [junit4] Java HotSpot(TM) Server VM warning: Option UseConcMarkSweepGC was deprecated in version 9.0 and will likely be removed in a future release.
>    [junit4] <<< JVM J1: EOF ----
>
> [...truncated 3 lines...]
>    [junit4] JVM J0: stderr was not empty, see: /home/jenkins/workspace/Lucene-Solr-6.x-Linux/solr/build/contrib/solr-dataimporthandler-extras/test/temp/junit4-J0-20170531_101932_06710195861877698667435.syserr
>    [junit4] >>> JVM J0 emitted unexpected output (verbatim) ----
>    [junit4] Java HotSpot(TM) Server VM warning: Option UseConcMarkSweepGC was deprecated in version 9.0 and will likely be removed in a future release.
>    [junit4] <<< JVM J0: EOF ----
>
> [...truncated 593 lines...]
>    [junit4] JVM J1: stderr was not empty, see: /home/jenkins/workspace/Lucene-Solr-6.x-Linux/solr/build/contrib/solr-dataimporthandler/test/temp/junit4-J1-20170531_101937_9673008974898652035733.syserr
>    [junit4] >>> JVM J1 emitted unexpected output (verbatim) ----
>    [junit4] Java HotSpot(TM) Server VM warning: Option UseConcMarkSweepGC was deprecated in version 9.0 and will likely be removed in a future release.
>    [junit4] <<< JVM J1: EOF ----
>
> [...truncated 3 lines...]
>    [junit4] JVM J0: stderr was not empty, see: /home/jenkins/workspace/Lucene-Solr-6.x-Linux/solr/build/contrib/solr-dataimporthandler/test/temp/junit4-J0-20170531_101937_9679729917306121010938.syserr
>    [junit4] >>> JVM J0 emitted unexpected output (verbatim) ----
>    [junit4] Java HotSpot(TM) Server VM warning: Option UseConcMarkSweepGC was deprecated in version 9.0 and will likely be removed in a future release.
>    [junit4] <<< JVM J0: EOF ----
>
>    [junit4] JVM J2: stderr was not empty, see: /home/jenkins/workspace/Lucene-Solr-6.x-Linux/solr/build/contrib/solr-dataimporthandler/test/temp/junit4-J2-20170531_101937_96717242282123660960210.syserr
>    [junit4] >>> JVM J2 emitted unexpected output (verbatim) ----
>    [junit4] Java HotSpot(TM) Server VM warning: Option UseConcMarkSweepGC was deprecated in version 9.0 and will likely be removed in a future release.
>    [junit4] <<< JVM J2: EOF ----
>
> [...truncated 503 lines...]
>    [junit4] JVM J0: stderr was not empty, see: /home/jenkins/workspace/Lucene-Solr-6.x-Linux/solr/build/contrib/solr-cell/test/temp/junit4-J0-20170531_101955_24413370019210801823486.syserr
>    [junit4] >>> JVM J0 emitted unexpected output (verbatim) ----
>    [junit4] Java HotSpot(TM) Server VM warning: Option UseConcMarkSweepGC was deprecated in version 9.0 and will likely be removed in a future release.
>    [junit4] <<< JVM J0: EOF ----
>
> [...truncated 3 lines...]
>    [junit4] JVM J2: stderr was not empty, see: /home/jenkins/workspace/Lucene-Solr-6.x-Linux/solr/build/contrib/solr-cell/test/temp/junit4-J2-20170531_101955_2451387462469403946361.syserr
>    [junit4] >>> JVM J2 emitted unexpected output (verbatim) ----
>    [junit4] Java HotSpot(TM) Server VM warning: Option UseConcMarkSweepGC was deprecated in version 9.0 and will likely be removed in a future release.
>    [junit4] <<< JVM J2: EOF ----
>
> [...truncated 3 lines...]
>    [junit4] JVM J1: stderr was not empty, see: /home/jenkins/workspace/Lucene-Solr-6.x-Linux/solr/build/contrib/solr-cell/test/temp/junit4-J1-20170531_101955_24414409280871975546824.syserr
>    [junit4] >>> JVM J1 emitted unexpected output (verbatim) ----
>    [junit4] Java HotSpot(TM) Server VM warning: Option UseConcMarkSweepGC was deprecated in version 9.0 and will likely be removed in a future release.
>    [junit4] <<< JVM J1: EOF ----
>
> [...truncated 507 lines...]
>    [junit4] JVM J1: stderr was not empty, see: /home/jenkins/workspace/Lucene-Solr-6.x-Linux/solr/build/contrib/solr-langid/test/temp/junit4-J1-20170531_102003_81810069965229317258877.syserr
>    [junit4] JVM J0: stderr was not empty, see: /home/jenkins/workspace/Lucene-Solr-6.x-Linux/solr/build/contrib/solr-langid/test/temp/junit4-J0-20170531_102003_8182596970242146190578.syserr
>    [junit4] >>> JVM J0 emitted unexpected output (verbatim) ----
>    [junit4] Java HotSpot(TM) Server VM warning: Option UseConcMarkSweepGC was deprecated in version 9.0 and will likely be removed in a future release.
>    [junit4] <<< JVM J0: EOF ----
>
> [...truncated 593 lines...]
>    [junit4] JVM J1: stderr was not empty, see: /home/jenkins/workspace/Lucene-Solr-6.x-Linux/solr/build/contrib/solr-ltr/test/temp/junit4-J1-20170531_102009_0804358510460611010522.syserr
>    [junit4] >>> JVM J1 emitted unexpected output (verbatim) ----
>    [junit4] Java HotSpot(TM) Server VM warning: Option UseConcMarkSweepGC was deprecated in version 9.0 and will likely be removed in a future release.
>    [junit4] <<< JVM J1: EOF ----
>
> [...truncated 6 lines...]
>    [junit4] JVM J0: stderr was not empty, see: /home/jenkins/workspace/Lucene-Solr-6.x-Linux/solr/build/contrib/solr-ltr/test/temp/junit4-J0-20170531_102009_08012471206900293735339.syserr
>    [junit4] >>> JVM J0 emitted unexpected output (verbatim) ----
>    [junit4] Java HotSpot(TM) Server VM warning: Option UseConcMarkSweepGC was deprecated in version 9.0 and will likely be removed in a future release.
>    [junit4] <<< JVM J0: EOF ----
>
>    [junit4] JVM J2: stderr was not empty, see: /home/jenkins/workspace/Lucene-Solr-6.x-Linux/solr/build/contrib/solr-ltr/test/temp/junit4-J2-20170531_102009_081957697552508001790.syserr
>    [junit4] >>> JVM J2 emitted unexpected output (verbatim) ----
>    [junit4] Java HotSpot(TM) Server VM warning: Option UseConcMarkSweepGC was deprecated in version 9.0 and will likely be removed in a future release.
>    [junit4] <<< JVM J2: EOF ----
>
> [...truncated 540 lines...]
>    [junit4] JVM J1: stderr was not empty, see: /home/jenkins/workspace/Lucene-Solr-6.x-Linux/solr/build/contrib/solr-uima/test/temp/junit4-J1-20170531_102032_7903659786653219849181.syserr
>    [junit4] >>> JVM J1 emitted unexpected output (verbatim) ----
>    [junit4] Java HotSpot(TM) Server VM warning: Option UseConcMarkSweepGC was deprecated in version 9.0 and will likely be removed in a future release.
>    [junit4] <<< JVM J1: EOF ----
>
> [...truncated 3 lines...]
>    [junit4] JVM J0: stderr was not empty, see: /home/jenkins/workspace/Lucene-Solr-6.x-Linux/solr/build/contrib/solr-uima/test/temp/junit4-J0-20170531_102032_79012063853953143885687.syserr
>    [junit4] >>> JVM J0 emitted unexpected output (verbatim) ----
>    [junit4] Java HotSpot(TM) Server VM warning: Option UseConcMarkSweepGC was deprecated in version 9.0 and will likely be removed in a future release.
>    [junit4] <<< JVM J0: EOF ----
>
> [...truncated 494 lines...]
>    [junit4] JVM J0: stderr was not empty, see: /home/jenkins/workspace/Lucene-Solr-6.x-Linux/solr/build/contrib/solr-velocity/test/temp/junit4-J0-20170531_102041_832224134778480345565.syserr
>    [junit4] >>> JVM J0 emitted unexpected output (verbatim) ----
>    [junit4] Java HotSpot(TM) Server VM warning: Option UseConcMarkSweepGC was deprecated in version 9.0 and will likely be removed in a future release.
>    [junit4] <<< JVM J0: EOF ----
>
> [...truncated 28889 lines...]
>
>
> ---------------------------------------------------------------------
> To unsubscribe, e-mail: dev-unsubscribe@lucene.apache.org
> For additional commands, e-mail: dev-help@lucene.apache.org

---------------------------------------------------------------------
To unsubscribe, e-mail: dev-unsubscribe@lucene.apache.org
For additional commands, e-mail: dev-help@lucene.apache.org


Mime
View raw message