lucene-dev mailing list archives

Site index · List index
Message view « Date » · « Thread »
Top « Date » · « Thread »
From Apache Jenkins Server <jenk...@builds.apache.org>
Subject [JENKINS] Lucene-Solr-Tests-master - Build # 1975 - Unstable
Date Wed, 12 Jul 2017 16:33:32 GMT
Build: https://builds.apache.org/job/Lucene-Solr-Tests-master/1975/

1 tests failed.
FAILED:  junit.framework.TestSuite.org.apache.solr.analytics.NoFacetCloudTest

Error Message:
Error from server at https://127.0.0.1:40201/solr/collection1: Async exception during distributed
update: Broken pipe (Write failed)

Stack Trace:
org.apache.solr.client.solrj.impl.HttpSolrClient$RemoteSolrException: Error from server at
https://127.0.0.1:40201/solr/collection1: Async exception during distributed update: Broken
pipe (Write failed)
	at __randomizedtesting.SeedInfo.seed([88158922EFDF39A8]:0)
	at org.apache.solr.client.solrj.impl.HttpSolrClient.executeMethod(HttpSolrClient.java:626)
	at org.apache.solr.client.solrj.impl.HttpSolrClient.request(HttpSolrClient.java:252)
	at org.apache.solr.client.solrj.impl.HttpSolrClient.request(HttpSolrClient.java:241)
	at org.apache.solr.client.solrj.impl.LBHttpSolrClient.doRequest(LBHttpSolrClient.java:483)
	at org.apache.solr.client.solrj.impl.LBHttpSolrClient.request(LBHttpSolrClient.java:413)
	at org.apache.solr.client.solrj.impl.CloudSolrClient.sendRequest(CloudSolrClient.java:1121)
	at org.apache.solr.client.solrj.impl.CloudSolrClient.requestWithRetryOnStaleState(CloudSolrClient.java:862)
	at org.apache.solr.client.solrj.impl.CloudSolrClient.request(CloudSolrClient.java:793)
	at org.apache.solr.client.solrj.SolrRequest.process(SolrRequest.java:178)
	at org.apache.solr.client.solrj.request.UpdateRequest.commit(UpdateRequest.java:233)
	at org.apache.solr.analytics.AbstractAnalyticsStatsCloudTest.cleanIndex(AbstractAnalyticsStatsCloudTest.java:84)
	at org.apache.solr.analytics.AbstractAnalyticsStatsCloudTest.setupCluster(AbstractAnalyticsStatsCloudTest.java:78)
	at org.apache.solr.analytics.NoFacetCloudTest.populate(NoFacetCloudTest.java:62)
	at sun.reflect.NativeMethodAccessorImpl.invoke0(Native Method)
	at sun.reflect.NativeMethodAccessorImpl.invoke(NativeMethodAccessorImpl.java:62)
	at sun.reflect.DelegatingMethodAccessorImpl.invoke(DelegatingMethodAccessorImpl.java:43)
	at java.lang.reflect.Method.invoke(Method.java:498)
	at com.carrotsearch.randomizedtesting.RandomizedRunner.invoke(RandomizedRunner.java:1713)
	at com.carrotsearch.randomizedtesting.RandomizedRunner$6.evaluate(RandomizedRunner.java:847)
	at com.carrotsearch.randomizedtesting.RandomizedRunner$7.evaluate(RandomizedRunner.java:863)
	at com.carrotsearch.randomizedtesting.rules.StatementAdapter.evaluate(StatementAdapter.java:36)
	at com.carrotsearch.randomizedtesting.rules.SystemPropertiesRestoreRule$1.evaluate(SystemPropertiesRestoreRule.java:57)
	at org.apache.lucene.util.AbstractBeforeAfterRule$1.evaluate(AbstractBeforeAfterRule.java:45)
	at com.carrotsearch.randomizedtesting.rules.StatementAdapter.evaluate(StatementAdapter.java:36)
	at org.apache.lucene.util.TestRuleStoreClassName$1.evaluate(TestRuleStoreClassName.java:41)
	at com.carrotsearch.randomizedtesting.rules.NoShadowingOrOverridesOnMethodsRule$1.evaluate(NoShadowingOrOverridesOnMethodsRule.java:40)
	at com.carrotsearch.randomizedtesting.rules.NoShadowingOrOverridesOnMethodsRule$1.evaluate(NoShadowingOrOverridesOnMethodsRule.java:40)
	at com.carrotsearch.randomizedtesting.rules.StatementAdapter.evaluate(StatementAdapter.java:36)
	at com.carrotsearch.randomizedtesting.rules.StatementAdapter.evaluate(StatementAdapter.java:36)
	at com.carrotsearch.randomizedtesting.rules.StatementAdapter.evaluate(StatementAdapter.java:36)
	at org.apache.lucene.util.TestRuleAssertionsRequired$1.evaluate(TestRuleAssertionsRequired.java:53)
	at org.apache.lucene.util.TestRuleMarkFailure$1.evaluate(TestRuleMarkFailure.java:47)
	at org.apache.lucene.util.TestRuleIgnoreAfterMaxFailures$1.evaluate(TestRuleIgnoreAfterMaxFailures.java:64)
	at org.apache.lucene.util.TestRuleIgnoreTestSuites$1.evaluate(TestRuleIgnoreTestSuites.java:54)
	at com.carrotsearch.randomizedtesting.rules.StatementAdapter.evaluate(StatementAdapter.java:36)
	at com.carrotsearch.randomizedtesting.ThreadLeakControl$StatementRunner.run(ThreadLeakControl.java:368)
	at java.lang.Thread.run(Thread.java:748)




Build Log:
[...truncated 15777 lines...]
   [junit4] Suite: org.apache.solr.analytics.NoFacetCloudTest
   [junit4]   2> Creating dataDir: /x1/jenkins/jenkins-slave/workspace/Lucene-Solr-Tests-master/solr/build/contrib/solr-analytics/test/J2/temp/solr.analytics.NoFacetCloudTest_88158922EFDF39A8-001/init-core-data-001
   [junit4]   2> Jul 12, 2017 4:18:42 PM com.carrotsearch.randomizedtesting.ThreadLeakControl
checkThreadLeaks
   [junit4]   2> WARNING: Will linger awaiting termination of 1 leaked thread(s).
   [junit4]   2> NOTE: test params are: codec=FastCompressingStoredFields(storedFieldsFormat=CompressingStoredFieldsFormat(compressionMode=FAST,
chunkSize=8, maxDocsPerChunk=5, blockSize=9), termVectorsFormat=CompressingTermVectorsFormat(compressionMode=FAST,
chunkSize=8, blockSize=9)), sim=RandomSimilarity(queryNorm=true): {}, locale=ar-SA, timezone=Africa/Ceuta
   [junit4]   2> NOTE: Linux 3.13.0-88-generic amd64/Oracle Corporation 1.8.0_131 (64-bit)/cpus=4,threads=1,free=221141168,total=322961408
   [junit4]   2> NOTE: All tests run in this JVM: [FunctionTest, NoFacetCloudTest]
   [junit4]   2> NOTE: reproduce with: ant test  -Dtestcase=NoFacetCloudTest -Dtests.seed=88158922EFDF39A8
-Dtests.multiplier=2 -Dtests.slow=true -Dtests.locale=ar-SA -Dtests.timezone=Africa/Ceuta
-Dtests.asserts=true -Dtests.file.encoding=ISO-8859-1
   [junit4] ERROR   0.00s J2 | NoFacetCloudTest (suite) <<<
   [junit4]    > Throwable #1: org.apache.solr.client.solrj.impl.HttpSolrClient$RemoteSolrException:
Error from server at https://127.0.0.1:40201/solr/collection1: Async exception during distributed
update: Broken pipe (Write failed)
   [junit4]    > 	at __randomizedtesting.SeedInfo.seed([88158922EFDF39A8]:0)
   [junit4]    > 	at org.apache.solr.client.solrj.impl.HttpSolrClient.executeMethod(HttpSolrClient.java:626)
   [junit4]    > 	at org.apache.solr.client.solrj.impl.HttpSolrClient.request(HttpSolrClient.java:252)
   [junit4]    > 	at org.apache.solr.client.solrj.impl.HttpSolrClient.request(HttpSolrClient.java:241)
   [junit4]    > 	at org.apache.solr.client.solrj.impl.LBHttpSolrClient.doRequest(LBHttpSolrClient.java:483)
   [junit4]    > 	at org.apache.solr.client.solrj.impl.LBHttpSolrClient.request(LBHttpSolrClient.java:413)
   [junit4]    > 	at org.apache.solr.client.solrj.impl.CloudSolrClient.sendRequest(CloudSolrClient.java:1121)
   [junit4]    > 	at org.apache.solr.client.solrj.impl.CloudSolrClient.requestWithRetryOnStaleState(CloudSolrClient.java:862)
   [junit4]    > 	at org.apache.solr.client.solrj.impl.CloudSolrClient.request(CloudSolrClient.java:793)
   [junit4]    > 	at org.apache.solr.client.solrj.SolrRequest.process(SolrRequest.java:178)
   [junit4]    > 	at org.apache.solr.client.solrj.request.UpdateRequest.commit(UpdateRequest.java:233)
   [junit4]    > 	at org.apache.solr.analytics.AbstractAnalyticsStatsCloudTest.cleanIndex(AbstractAnalyticsStatsCloudTest.java:84)
   [junit4]    > 	at org.apache.solr.analytics.AbstractAnalyticsStatsCloudTest.setupCluster(AbstractAnalyticsStatsCloudTest.java:78)
   [junit4]    > 	at org.apache.solr.analytics.NoFacetCloudTest.populate(NoFacetCloudTest.java:62)
   [junit4]    > 	at java.lang.Thread.run(Thread.java:748)
   [junit4] Completed [6/17 (1!)] on J2 in 11.22s, 0 tests, 1 error <<< FAILURES!

[...truncated 40637 lines...]

Mime
View raw message