lucene-dev mailing list archives

Site index · List index
Message view « Date » · « Thread »
Top « Date » · « Thread »
From Policeman Jenkins Server <jenk...@thetaphi.de>
Subject [JENKINS-EA] Lucene-Solr-7.x-Windows (32bit/jdk-9-ea+173) - Build # 34 - Failure!
Date Wed, 12 Jul 2017 18:46:12 GMT
Build: https://jenkins.thetaphi.de/job/Lucene-Solr-7.x-Windows/34/
Java: 32bit/jdk-9-ea+173 -server -XX:+UseG1GC

1 tests failed.
FAILED:  junit.framework.TestSuite.org.apache.solr.EchoParamsTest

Error Message:
Could not remove the following files (in the order of attempts):    C:\Users\jenkins\workspace\Lucene-Solr-7.x-Windows\solr\build\solr-core\test\J0\temp\solr.EchoParamsTest_B808C34BD07D5692-001\init-core-data-001:
java.nio.file.NoSuchFileException: C:\Users\jenkins\workspace\Lucene-Solr-7.x-Windows\solr\build\solr-core\test\J0\temp\solr.EchoParamsTest_B808C34BD07D5692-001\init-core-data-001


Stack Trace:
java.io.IOException: Could not remove the following files (in the order of attempts):
   C:\Users\jenkins\workspace\Lucene-Solr-7.x-Windows\solr\build\solr-core\test\J0\temp\solr.EchoParamsTest_B808C34BD07D5692-001\init-core-data-001:
java.nio.file.NoSuchFileException: C:\Users\jenkins\workspace\Lucene-Solr-7.x-Windows\solr\build\solr-core\test\J0\temp\solr.EchoParamsTest_B808C34BD07D5692-001\init-core-data-001

	at __randomizedtesting.SeedInfo.seed([B808C34BD07D5692]:0)
	at org.apache.lucene.util.IOUtils.rm(IOUtils.java:329)
	at org.apache.lucene.util.TestRuleTemporaryFilesCleanup.afterAlways(TestRuleTemporaryFilesCleanup.java:216)
	at com.carrotsearch.randomizedtesting.rules.TestRuleAdapter$1.afterAlways(TestRuleAdapter.java:31)
	at com.carrotsearch.randomizedtesting.rules.StatementAdapter.evaluate(StatementAdapter.java:43)
	at com.carrotsearch.randomizedtesting.rules.StatementAdapter.evaluate(StatementAdapter.java:36)
	at org.apache.lucene.util.TestRuleAssertionsRequired$1.evaluate(TestRuleAssertionsRequired.java:53)
	at org.apache.lucene.util.TestRuleMarkFailure$1.evaluate(TestRuleMarkFailure.java:47)
	at org.apache.lucene.util.TestRuleIgnoreAfterMaxFailures$1.evaluate(TestRuleIgnoreAfterMaxFailures.java:64)
	at org.apache.lucene.util.TestRuleIgnoreTestSuites$1.evaluate(TestRuleIgnoreTestSuites.java:54)
	at com.carrotsearch.randomizedtesting.rules.StatementAdapter.evaluate(StatementAdapter.java:36)
	at com.carrotsearch.randomizedtesting.ThreadLeakControl$StatementRunner.run(ThreadLeakControl.java:368)
	at java.base/java.lang.Thread.run(Thread.java:844)




Build Log:
[...truncated 12499 lines...]
   [junit4] Suite: org.apache.solr.EchoParamsTest
   [junit4]   2> Creating dataDir: C:\Users\jenkins\workspace\Lucene-Solr-7.x-Windows\solr\build\solr-core\test\J0\temp\solr.EchoParamsTest_B808C34BD07D5692-001\init-core-data-001
   [junit4]   2> 2158191 WARN  (SUITE-EchoParamsTest-seed#[B808C34BD07D5692]-worker) [
   ] o.a.s.SolrTestCaseJ4 startTrackingSearchers: numOpens=1 numCloses=1
   [junit4]   2> 2158191 INFO  (SUITE-EchoParamsTest-seed#[B808C34BD07D5692]-worker) [
   ] o.a.s.SolrTestCaseJ4 Using TrieFields (NUMERIC_POINTS_SYSPROP=false) w/NUMERIC_DOCVALUES_SYSPROP=false
   [junit4]   2> 2158194 INFO  (SUITE-EchoParamsTest-seed#[B808C34BD07D5692]-worker) [
   ] o.a.s.SolrTestCaseJ4 Randomized ssl (true) and clientAuth (false) via: @org.apache.solr.util.RandomizeSSL(reason="",
value=0.0/0.0, ssl=0.0/0.0, clientAuth=0.0/0.0)
   [junit4]   2> 2158195 INFO  (SUITE-EchoParamsTest-seed#[B808C34BD07D5692]-worker) [
   ] o.a.s.SolrTestCaseJ4 ####initCore
   [junit4]   2> 2158196 INFO  (SUITE-EchoParamsTest-seed#[B808C34BD07D5692]-worker) [
   ] o.a.s.c.SolrResourceLoader [null] Added 2 libs to classloader, from paths: [/C:/Users/jenkins/workspace/Lucene-Solr-7.x-Windows/solr/core/src/test-files/solr/collection1/lib,
/C:/Users/jenkins/workspace/Lucene-Solr-7.x-Windows/solr/core/src/test-files/solr/collection1/lib/classes]
   [junit4]   2> 2158225 INFO  (SUITE-EchoParamsTest-seed#[B808C34BD07D5692]-worker) [
   ] o.a.s.c.SolrConfig Using Lucene MatchVersion: 7.1.0
   [junit4]   2> 2158234 INFO  (SUITE-EchoParamsTest-seed#[B808C34BD07D5692]-worker) [
   ] o.a.s.s.IndexSchema [null] Schema name=test
   [junit4]   2> 2158237 INFO  (SUITE-EchoParamsTest-seed#[B808C34BD07D5692]-worker) [
   ] o.a.s.s.IndexSchema Loaded schema test/1.0 with uniqueid field id
   [junit4]   2> 2158295 INFO  (SUITE-EchoParamsTest-seed#[B808C34BD07D5692]-worker) [
   ] o.a.s.m.r.SolrJmxReporter JMX monitoring for 'solr.node' (registry 'solr.node') enabled
at server: com.sun.jmx.mbeanserver.JmxMBeanServer@2d9451
   [junit4]   2> 2158299 INFO  (SUITE-EchoParamsTest-seed#[B808C34BD07D5692]-worker) [
   ] o.a.s.m.r.SolrJmxReporter JMX monitoring for 'solr.jvm' (registry 'solr.jvm') enabled
at server: com.sun.jmx.mbeanserver.JmxMBeanServer@2d9451
   [junit4]   2> 2158299 INFO  (SUITE-EchoParamsTest-seed#[B808C34BD07D5692]-worker) [
   ] o.a.s.m.r.SolrJmxReporter JMX monitoring for 'solr.jetty' (registry 'solr.jetty') enabled
at server: com.sun.jmx.mbeanserver.JmxMBeanServer@2d9451
   [junit4]   2> 2158301 INFO  (coreLoadExecutor-8716-thread-1) [    ] o.a.s.c.SolrResourceLoader
[null] Added 2 libs to classloader, from paths: [/C:/Users/jenkins/workspace/Lucene-Solr-7.x-Windows/solr/core/src/test-files/solr/collection1/lib,
/C:/Users/jenkins/workspace/Lucene-Solr-7.x-Windows/solr/core/src/test-files/solr/collection1/lib/classes]
   [junit4]   2> 2158337 INFO  (coreLoadExecutor-8716-thread-1) [    ] o.a.s.c.SolrConfig
Using Lucene MatchVersion: 7.1.0
   [junit4]   2> 2158346 INFO  (coreLoadExecutor-8716-thread-1) [    ] o.a.s.s.IndexSchema
[collection1] Schema name=test
   [junit4]   2> 2158349 INFO  (coreLoadExecutor-8716-thread-1) [    ] o.a.s.s.IndexSchema
Loaded schema test/1.0 with uniqueid field id
   [junit4]   2> 2158349 INFO  (coreLoadExecutor-8716-thread-1) [    ] o.a.s.c.CoreContainer
Creating SolrCore 'collection1' using configuration from instancedir C:\Users\jenkins\workspace\Lucene-Solr-7.x-Windows\solr\core\src\test-files\solr\collection1,
trusted=true
   [junit4]   2> 2158349 INFO  (coreLoadExecutor-8716-thread-1) [    ] o.a.s.m.r.SolrJmxReporter
JMX monitoring for 'solr.core.collection1' (registry 'solr.core.collection1') enabled at server:
com.sun.jmx.mbeanserver.JmxMBeanServer@2d9451
   [junit4]   2> 2158349 INFO  (coreLoadExecutor-8716-thread-1) [    ] o.a.s.c.SolrCore
solr.RecoveryStrategy.Builder
   [junit4]   2> 2158349 INFO  (coreLoadExecutor-8716-thread-1) [    ] o.a.s.c.SolrCore
[[collection1] ] Opening new SolrCore at [C:\Users\jenkins\workspace\Lucene-Solr-7.x-Windows\solr\core\src\test-files\solr\collection1],
dataDir=[C:\Users\jenkins\workspace\Lucene-Solr-7.x-Windows\solr\build\solr-core\test\J0\temp\solr.EchoParamsTest_B808C34BD07D5692-001\init-core-data-001\]
   [junit4]   2> 2158363 INFO  (coreLoadExecutor-8716-thread-1) [    ] o.a.s.u.RandomMergePolicy
RandomMergePolicy wrapping class org.apache.lucene.index.LogDocMergePolicy: [LogDocMergePolicy:
minMergeSize=1000, mergeFactor=36, maxMergeSize=9223372036854775807, maxMergeSizeForForcedMerge=9223372036854775807,
calibrateSizeByDeletes=true, maxMergeDocs=2147483647, maxCFSSegmentSizeMB=8.796093022207999E12,
noCFSRatio=0.851930869172785]
   [junit4]   2> 2158369 INFO  (coreLoadExecutor-8716-thread-1) [    ] o.a.s.r.XSLTResponseWriter
xsltCacheLifetimeSeconds=60
   [junit4]   2> 2158487 INFO  (coreLoadExecutor-8716-thread-1) [    ] o.a.s.u.CommitTracker
Hard AutoCommit: disabled
   [junit4]   2> 2158488 INFO  (coreLoadExecutor-8716-thread-1) [    ] o.a.s.u.CommitTracker
Soft AutoCommit: disabled
   [junit4]   2> 2158490 INFO  (coreLoadExecutor-8716-thread-1) [    ] o.a.s.u.RandomMergePolicy
RandomMergePolicy wrapping class org.apache.lucene.index.TieredMergePolicy: [TieredMergePolicy:
maxMergeAtOnce=20, maxMergeAtOnceExplicit=25, maxMergedSegmentMB=17.37890625, floorSegmentMB=0.927734375,
forceMergeDeletesPctAllowed=13.625026786262943, segmentsPerTier=22.0, maxCFSSegmentSizeMB=8.796093022207999E12,
noCFSRatio=0.5242262543539454
   [junit4]   2> 2158491 INFO  (coreLoadExecutor-8716-thread-1) [    ] o.a.s.s.SolrIndexSearcher
Opening [Searcher@7c0abc[collection1] main]
   [junit4]   2> 2158492 WARN  (coreLoadExecutor-8716-thread-1) [    ] o.a.s.r.ManagedResourceStorage
Cannot write to config directory C:\Users\jenkins\workspace\Lucene-Solr-7.x-Windows\solr\core\src\test-files\solr\collection1\conf;
switching to use InMemory storage instead.
   [junit4]   2> 2158492 INFO  (coreLoadExecutor-8716-thread-1) [    ] o.a.s.h.ReplicationHandler
Commits will be reserved for  10000
   [junit4]   2> 2158494 INFO  (searcherExecutor-8717-thread-1) [    ] o.a.s.c.SolrCore
[collection1] Registered new searcher Searcher@7c0abc[collection1] main{ExitableDirectoryReader(UninvertingDirectoryReader())}
   [junit4]   2> 2158495 INFO  (SUITE-EchoParamsTest-seed#[B808C34BD07D5692]-worker) [
   ] o.a.s.SolrTestCaseJ4 ####initCore end
   [junit4]   2> 2158497 INFO  (TEST-EchoParamsTest.test-seed#[B808C34BD07D5692]) [   
] o.a.s.SolrTestCaseJ4 ###Starting test
   [junit4]   2> 2158498 INFO  (TEST-EchoParamsTest.test-seed#[B808C34BD07D5692]) [   
] o.a.s.c.S.Request [collection1]  webapp=null path=null params={q=foo&qt=&start=0&rows=20&version=2.2&wt=xml}
hits=0 status=0 QTime=0
   [junit4]   2> 2158500 INFO  (TEST-EchoParamsTest.test-seed#[B808C34BD07D5692]) [   
] o.a.s.c.S.Request [collection1]  webapp=null path=null params={q=foo&qt=&start=0&rows=20&version=2.2&wt=xml}
hits=0 status=0 QTime=0
   [junit4]   2> 2158500 INFO  (TEST-EchoParamsTest.test-seed#[B808C34BD07D5692]) [   
] o.a.s.c.S.Request [collection1]  webapp=null path=null params={q=foo&qt=&start=0&rows=20&wt=xml}
hits=0 status=0 QTime=0
   [junit4]   2> 2158502 INFO  (TEST-EchoParamsTest.test-seed#[B808C34BD07D5692]) [   
] o.a.s.c.S.Request [collection1]  webapp=null path=null params={q=foo&qt=&start=0&rows=20&wt=xml}
hits=0 status=0 QTime=0
   [junit4]   2> 2158502 INFO  (TEST-EchoParamsTest.test-seed#[B808C34BD07D5692]) [   
] o.a.s.c.S.Request [collection1]  webapp=null path=null params={q=foo&qt=&echoParams=explicit&start=0&rows=20&wt=xml&version=2.2}
hits=0 status=0 QTime=0
   [junit4]   2> 2158502 INFO  (TEST-EchoParamsTest.test-seed#[B808C34BD07D5692]) [   
] o.a.s.c.S.Request [collection1]  webapp=null path=null params={q=foo&qt=&echoParams=explicit&start=0&rows=20&wt=xml&version=2.2}
hits=0 status=0 QTime=0
   [junit4]   2> 2158503 INFO  (TEST-EchoParamsTest.test-seed#[B808C34BD07D5692]) [   
] o.a.s.c.S.Request [collection1]  webapp=null path=null params={q=foo&qt=&echoParams=explicit&start=0&rows=20&wt=xml&version=2.2}
hits=0 status=0 QTime=0
   [junit4]   2> 2158503 INFO  (TEST-EchoParamsTest.test-seed#[B808C34BD07D5692]) [   
] o.a.s.c.S.Request [collection1]  webapp=null path=null params={echoHandler=true&q=foo&qt=/crazy_custom_qt&echoParams=all&start=0&rows=20&version=2.2&wt=xml}
hits=0 status=0 QTime=0
   [junit4]   2> 2158503 INFO  (TEST-EchoParamsTest.test-seed#[B808C34BD07D5692]) [   
] o.a.s.c.S.Request [collection1]  webapp=null path=null params={echoHandler=true&q=foo&qt=/crazy_custom_qt&echoParams=all&start=0&rows=20&version=2.2&wt=xml}
hits=0 status=0 QTime=0
   [junit4]   2> 2158503 INFO  (TEST-EchoParamsTest.test-seed#[B808C34BD07D5692]) [   
] o.a.s.SolrTestCaseJ4 ###Ending test
   [junit4]   2> 2158504 INFO  (SUITE-EchoParamsTest-seed#[B808C34BD07D5692]-worker) [
   ] o.a.s.SolrTestCaseJ4 ###deleteCore
   [junit4]   2> 2158504 INFO  (SUITE-EchoParamsTest-seed#[B808C34BD07D5692]-worker) [
   ] o.a.s.c.CoreContainer Shutting down CoreContainer instance=18029331
   [junit4]   2> 2158504 INFO  (SUITE-EchoParamsTest-seed#[B808C34BD07D5692]-worker) [
   ] o.a.s.m.SolrMetricManager Closing metric reporters for registry=solr.node, tag=null
   [junit4]   2> 2158505 INFO  (SUITE-EchoParamsTest-seed#[B808C34BD07D5692]-worker) [
   ] o.a.s.m.SolrMetricManager Closing metric reporters for registry=solr.jvm, tag=null
   [junit4]   2> 2158507 INFO  (SUITE-EchoParamsTest-seed#[B808C34BD07D5692]-worker) [
   ] o.a.s.m.SolrMetricManager Closing metric reporters for registry=solr.jetty, tag=null
   [junit4]   2> 2158508 INFO  (SUITE-EchoParamsTest-seed#[B808C34BD07D5692]-worker) [
   ] o.a.s.c.TransientSolrCoreCacheDefault Allocating transient cache for 2147483647 transient
cores
   [junit4]   2> 2158508 INFO  (coreCloseExecutor-8721-thread-1) [    ] o.a.s.c.SolrCore
[collection1]  CLOSING SolrCore org.apache.solr.core.SolrCore@17b84b5
   [junit4]   2> 2158511 INFO  (coreCloseExecutor-8721-thread-1) [    ] o.a.s.m.SolrMetricManager
Closing metric reporters for registry=solr.core.collection1, tag=24872117
   [junit4]   2> 2158516 INFO  (SUITE-EchoParamsTest-seed#[B808C34BD07D5692]-worker) [
   ] o.a.s.SolrTestCaseJ4 ------------------------------------------------------- Done waiting
for tracked resources to be released
   [junit4]   2> NOTE: test params are: codec=Lucene70, sim=RandomSimilarity(queryNorm=true):
{}, locale=lu, timezone=Pacific/Saipan
   [junit4]   2> NOTE: Windows 10 10.0 x86/Oracle Corporation 9-ea (32-bit)/cpus=3,threads=1,free=183068296,total=536870912
   [junit4]   2> NOTE: All tests run in this JVM: [ZkCLITest, TestCustomSort, TestLazyCores,
TestSQLHandler, SoftAutoCommitTest, TestSolrConfigHandler, TestStressLiveNodes, TestPolicyCloud,
TestTrieFacet, IgnoreCommitOptimizeUpdateProcessorFactoryTest, DirectSolrConnectionTest, DistributedQueryComponentCustomSortTest,
QueryParsingTest, QueryResultKeyTest, ScriptEngineTest, ConfigSetsAPITest, TestSolrCloudSnapshots,
TestComplexPhraseLeadingWildcard, SortByFunctionTest, TestStressVersions, TestPHPSerializedResponseWriter,
CdcrVersionReplicationTest, V2StandaloneTest, RequiredFieldsTest, TestPointFields, CoreSorterTest,
TestScoreJoinQPScore, ShardSplitTest, TestClusterStateMutator, TestDynamicFieldResource, TestHttpShardHandlerFactory,
ShufflingReplicaListTransformerTest, TestIBSimilarityFactory, TestOmitPositions, TestConfigOverlay,
MetricUtilsTest, SolrShardReporterTest, RestartWhileUpdatingTest, TestEmbeddedSolrServerSchemaAPI,
ClassificationUpdateProcessorIntegrationTest, UUIDFieldTest, HLLUtilTest, VMParamsZkACLAndCredentialsProvidersTest,
TestManagedResourceStorage, TestNestedDocsSort, TestLegacyNumericUtils, RegexBoostProcessorTest,
NotRequiredUniqueKeyTest, TestPKIAuthenticationPlugin, TestDistribIDF, TestDownShardTolerantSearch,
TestGeoJSONResponseWriter, TestMacros, BlobRepositoryCloudTest, TestStressRecovery, MetricsConfigTest,
QueryElevationComponentTest, DistributedFacetPivotLongTailTest, ReturnFieldsTest, TestLegacyNumericRangeQueryBuilder,
TestDocTermOrds, TestCloudJSONFacetJoinDomain, TestBulkSchemaAPI, RankQueryTest, ConjunctionSolrSpellCheckerTest,
TestReplicationHandler, TestRecoveryHdfs, ZkControllerTest, TestSolrCLIRunExample, TestCloudManagedSchema,
TestDistributedSearch, LeaderFailureAfterFreshStartTest, SolrTestCaseJ4Test, TestShardHandlerFactory,
TestFaceting, TemplateUpdateProcessorTest, TestAnalyzeInfixSuggestions, TestSubQueryTransformerDistrib,
TestDynamicLoading, DistributedSuggestComponentTest, PrimitiveFieldTypeTest, DocValuesTest,
TestCloudDeleteByQuery, TestTrackingShardHandlerFactory, TestNRTOpen, TestSubQueryTransformer,
DistributedVersionInfoTest, TestHdfsCloudBackupRestore, TestMissingGroups, NoCacheHeaderTest,
ClusterStateTest, TestSolrQueryResponse, PathHierarchyTokenizerFactoryTest, HdfsTlogReplayBufferedWhileIndexingTest,
CursorPagingTest, DistribJoinFromCollectionTest, TestConfigsApi, TestInfoStreamLogging, AnalysisErrorHandlingTest,
TestSizeLimitedDistributedMap, DistanceFunctionTest, PropertiesRequestHandlerTest, TestRequestStatusCollectionAPI,
HdfsChaosMonkeySafeLeaderTest, TestNumericRangeQuery64, TestJsonFacets, DeleteNodeTest, TestAddFieldRealTimeGet,
TestHdfsBackupRestoreCore, DeleteShardTest, CreateCollectionCleanupTest, SuggesterTest, SolrCLIZkUtilsTest,
SimpleFacetsTest, CleanupOldIndexTest, TestFunctionQuery, TestLocalFSCloudBackupRestore, TestNoOpRegenerator,
TestFieldCacheWithThreads, TestReqParamsAPI, TestMiniSolrCloudClusterSSL, OverseerCollectionConfigSetProcessorTest,
DirectUpdateHandlerTest, DistributedFacetExistsSmallTest, SolrIndexSplitterTest, TestXIncludeConfig,
TestSweetSpotSimilarityFactory, TestManagedSynonymFilterFactory, TestCursorMarkWithoutUniqueKey,
IndexBasedSpellCheckerTest, RuleEngineTest, TestTolerantSearch, TestNumericTerms32, TestReversedWildcardFilterFactory,
LeaderElectionContextKeyTest, TestFieldTypeResource, SolrMetricsIntegrationTest, CdcrBootstrapTest,
TestSmileRequest, DistributedFacetPivotSmallTest, TestWriterPerf, TestStressCloudBlindAtomicUpdates,
TestSolrCoreParser, BadCopyFieldTest, ReplaceNodeTest, AlternateDirectoryTest, TestCloudSchemaless,
TestSort, TestCloudPseudoReturnFields, TestConfigSetsAPIZkFailure, TestRawResponseWriter,
BlockJoinFacetRandomTest, TolerantUpdateProcessorTest, TestSearcherReuse, TestSlowCompositeReaderWrapper,
HttpSolrCallGetCoreTest, TestLMDirichletSimilarityFactory, LeaderInitiatedRecoveryOnShardRestartTest,
CollectionsAPISolrJTest, ForceLeaderTest, AnalysisAfterCoreReloadTest, TestSchemalessBufferedUpdates,
TestInPlaceUpdatesDistrib, TestXmlQParserPlugin, SolrCoreTest, TestManagedSchemaAPI, BlockDirectoryTest,
PKIAuthenticationIntegrationTest, HdfsWriteToMultipleCollectionsTest, TestLegacyField, TestStressReorder,
OverseerTaskQueueTest, XmlUpdateRequestHandlerTest, ClusterStateUpdateTest, IndexSchemaTest,
TestPullReplicaErrorHandling, SyncSliceTest, ShardRoutingTest, LeaderElectionTest, ShardRoutingCustomTest,
AutoCommitTest, DistributedSpellCheckComponentTest, TestCoreContainer, StatsComponentTest,
PeerSyncTest, ShowFileRequestHandlerTest, SimplePostToolTest, TestCoreDiscovery, SpellCheckCollatorTest,
TestFoldingMultitermQuery, TestTrie, SpatialFilterTest, SuggesterWFSTTest, WordBreakSolrSpellCheckerTest,
SolrCoreCheckLockOnStartupTest, TestPseudoReturnFields, TestAtomicUpdateErrorCases, DocValuesMultiTest,
SolrInfoBeanTest, DebugComponentTest, LukeRequestHandlerTest, DocumentAnalysisRequestHandlerTest,
TermsComponentTest, DocumentBuilderTest, TermVectorComponentTest, FieldAnalysisRequestHandlerTest,
SolrPluginUtilsTest, TestCollationField, UpdateRequestProcessorFactoryTest, MBeansHandlerTest,
UniqFieldsUpdateProcessorFactoryTest, TestPartialUpdateDeduplication, PingRequestHandlerTest,
TestLFUCache, TestFuzzyAnalyzedSuggestions, TestSolrCoreProperties, TestPhraseSuggestions,
EchoParamsTest]
   [junit4]   2> NOTE: reproduce with: ant test  -Dtestcase=EchoParamsTest -Dtests.seed=B808C34BD07D5692
-Dtests.slow=true -Dtests.locale=lu -Dtests.timezone=Pacific/Saipan -Dtests.asserts=true -Dtests.file.encoding=ISO-8859-1
   [junit4] ERROR   0.00s J0 | EchoParamsTest (suite) <<<
   [junit4]    > Throwable #1: java.io.IOException: Could not remove the following files
(in the order of attempts):
   [junit4]    >    C:\Users\jenkins\workspace\Lucene-Solr-7.x-Windows\solr\build\solr-core\test\J0\temp\solr.EchoParamsTest_B808C34BD07D5692-001\init-core-data-001:
java.nio.file.NoSuchFileException: C:\Users\jenkins\workspace\Lucene-Solr-7.x-Windows\solr\build\solr-core\test\J0\temp\solr.EchoParamsTest_B808C34BD07D5692-001\init-core-data-001
   [junit4]    > 	at __randomizedtesting.SeedInfo.seed([B808C34BD07D5692]:0)
   [junit4]    > 	at org.apache.lucene.util.IOUtils.rm(IOUtils.java:329)
   [junit4]    > 	at java.base/java.lang.Thread.run(Thread.java:844)
   [junit4] Completed [470/728 (1!)] on J0 in 0.36s, 1 test, 1 error <<< FAILURES!

[...truncated 801 lines...]
   [junit4] JVM J1: stdout was not empty, see: C:\Users\jenkins\workspace\Lucene-Solr-7.x-Windows\solr\build\solr-core\test\temp\junit4-J1-20170712_174333_22316374673099756239109.sysout
   [junit4] >>> JVM J1 emitted unexpected output (verbatim) ----
   [junit4] java.lang.OutOfMemoryError: Java heap space
   [junit4] Dumping heap to C:\Users\jenkins\workspace\Lucene-Solr-7.x-Windows\heapdumps\java_pid4032.hprof
...
   [junit4] Heap dump file created [318131472 bytes in 0.790 secs]
   [junit4] <<< JVM J1: EOF ----

[...truncated 7502 lines...]
BUILD FAILED
C:\Users\jenkins\workspace\Lucene-Solr-7.x-Windows\build.xml:810: The following error occurred
while executing this line:
C:\Users\jenkins\workspace\Lucene-Solr-7.x-Windows\build.xml:762: Some of the tests produced
a heap dump, but did not fail. Maybe a suppressed OutOfMemoryError? Dumps created:
* java_pid4032.hprof

Total time: 78 minutes 43 seconds
Build step 'Invoke Ant' marked build as failure
Archiving artifacts
[WARNINGS] Skipping publisher since build result is FAILURE
Recording test results
Email was triggered for: Failure - Any
Sending email for trigger: Failure - Any

Mime
View raw message