lucene-dev mailing list archives

Site index · List index
Message view « Date » · « Thread »
Top « Date » · « Thread »
From Policeman Jenkins Server <jenk...@thetaphi.de>
Subject [JENKINS-EA] Lucene-Solr-6.x-Linux (32bit/jdk-9-ea+175) - Build # 3876 - Unstable!
Date Sun, 02 Jul 2017 10:41:48 GMT
Build: https://jenkins.thetaphi.de/job/Lucene-Solr-6.x-Linux/3876/
Java: 32bit/jdk-9-ea+175 -client -XX:+UseG1GC --illegal-access=deny

1 tests failed.
FAILED:  org.apache.solr.cloud.TestSolrCloudWithDelegationTokens.testDelegationTokenRenew

Error Message:
expected:<200> but was:<403>

Stack Trace:
java.lang.AssertionError: expected:<200> but was:<403>
	at __randomizedtesting.SeedInfo.seed([A7F08E1FF27B0DB9:906B7A01CAB7D01D]:0)
	at org.junit.Assert.fail(Assert.java:93)
	at org.junit.Assert.failNotEquals(Assert.java:647)
	at org.junit.Assert.assertEquals(Assert.java:128)
	at org.junit.Assert.assertEquals(Assert.java:472)
	at org.junit.Assert.assertEquals(Assert.java:456)
	at org.apache.solr.cloud.TestSolrCloudWithDelegationTokens.renewDelegationToken(TestSolrCloudWithDelegationTokens.java:131)
	at org.apache.solr.cloud.TestSolrCloudWithDelegationTokens.verifyDelegationTokenRenew(TestSolrCloudWithDelegationTokens.java:317)
	at org.apache.solr.cloud.TestSolrCloudWithDelegationTokens.testDelegationTokenRenew(TestSolrCloudWithDelegationTokens.java:334)
	at java.base/jdk.internal.reflect.NativeMethodAccessorImpl.invoke0(Native Method)
	at java.base/jdk.internal.reflect.NativeMethodAccessorImpl.invoke(NativeMethodAccessorImpl.java:62)
	at java.base/jdk.internal.reflect.DelegatingMethodAccessorImpl.invoke(DelegatingMethodAccessorImpl.java:43)
	at java.base/java.lang.reflect.Method.invoke(Method.java:564)
	at com.carrotsearch.randomizedtesting.RandomizedRunner.invoke(RandomizedRunner.java:1713)
	at com.carrotsearch.randomizedtesting.RandomizedRunner$8.evaluate(RandomizedRunner.java:907)
	at com.carrotsearch.randomizedtesting.RandomizedRunner$9.evaluate(RandomizedRunner.java:943)
	at com.carrotsearch.randomizedtesting.RandomizedRunner$10.evaluate(RandomizedRunner.java:957)
	at com.carrotsearch.randomizedtesting.rules.SystemPropertiesRestoreRule$1.evaluate(SystemPropertiesRestoreRule.java:57)
	at org.apache.lucene.util.TestRuleSetupTeardownChained$1.evaluate(TestRuleSetupTeardownChained.java:49)
	at org.apache.lucene.util.AbstractBeforeAfterRule$1.evaluate(AbstractBeforeAfterRule.java:45)
	at org.apache.lucene.util.TestRuleThreadAndTestName$1.evaluate(TestRuleThreadAndTestName.java:48)
	at org.apache.lucene.util.TestRuleIgnoreAfterMaxFailures$1.evaluate(TestRuleIgnoreAfterMaxFailures.java:64)
	at org.apache.lucene.util.TestRuleMarkFailure$1.evaluate(TestRuleMarkFailure.java:47)
	at com.carrotsearch.randomizedtesting.rules.StatementAdapter.evaluate(StatementAdapter.java:36)
	at com.carrotsearch.randomizedtesting.ThreadLeakControl$StatementRunner.run(ThreadLeakControl.java:368)
	at com.carrotsearch.randomizedtesting.ThreadLeakControl.forkTimeoutingTask(ThreadLeakControl.java:817)
	at com.carrotsearch.randomizedtesting.ThreadLeakControl$3.evaluate(ThreadLeakControl.java:468)
	at com.carrotsearch.randomizedtesting.RandomizedRunner.runSingleTest(RandomizedRunner.java:916)
	at com.carrotsearch.randomizedtesting.RandomizedRunner$5.evaluate(RandomizedRunner.java:802)
	at com.carrotsearch.randomizedtesting.RandomizedRunner$6.evaluate(RandomizedRunner.java:852)
	at com.carrotsearch.randomizedtesting.RandomizedRunner$7.evaluate(RandomizedRunner.java:863)
	at com.carrotsearch.randomizedtesting.rules.StatementAdapter.evaluate(StatementAdapter.java:36)
	at com.carrotsearch.randomizedtesting.rules.SystemPropertiesRestoreRule$1.evaluate(SystemPropertiesRestoreRule.java:57)
	at org.apache.lucene.util.AbstractBeforeAfterRule$1.evaluate(AbstractBeforeAfterRule.java:45)
	at com.carrotsearch.randomizedtesting.rules.StatementAdapter.evaluate(StatementAdapter.java:36)
	at org.apache.lucene.util.TestRuleStoreClassName$1.evaluate(TestRuleStoreClassName.java:41)
	at com.carrotsearch.randomizedtesting.rules.NoShadowingOrOverridesOnMethodsRule$1.evaluate(NoShadowingOrOverridesOnMethodsRule.java:40)
	at com.carrotsearch.randomizedtesting.rules.NoShadowingOrOverridesOnMethodsRule$1.evaluate(NoShadowingOrOverridesOnMethodsRule.java:40)
	at com.carrotsearch.randomizedtesting.rules.StatementAdapter.evaluate(StatementAdapter.java:36)
	at com.carrotsearch.randomizedtesting.rules.StatementAdapter.evaluate(StatementAdapter.java:36)
	at org.apache.lucene.util.TestRuleAssertionsRequired$1.evaluate(TestRuleAssertionsRequired.java:53)
	at org.apache.lucene.util.TestRuleMarkFailure$1.evaluate(TestRuleMarkFailure.java:47)
	at org.apache.lucene.util.TestRuleIgnoreAfterMaxFailures$1.evaluate(TestRuleIgnoreAfterMaxFailures.java:64)
	at org.apache.lucene.util.TestRuleIgnoreTestSuites$1.evaluate(TestRuleIgnoreTestSuites.java:54)
	at com.carrotsearch.randomizedtesting.rules.StatementAdapter.evaluate(StatementAdapter.java:36)
	at com.carrotsearch.randomizedtesting.ThreadLeakControl$StatementRunner.run(ThreadLeakControl.java:368)
	at java.base/java.lang.Thread.run(Thread.java:844)




Build Log:
[...truncated 11527 lines...]
   [junit4] Suite: org.apache.solr.cloud.TestSolrCloudWithDelegationTokens
   [junit4]   2> Creating dataDir: /home/jenkins/workspace/Lucene-Solr-6.x-Linux/solr/build/solr-core/test/J1/temp/solr.cloud.TestSolrCloudWithDelegationTokens_A7F08E1FF27B0DB9-001/init-core-data-001
   [junit4]   2> 356941 WARN  (SUITE-TestSolrCloudWithDelegationTokens-seed#[A7F08E1FF27B0DB9]-worker) [    ] o.a.s.SolrTestCaseJ4 startTrackingSearchers: numOpens=2 numCloses=2
   [junit4]   2> 356942 INFO  (SUITE-TestSolrCloudWithDelegationTokens-seed#[A7F08E1FF27B0DB9]-worker) [    ] o.a.s.SolrTestCaseJ4 Using TrieFields
   [junit4]   2> 356942 INFO  (SUITE-TestSolrCloudWithDelegationTokens-seed#[A7F08E1FF27B0DB9]-worker) [    ] o.a.s.SolrTestCaseJ4 Randomized ssl (false) and clientAuth (false) via: @org.apache.solr.SolrTestCaseJ4$SuppressSSL(bugUrl="None")
   [junit4]   2> 356945 INFO  (SUITE-TestSolrCloudWithDelegationTokens-seed#[A7F08E1FF27B0DB9]-worker) [    ] o.a.s.c.MiniSolrCloudCluster Starting cluster of 2 servers in /home/jenkins/workspace/Lucene-Solr-6.x-Linux/solr/build/solr-core/test/J1/temp/solr.cloud.TestSolrCloudWithDelegationTokens_A7F08E1FF27B0DB9-001/tempDir-001
   [junit4]   2> 356946 INFO  (SUITE-TestSolrCloudWithDelegationTokens-seed#[A7F08E1FF27B0DB9]-worker) [    ] o.a.s.c.ZkTestServer STARTING ZK TEST SERVER
   [junit4]   2> 356946 INFO  (Thread-1180) [    ] o.a.s.c.ZkTestServer client port:0.0.0.0/0.0.0.0:0
   [junit4]   2> 356946 INFO  (Thread-1180) [    ] o.a.s.c.ZkTestServer Starting server
   [junit4]   2> 356948 ERROR (Thread-1180) [    ] o.a.z.s.ZooKeeperServer ZKShutdownHandler is not registered, so ZooKeeper server won't take any action on ERROR or SHUTDOWN server state changes
   [junit4]   2> 357046 INFO  (SUITE-TestSolrCloudWithDelegationTokens-seed#[A7F08E1FF27B0DB9]-worker) [    ] o.a.s.c.ZkTestServer start zk server on port:34907
   [junit4]   2> 357049 INFO  (jetty-launcher-728-thread-1) [    ] o.e.j.s.Server jetty-9.3.14.v20161028
   [junit4]   2> 357049 INFO  (jetty-launcher-728-thread-2) [    ] o.e.j.s.Server jetty-9.3.14.v20161028
   [junit4]   2> 357050 INFO  (jetty-launcher-728-thread-1) [    ] o.e.j.s.h.ContextHandler Started o.e.j.s.ServletContextHandler@a3f6c0{/solr,null,AVAILABLE}
   [junit4]   2> 357051 INFO  (jetty-launcher-728-thread-2) [    ] o.e.j.s.h.ContextHandler Started o.e.j.s.ServletContextHandler@fdf8c6{/solr,null,AVAILABLE}
   [junit4]   2> 357052 INFO  (jetty-launcher-728-thread-2) [    ] o.e.j.s.AbstractConnector Started ServerConnector@173dc7f{HTTP/1.1,[http/1.1]}{127.0.0.1:36879}
   [junit4]   2> 357052 INFO  (jetty-launcher-728-thread-1) [    ] o.e.j.s.AbstractConnector Started ServerConnector@a28146{HTTP/1.1,[http/1.1]}{127.0.0.1:33249}
   [junit4]   2> 357052 INFO  (jetty-launcher-728-thread-2) [    ] o.e.j.s.Server Started @358646ms
   [junit4]   2> 357052 INFO  (jetty-launcher-728-thread-1) [    ] o.e.j.s.Server Started @358646ms
   [junit4]   2> 357052 INFO  (jetty-launcher-728-thread-2) [    ] o.a.s.c.s.e.JettySolrRunner Jetty properties: {hostContext=/solr, hostPort=36879}
   [junit4]   2> 357052 INFO  (jetty-launcher-728-thread-1) [    ] o.a.s.c.s.e.JettySolrRunner Jetty properties: {hostContext=/solr, hostPort=33249}
   [junit4]   2> 357052 ERROR (jetty-launcher-728-thread-1) [    ] o.a.s.s.StartupLoggingUtils Missing Java Option solr.log.dir. Logging may be missing or incomplete.
   [junit4]   2> 357052 ERROR (jetty-launcher-728-thread-2) [    ] o.a.s.s.StartupLoggingUtils Missing Java Option solr.log.dir. Logging may be missing or incomplete.
   [junit4]   2> 357053 INFO  (jetty-launcher-728-thread-1) [    ] o.a.s.s.SolrDispatchFilter  ___      _       Welcome to Apache Solr™ version 6.7.0
   [junit4]   2> 357053 INFO  (jetty-launcher-728-thread-2) [    ] o.a.s.s.SolrDispatchFilter  ___      _       Welcome to Apache Solr™ version 6.7.0
   [junit4]   2> 357053 INFO  (jetty-launcher-728-thread-1) [    ] o.a.s.s.SolrDispatchFilter / __| ___| |_ _   Starting in cloud mode on port null
   [junit4]   2> 357053 INFO  (jetty-launcher-728-thread-2) [    ] o.a.s.s.SolrDispatchFilter / __| ___| |_ _   Starting in cloud mode on port null
   [junit4]   2> 357053 INFO  (jetty-launcher-728-thread-1) [    ] o.a.s.s.SolrDispatchFilter \__ \/ _ \ | '_|  Install dir: null
   [junit4]   2> 357053 INFO  (jetty-launcher-728-thread-2) [    ] o.a.s.s.SolrDispatchFilter \__ \/ _ \ | '_|  Install dir: null
   [junit4]   2> 357053 INFO  (jetty-launcher-728-thread-1) [    ] o.a.s.s.SolrDispatchFilter |___/\___/_|_|    Start time: 2017-07-02T10:10:37.280117Z
   [junit4]   2> 357053 INFO  (jetty-launcher-728-thread-2) [    ] o.a.s.s.SolrDispatchFilter |___/\___/_|_|    Start time: 2017-07-02T10:10:37.280129Z
   [junit4]   2> 357054 INFO  (jetty-launcher-728-thread-1) [    ] o.a.s.s.SolrDispatchFilter solr.xml found in ZooKeeper. Loading...
   [junit4]   2> 357054 INFO  (jetty-launcher-728-thread-2) [    ] o.a.s.s.SolrDispatchFilter solr.xml found in ZooKeeper. Loading...
   [junit4]   2> 357057 INFO  (jetty-launcher-728-thread-2) [    ] o.a.s.u.UpdateShardHandler Creating UpdateShardHandler HTTP client with params: socketTimeout=340000&connTimeout=45000&retry=true
   [junit4]   2> 357057 INFO  (jetty-launcher-728-thread-1) [    ] o.a.s.u.UpdateShardHandler Creating UpdateShardHandler HTTP client with params: socketTimeout=340000&connTimeout=45000&retry=true
   [junit4]   2> 357058 INFO  (jetty-launcher-728-thread-2) [    ] o.a.s.c.ZkContainer Zookeeper client=127.0.0.1:34907/solr
   [junit4]   2> 357058 INFO  (jetty-launcher-728-thread-1) [    ] o.a.s.c.ZkContainer Zookeeper client=127.0.0.1:34907/solr
   [junit4]   2> 357066 INFO  (jetty-launcher-728-thread-2) [    ] o.a.s.c.Overseer Overseer (id=null) closing
   [junit4]   2> 357066 INFO  (jetty-launcher-728-thread-1) [    ] o.a.s.c.Overseer Overseer (id=null) closing
   [junit4]   2> 357066 INFO  (jetty-launcher-728-thread-2) [    ] o.a.s.c.OverseerElectionContext I am going to be the leader 127.0.0.1:36879_solr
   [junit4]   2> 357066 INFO  (jetty-launcher-728-thread-1) [    ] o.a.s.c.ZkController Register node as live in ZooKeeper:/live_nodes/127.0.0.1:33249_solr
   [junit4]   2> 357066 INFO  (jetty-launcher-728-thread-2) [    ] o.a.s.c.Overseer Overseer (id=98237824183435270-127.0.0.1:36879_solr-n_0000000000) starting
   [junit4]   2> 357067 INFO  (zkCallback-739-thread-1) [    ] o.a.s.c.c.ZkStateReader Updated live nodes from ZooKeeper... (0) -> (1)
   [junit4]   2> 357070 INFO  (OverseerStateUpdate-98237824183435270-127.0.0.1:36879_solr-n_0000000000) [    ] o.a.s.c.c.ZkStateReader Updated live nodes from ZooKeeper... (0) -> (1)
   [junit4]   2> 357071 INFO  (jetty-launcher-728-thread-2) [    ] o.a.s.c.ZkController Register node as live in ZooKeeper:/live_nodes/127.0.0.1:36879_solr
   [junit4]   2> 357074 INFO  (zkCallback-739-thread-1) [    ] o.a.s.c.c.ZkStateReader Updated live nodes from ZooKeeper... (1) -> (2)
   [junit4]   2> 357074 INFO  (zkCallback-740-thread-1) [    ] o.a.s.c.c.ZkStateReader Updated live nodes from ZooKeeper... (1) -> (2)
   [junit4]   2> 357131 INFO  (jetty-launcher-728-thread-1) [    ] o.a.s.c.CoreContainer Initializing authentication plugin: org.apache.solr.security.HttpParamDelegationTokenPlugin
   [junit4]   2> 357133 WARN  (jetty-launcher-728-thread-1) [    ] o.a.s.c.s.i.Krb5HttpClientConfigurer org.apache.solr.client.solrj.impl.Krb5HttpClientConfigurer is configured without specifying system property 'java.security.auth.login.config'
   [junit4]   2> 357141 INFO  (jetty-launcher-728-thread-1) [    ] o.a.s.s.KerberosPlugin Params: {token.valid=30, delegation-token.token-kind=solr-dt, cookie.domain=127.0.0.1, cookie.path=/, zk-dt-secret-manager.znodeWorkingPath=solr/security/zkdtsm, token.validity=36000, signer.secret.provider.zookeeper.path=/token, type=kerberos, zk-dt-secret-manager.enable=true, kerberos.name.rules=DEFAULT, signer.secret.provider=zookeeper}
   [junit4]   2> 357165 INFO  (jetty-launcher-728-thread-2) [    ] o.a.s.c.CoreContainer Initializing authentication plugin: org.apache.solr.security.HttpParamDelegationTokenPlugin
   [junit4]   2> 357166 WARN  (jetty-launcher-728-thread-2) [    ] o.a.s.c.s.i.Krb5HttpClientConfigurer org.apache.solr.client.solrj.impl.Krb5HttpClientConfigurer is configured without specifying system property 'java.security.auth.login.config'
   [junit4]   2> 357166 INFO  (jetty-launcher-728-thread-2) [    ] o.a.s.s.KerberosPlugin Params: {token.valid=30, delegation-token.token-kind=solr-dt, cookie.domain=127.0.0.1, cookie.path=/, zk-dt-secret-manager.znodeWorkingPath=solr/security/zkdtsm, token.validity=36000, signer.secret.provider.zookeeper.path=/token, type=kerberos, zk-dt-secret-manager.enable=true, kerberos.name.rules=DEFAULT, signer.secret.provider=zookeeper}
   [junit4]   2> 357168 INFO  (jetty-launcher-728-thread-2) [    ] o.a.c.f.i.CuratorFrameworkImpl Starting
   [junit4]   2> 357168 INFO  (jetty-launcher-728-thread-1) [    ] o.a.c.f.i.CuratorFrameworkImpl Starting
   [junit4]   2> 357174 INFO  (jetty-launcher-728-thread-2-EventThread) [    ] o.a.c.f.s.ConnectionStateManager State change: CONNECTED
   [junit4]   2> 357174 INFO  (jetty-launcher-728-thread-1-EventThread) [    ] o.a.c.f.s.ConnectionStateManager State change: CONNECTED
   [junit4]   2> 357247 INFO  (jetty-launcher-728-thread-2) [    ] o.a.s.h.c.HttpShardHandlerFactory Reconfiguring the default client with: org.apache.solr.security.HttpParamDelegationTokenPlugin$2@146967b
   [junit4]   2> 357247 INFO  (jetty-launcher-728-thread-1) [    ] o.a.s.h.c.HttpShardHandlerFactory Reconfiguring the default client with: org.apache.solr.security.HttpParamDelegationTokenPlugin$2@1ef3ee5
   [junit4]   2> 357247 WARN  (jetty-launcher-728-thread-2) [    ] o.a.s.c.s.i.Krb5HttpClientConfigurer org.apache.solr.security.HttpParamDelegationTokenPlugin$2 is configured without specifying system property 'java.security.auth.login.config'
   [junit4]   2> 357247 WARN  (jetty-launcher-728-thread-1) [    ] o.a.s.c.s.i.Krb5HttpClientConfigurer org.apache.solr.security.HttpParamDelegationTokenPlugin$2 is configured without specifying system property 'java.security.auth.login.config'
   [junit4]   2> 357247 INFO  (jetty-launcher-728-thread-2) [    ] o.a.s.u.UpdateShardHandler Reconfiguring the default client with: org.apache.solr.security.HttpParamDelegationTokenPlugin$2@146967b
   [junit4]   2> 357247 INFO  (jetty-launcher-728-thread-1) [    ] o.a.s.u.UpdateShardHandler Reconfiguring the default client with: org.apache.solr.security.HttpParamDelegationTokenPlugin$2@1ef3ee5
   [junit4]   2> 357247 WARN  (jetty-launcher-728-thread-2) [    ] o.a.s.c.s.i.Krb5HttpClientConfigurer org.apache.solr.security.HttpParamDelegationTokenPlugin$2 is configured without specifying system property 'java.security.auth.login.config'
   [junit4]   2> 357247 WARN  (jetty-launcher-728-thread-1) [    ] o.a.s.c.s.i.Krb5HttpClientConfigurer org.apache.solr.security.HttpParamDelegationTokenPlugin$2 is configured without specifying system property 'java.security.auth.login.config'
   [junit4]   2> 357264 INFO  (jetty-launcher-728-thread-2) [    ] o.a.s.c.CorePropertiesLocator Found 0 core definitions underneath /home/jenkins/workspace/Lucene-Solr-6.x-Linux/solr/build/solr-core/test/J1/temp/solr.cloud.TestSolrCloudWithDelegationTokens_A7F08E1FF27B0DB9-001/tempDir-001/node2/.
   [junit4]   2> 357271 INFO  (jetty-launcher-728-thread-1) [    ] o.a.s.c.CorePropertiesLocator Found 0 core definitions underneath /home/jenkins/workspace/Lucene-Solr-6.x-Linux/solr/build/solr-core/test/J1/temp/solr.cloud.TestSolrCloudWithDelegationTokens_A7F08E1FF27B0DB9-001/tempDir-001/node1/.
   [junit4]   2> 357278 WARN  (SUITE-TestSolrCloudWithDelegationTokens-seed#[A7F08E1FF27B0DB9]-worker) [    ] o.a.s.c.s.i.Krb5HttpClientConfigurer org.apache.solr.security.HttpParamDelegationTokenPlugin$2 is configured without specifying system property 'java.security.auth.login.config'
   [junit4]   2> 357278 WARN  (SUITE-TestSolrCloudWithDelegationTokens-seed#[A7F08E1FF27B0DB9]-worker) [    ] o.a.s.c.s.i.Krb5HttpClientConfigurer org.apache.solr.security.HttpParamDelegationTokenPlugin$2 is configured without specifying system property 'java.security.auth.login.config'
   [junit4]   2> 357278 WARN  (SUITE-TestSolrCloudWithDelegationTokens-seed#[A7F08E1FF27B0DB9]-worker) [    ] o.a.s.c.s.i.Krb5HttpClientConfigurer org.apache.solr.security.HttpParamDelegationTokenPlugin$2 is configured without specifying system property 'java.security.auth.login.config'
   [junit4]   2> 357278 WARN  (SUITE-TestSolrCloudWithDelegationTokens-seed#[A7F08E1FF27B0DB9]-worker) [    ] o.a.s.c.s.i.Krb5HttpClientConfigurer org.apache.solr.security.HttpParamDelegationTokenPlugin$2 is configured without specifying system property 'java.security.auth.login.config'
   [junit4]   2> 357278 WARN  (SUITE-TestSolrCloudWithDelegationTokens-seed#[A7F08E1FF27B0DB9]-worker) [    ] o.a.s.c.s.i.Krb5HttpClientConfigurer org.apache.solr.security.HttpParamDelegationTokenPlugin$2 is configured without specifying system property 'java.security.auth.login.config'
   [junit4]   2> 357278 WARN  (SUITE-TestSolrCloudWithDelegationTokens-seed#[A7F08E1FF27B0DB9]-worker) [    ] o.a.s.c.s.i.Krb5HttpClientConfigurer org.apache.solr.security.HttpParamDelegationTokenPlugin$2 is configured without specifying system property 'java.security.auth.login.config'
   [junit4] IGNOR/A 0.00s J1 | TestSolrCloudWithDelegationTokens.testDelegationTokenCancelFail
   [junit4]    > Assumption #1: 'awaitsfix' test group is disabled (@AwaitsFix(bugUrl="https://issues.apache.org/jira/browse/HADOOP-14044"))
   [junit4]   2> 357288 INFO  (TEST-TestSolrCloudWithDelegationTokens.testDelegationTokenVerify-seed#[A7F08E1FF27B0DB9]) [    ] o.a.s.SolrTestCaseJ4 ###Starting testDelegationTokenVerify
   [junit4]   2> 357473 WARN  (TEST-TestSolrCloudWithDelegationTokens.testDelegationTokenVerify-seed#[A7F08E1FF27B0DB9]) [    ] o.a.s.c.s.i.Krb5HttpClientConfigurer org.apache.solr.security.HttpParamDelegationTokenPlugin$2 is configured without specifying system property 'java.security.auth.login.config'
   [junit4]   2> 357473 WARN  (TEST-TestSolrCloudWithDelegationTokens.testDelegationTokenVerify-seed#[A7F08E1FF27B0DB9]) [    ] o.a.s.c.s.i.Krb5HttpClientConfigurer org.apache.solr.security.HttpParamDelegationTokenPlugin$2 is configured without specifying system property 'java.security.auth.login.config'
   [junit4]   2> 357478 INFO  (qtp8489835-4620) [    ] o.a.s.h.a.CollectionsHandler Invoked Collection Action :list with params action=LIST&delegation=GgADYmFyA2JhcgCKAV0Cx9d-igFdJtRbfgEEFLSD4CqrJ6vy5fvSZyVcekbltEkWB3NvbHItZHQA&wt=javabin&version=2 and sendToOCPQueue=true
   [junit4]   2> 357478 INFO  (qtp8489835-4620) [    ] o.a.s.s.HttpSolrCall [admin] webapp=null path=/admin/collections params={action=LIST&delegation=GgADYmFyA2JhcgCKAV0Cx9d-igFdJtRbfgEEFLSD4CqrJ6vy5fvSZyVcekbltEkWB3NvbHItZHQA&wt=javabin&version=2} status=0 QTime=0
   [junit4]   2> 357479 WARN  (TEST-TestSolrCloudWithDelegationTokens.testDelegationTokenVerify-seed#[A7F08E1FF27B0DB9]) [    ] o.a.s.c.s.i.Krb5HttpClientConfigurer org.apache.solr.security.HttpParamDelegationTokenPlugin$2 is configured without specifying system property 'java.security.auth.login.config'
   [junit4]   2> 357479 WARN  (TEST-TestSolrCloudWithDelegationTokens.testDelegationTokenVerify-seed#[A7F08E1FF27B0DB9]) [    ] o.a.s.c.s.i.Krb5HttpClientConfigurer org.apache.solr.security.HttpParamDelegationTokenPlugin$2 is configured without specifying system property 'java.security.auth.login.config'
   [junit4]   2> 357481 INFO  (TEST-TestSolrCloudWithDelegationTokens.testDelegationTokenVerify-seed#[A7F08E1FF27B0DB9]) [    ] o.a.s.c.c.ZkStateReader Updated live nodes from ZooKeeper... (0) -> (2)
   [junit4]   2> 357481 INFO  (TEST-TestSolrCloudWithDelegationTokens.testDelegationTokenVerify-seed#[A7F08E1FF27B0DB9]) [    ] o.a.s.c.s.i.ZkClientClusterStateProvider Cluster at 127.0.0.1:34907/solr ready
   [junit4]   2> 357491 WARN  (TEST-TestSolrCloudWithDelegationTokens.testDelegationTokenVerify-seed#[A7F08E1FF27B0DB9]) [    ] o.a.h.c.p.ResponseProcessCookies Invalid cookie header: "Set-Cookie: hadoop.auth=; Path=/; Domain=127.0.0.1; Expires=  , 01-1 -1970 00:00:00 GMT; HttpOnly". Invalid 'expires' attribute: , 01-1 -1970 00:00:00 GMT
   [junit4]   2> 357492 WARN  (TEST-TestSolrCloudWithDelegationTokens.testDelegationTokenVerify-seed#[A7F08E1FF27B0DB9]) [    ] o.a.s.c.s.i.Krb5HttpClientConfigurer org.apache.solr.security.HttpParamDelegationTokenPlugin$2 is configured without specifying system property 'java.security.auth.login.config'
   [junit4]   2> 357493 WARN  (TEST-TestSolrCloudWithDelegationTokens.testDelegationTokenVerify-seed#[A7F08E1FF27B0DB9]) [    ] o.a.s.c.s.i.Krb5HttpClientConfigurer org.apache.solr.security.HttpParamDelegationTokenPlugin$2 is configured without specifying system property 'java.security.auth.login.config'
   [junit4]   2> 357494 INFO  (qtp18773118-4605) [    ] o.a.s.h.a.CollectionsHandler Invoked Collection Action :list with params action=LIST&delegation=GgADYmFyA2JhcgCKAV0Cx9d-igFdJtRbfgEEFLSD4CqrJ6vy5fvSZyVcekbltEkWB3NvbHItZHQA&wt=javabin&version=2 and sendToOCPQueue=true
   [junit4]   2> 357494 INFO  (qtp18773118-4605) [    ] o.a.s.s.HttpSolrCall [admin] webapp=null path=/admin/collections params={action=LIST&delegation=GgADYmFyA2JhcgCKAV0Cx9d-igFdJtRbfgEEFLSD4CqrJ6vy5fvSZyVcekbltEkWB3NvbHItZHQA&wt=javabin&version=2} status=0 QTime=0
   [junit4]   2> 357495 WARN  (TEST-TestSolrCloudWithDelegationTokens.testDelegationTokenVerify-seed#[A7F08E1FF27B0DB9]) [    ] o.a.s.c.s.i.Krb5HttpClientConfigurer org.apache.solr.security.HttpParamDelegationTokenPlugin$2 is configured without specifying system property 'java.security.auth.login.config'
   [junit4]   2> 357495 WARN  (TEST-TestSolrCloudWithDelegationTokens.testDelegationTokenVerify-seed#[A7F08E1FF27B0DB9]) [    ] o.a.s.c.s.i.Krb5HttpClientConfigurer org.apache.solr.security.HttpParamDelegationTokenPlugin$2 is configured without specifying system property 'java.security.auth.login.config'
   [junit4]   2> 357497 INFO  (TEST-TestSolrCloudWithDelegationTokens.testDelegationTokenVerify-seed#[A7F08E1FF27B0DB9]) [    ] o.a.s.c.c.ZkStateReader Updated live nodes from ZooKeeper... (0) -> (2)
   [junit4]   2> 357497 INFO  (TEST-TestSolrCloudWithDelegationTokens.testDelegationTokenVerify-seed#[A7F08E1FF27B0DB9]) [    ] o.a.s.c.s.i.ZkClientClusterStateProvider Cluster at 127.0.0.1:34907/solr ready
   [junit4]   2> 357499 WARN  (TEST-TestSolrCloudWithDelegationTokens.testDelegationTokenVerify-seed#[A7F08E1FF27B0DB9]) [    ] o.a.h.c.p.ResponseProcessCookies Invalid cookie header: "Set-Cookie: hadoop.auth=; Path=/; Domain=127.0.0.1; Expires=  , 01-1 -1970 00:00:00 GMT; HttpOnly". Invalid 'expires' attribute: , 01-1 -1970 00:00:00 GMT
   [junit4]   2> 357499 INFO  (TEST-TestSolrCloudWithDelegationTokens.testDelegationTokenVerify-seed#[A7F08E1FF27B0DB9]) [    ] o.a.s.SolrTestCaseJ4 ###Ending testDelegationTokenVerify
   [junit4]   2> 357513 INFO  (TEST-TestSolrCloudWithDelegationTokens.testDelegationOtherOp-seed#[A7F08E1FF27B0DB9]) [    ] o.a.s.SolrTestCaseJ4 ###Starting testDelegationOtherOp
   [junit4]   2> 357513 WARN  (TEST-TestSolrCloudWithDelegationTokens.testDelegationOtherOp-seed#[A7F08E1FF27B0DB9]) [    ] o.a.s.c.s.i.Krb5HttpClientConfigurer org.apache.solr.security.HttpParamDelegationTokenPlugin$2 is configured without specifying system property 'java.security.auth.login.config'
   [junit4]   2> 357513 WARN  (TEST-TestSolrCloudWithDelegationTokens.testDelegationOtherOp-seed#[A7F08E1FF27B0DB9]) [    ] o.a.s.c.s.i.Krb5HttpClientConfigurer org.apache.solr.security.HttpParamDelegationTokenPlugin$2 is configured without specifying system property 'java.security.auth.login.config'
   [junit4]   2> 357515 INFO  (qtp8489835-4608) [    ] o.a.s.h.a.CollectionsHandler Invoked Collection Action :list with params op=someSolrOperation&action=LIST&wt=javabin&version=2 and sendToOCPQueue=true
   [junit4]   2> 357515 INFO  (qtp8489835-4608) [    ] o.a.s.s.HttpSolrCall [admin] webapp=null path=/admin/collections params={op=someSolrOperation&action=LIST&wt=javabin&version=2} status=0 QTime=0
   [junit4]   2> 357515 WARN  (TEST-TestSolrCloudWithDelegationTokens.testDelegationOtherOp-seed#[A7F08E1FF27B0DB9]) [    ] o.a.h.c.p.ResponseProcessCookies Invalid cookie header: "Set-Cookie: hadoop.auth="u=bar&p=bar&t=test&e=1499026237741&s=ciT4/YS66IJvBTlPNQodRasbtQM="; Path=/; Domain=127.0.0.1; Expires=  , 02-7 -2017 20:10:37 GMT; HttpOnly". Invalid 'expires' attribute: , 02-7 -2017 20:10:37 GMT
   [junit4]   2> 357516 INFO  (TEST-TestSolrCloudWithDelegationTokens.testDelegationOtherOp-seed#[A7F08E1FF27B0DB9]) [    ] o.a.s.SolrTestCaseJ4 ###Ending testDelegationOtherOp
   [junit4]   2> 357527 INFO  (TEST-TestSolrCloudWithDelegationTokens.testDelegationTokenSolrClient-seed#[A7F08E1FF27B0DB9]) [    ] o.a.s.SolrTestCaseJ4 ###Starting testDelegationTokenSolrClient
   [junit4]   2> 357533 WARN  (TEST-TestSolrCloudWithDelegationTokens.testDelegationTokenSolrClient-seed#[A7F08E1FF27B0DB9]) [    ] o.a.s.c.s.i.Krb5HttpClientConfigurer org.apache.solr.security.HttpParamDelegationTokenPlugin$2 is configured without specifying system property 'java.security.auth.login.config'
   [junit4]   2> 357533 WARN  (TEST-TestSolrCloudWithDelegationTokens.testDelegationTokenSolrClient-seed#[A7F08E1FF27B0DB9]) [    ] o.a.s.c.s.i.Krb5HttpClientConfigurer org.apache.solr.security.HttpParamDelegationTokenPlugin$2 is configured without specifying system property 'java.security.auth.login.config'
   [junit4]   2> 357534 WARN  (TEST-TestSolrCloudWithDelegationTokens.testDelegationTokenSolrClient-seed#[A7F08E1FF27B0DB9]) [    ] o.a.h.c.p.ResponseProcessCookies Invalid cookie header: "Set-Cookie: hadoop.auth=; Path=/; Domain=127.0.0.1; Expires=  , 01-1 -1970 00:00:00 GMT; HttpOnly". Invalid 'expires' attribute: , 01-1 -1970 00:00:00 GMT
   [junit4]   2> 357535 WARN  (TEST-TestSolrCloudWithDelegationTokens.testDelegationTokenSolrClient-seed#[A7F08E1FF27B0DB9]) [    ] o.a.s.c.s.i.Krb5HttpClientConfigurer org.apache.solr.security.HttpParamDelegationTokenPlugin$2 is configured without specifying system property 'java.security.auth.login.config'
   [junit4]   2> 357535 WARN  (TEST-TestSolrCloudWithDelegationTokens.testDelegationTokenSolrClient-seed#[A7F08E1FF27B0DB9]) [    ] o.a.s.c.s.i.Krb5HttpClientConfigurer org.apache.solr.security.HttpParamDelegationTokenPlugin$2 is configured without specifying system property 'java.security.auth.login.config'
   [junit4]   2> 357536 INFO  (qtp8489835-4612) [    ] o.a.s.h.a.CollectionsHandler Invoked Collection Action :list with params action=LIST&delegation=GgADYmFyA2JhcgCKAV0Cx9g8igFdJtRcPAIEFO_YNdycKlTmhI-3Oy10bA31nqJaB3NvbHItZHQA&wt=javabin&version=2 and sendToOCPQueue=true
   [junit4]   2> 357536 INFO  (qtp8489835-4612) [    ] o.a.s.s.HttpSolrCall [admin] webapp=null path=/admin/collections params={action=LIST&delegation=GgADYmFyA2JhcgCKAV0Cx9g8igFdJtRcPAIEFO_YNdycKlTmhI-3Oy10bA31nqJaB3NvbHItZHQA&wt=javabin&version=2} status=0 QTime=0
   [junit4]   2> 357537 INFO  (TEST-TestSolrCloudWithDelegationTokens.testDelegationTokenSolrClient-seed#[A7F08E1FF27B0DB9]) [    ] o.a.s.SolrTestCaseJ4 ###Ending testDelegationTokenSolrClient
   [junit4]   2> 357547 INFO  (TEST-TestSolrCloudWithDelegationTokens.testDelegationTokenCancel-seed#[A7F08E1FF27B0DB9]) [    ] o.a.s.SolrTestCaseJ4 ###Starting testDelegationTokenCancel
   [junit4]   2> 357559 WARN  (TEST-TestSolrCloudWithDelegationTokens.testDelegationTokenCancel-seed#[A7F08E1FF27B0DB9]) [    ] o.a.s.c.s.i.Krb5HttpClientConfigurer org.apache.solr.security.HttpParamDelegationTokenPlugin$2 is configured without specifying system property 'java.security.auth.login.config'
   [junit4]   2> 357559 WARN  (TEST-TestSolrCloudWithDelegationTokens.testDelegationTokenCancel-seed#[A7F08E1FF27B0DB9]) [    ] o.a.s.c.s.i.Krb5HttpClientConfigurer org.apache.solr.security.HttpParamDelegationTokenPlugin$2 is configured without specifying system property 'java.security.auth.login.config'
   [junit4]   2> 357560 ERROR (qtp8489835-4620) [    ] o.a.h.s.t.d.ZKDelegationTokenSecretManager No node in path [/ZKDTSMTokensRoot/DT_3]
   [junit4]   2> 357570 WARN  (TEST-TestSolrCloudWithDelegationTokens.testDelegationTokenCancel-seed#[A7F08E1FF27B0DB9]) [    ] o.a.s.c.s.i.Krb5HttpClientConfigurer org.apache.solr.security.HttpParamDelegationTokenPlugin$2 is configured without specifying system property 'java.security.auth.login.config'
   [junit4]   2> 357570 WARN  (TEST-TestSolrCloudWithDelegationTokens.testDelegationTokenCancel-seed#[A7F08E1FF27B0DB9]) [    ] o.a.s.c.s.i.Krb5HttpClientConfigurer org.apache.solr.security.HttpParamDelegationTokenPlugin$2 is configured without specifying system property 'java.security.auth.login.config'
   [junit4]   2> 357571 WARN  (TEST-TestSolrCloudWithDelegationTokens.testDelegationTokenCancel-seed#[A7F08E1FF27B0DB9]) [    ] o.a.h.c.p.ResponseProcessCookies Invalid cookie header: "Set-Cookie: hadoop.auth=; Path=/; Domain=127.0.0.1; Expires=  , 01-1 -1970 00:00:00 GMT; HttpOnly". Invalid 'expires' attribute: , 01-1 -1970 00:00:00 GMT
   [junit4]   2> 357571 WARN  (TEST-TestSolrCloudWithDelegationTokens.testDelegationTokenCancel-seed#[A7F08E1FF27B0DB9]) [    ] o.a.s.c.s.i.Krb5HttpClientConfigurer org.apache.solr.security.HttpParamDelegationTokenPlugin$2 is configured without specifying system property 'java.security.auth.login.config'
   [junit4]   2> 357571 WARN  (TEST-TestSolrCloudWithDelegationTokens.testDelegationTokenCancel-seed#[A7F08E1FF27B0DB9]) [    ] o.a.s.c.s.i.Krb5HttpClientConfigurer org.apache.solr.security.HttpParamDelegationTokenPlugin$2 is configured without specifying system property 'java.security.auth.login.config'
   [junit4]   2> 357578 INFO  (TEST-TestSolrCloudWithDelegationTokens.testDelegationTokenCancel-seed#[A7F08E1FF27B0DB9]) [    ] o.a.s.c.c.ZkStateReader Updated live nodes from ZooKeeper... (0) -> (2)
   [junit4]   2> 357579 INFO  (TEST-TestSolrCloudWithDelegationTokens.testDelegationTokenCancel-seed#[A7F08E1FF27B0DB9]) [    ] o.a.s.c.s.i.ZkClientClusterStateProvider Cluster at 127.0.0.1:34907/solr ready
   [junit4]   2> 357580 WARN  (TEST-TestSolrCloudWithDelegationTokens.testDelegationTokenCancel-seed#[A7F08E1FF27B0DB9]) [    ] o.a.h.c.p.ResponseProcessCookies Invalid cookie header: "Set-Cookie: hadoop.auth=; Path=/; Domain=127.0.0.1; Expires=  , 01-1 -1970 00:00:00 GMT; HttpOnly". Invalid 'expires' attribute: , 01-1 -1970 00:00:00 GMT
   [junit4]   2> 357591 WARN  (TEST-TestSolrCloudWithDelegationTokens.testDelegationTokenCancel-seed#[A7F08E1FF27B0DB9]) [    ] o.a.s.c.s.i.Krb5HttpClientConfigurer org.apache.solr.security.HttpParamDelegationTokenPlugin$2 is configured without specifying system property 'java.security.auth.login.config'
   [junit4]   2> 357591 WARN  (TEST-TestSolrCloudWithDelegationTokens.testDelegationTokenCancel-seed#[A7F08E1FF27B0DB9]) [    ] o.a.s.c.s.i.Krb5HttpClientConfigurer org.apache.solr.security.HttpParamDelegationTokenPlugin$2 is configured without specifying system property 'java.security.auth.login.config'
   [junit4]   2> 357592 ERROR (qtp18773118-4615) [    ] o.a.h.s.t.d.ZKDelegationTokenSecretManager No node in path [/ZKDTSMTokensRoot/DT_4]
   [junit4]   2> 357595 WARN  (TEST-TestSolrCloudWithDelegationTokens.testDelegationTokenCancel-seed#[A7F08E1FF27B0DB9]) [    ] o.a.s.c.s.i.Krb5HttpClientConfigurer org.apache.solr.security.HttpParamDelegationTokenPlugin$2 is configured without specifying system property 'java.security.auth.login.config'
   [junit4]   2> 357595 WARN  (TEST-TestSolrCloudWithDelegationTokens.testDelegationTokenCancel-seed#[A7F08E1FF27B0DB9]) [    ] o.a.s.c.s.i.Krb5HttpClientConfigurer org.apache.solr.security.HttpParamDelegationTokenPlugin$2 is configured without specifying system property 'java.security.auth.login.config'
   [junit4]   2> 357596 WARN  (TEST-TestSolrCloudWithDelegationTokens.testDelegationTokenCancel-seed#[A7F08E1FF27B0DB9]) [    ] o.a.h.c.p.ResponseProcessCookies Invalid cookie header: "Set-Cookie: hadoop.auth=; Path=/; Domain=127.0.0.1; Expires=  , 01-1 -1970 00:00:00 GMT; HttpOnly". Invalid 'expires' attribute: , 01-1 -1970 00:00:00 GMT
   [junit4]   2> 357597 WARN  (TEST-TestSolrCloudWithDelegationTokens.testDelegationTokenCancel-seed#[A7F08E1FF27B0DB9]) [    ] o.a.s.c.s.i.Krb5HttpClientConfigurer org.apache.solr.security.HttpParamDelegationTokenPlugin$2 is configured without specifying system property 'java.security.auth.login.config'
   [junit4]   2> 357597 WARN  (TEST-TestSolrCloudWithDelegationTokens.testDelegationTokenCancel-seed#[A7F08E1FF27B0DB9]) [    ] o.a.s.c.s.i.Krb5HttpClientConfigurer org.apache.solr.security.HttpParamDelegationTokenPlugin$2 is configured without specifying system property 'java.security.auth.login.config'
   [junit4]   2> 357598 WARN  (TEST-TestSolrCloudWithDelegationTokens.testDelegationTokenCancel-seed#[A7F08E1FF27B0DB9]) [    ] o.a.h.c.p.ResponseProcessCookies Invalid cookie header: "Set-Cookie: hadoop.auth=; Path=/; Domain=127.0.0.1; Expires=  , 01-1 -1970 00:00:00 GMT; HttpOnly". Invalid 'expires' attribute: , 01-1 -1970 00:00:00 GMT
   [junit4]   2> 357599 INFO  (TEST-TestSolrCloudWithDelegationTokens.testDelegationTokenCancel-seed#[A7F08E1FF27B0DB9]) [    ] o.a.s.SolrTestCaseJ4 ###Ending testDelegationTokenCancel
   [junit4]   2> 357607 INFO  (TEST-TestSolrCloudWithDelegationTokens.testZNodePaths-seed#[A7F08E1FF27B0DB9]) [    ] o.a.s.SolrTestCaseJ4 ###Starting testZNodePaths
   [junit4]   2> 357641 INFO  (TEST-TestSolrCloudWithDelegationTokens.testZNodePaths-seed#[A7F08E1FF27B0DB9]) [    ] o.a.s.SolrTestCaseJ4 ###Ending testZNodePaths
   [junit4]   2> 357654 INFO  (TEST-TestSolrCloudWithDelegationTokens.testDelegationTokenRenewFail-seed#[A7F08E1FF27B0DB9]) [    ] o.a.s.SolrTestCaseJ4 ###Starting testDelegationTokenRenewFail
   [junit4]   2> 357663 WARN  (qtp8489835-4618) [    ] o.a.h.s.a.s.AuthenticationFilter Authentication exception: org.apache.hadoop.security.AccessControlException: foo tries to renew a token with renewer bar
   [junit4]   2> 357663 WARN  (qtp8489835-4618) [    ] o.a.s.s.KerberosPlugin Could not find org.apache.solr.security.authentication.requestcontinues
   [junit4]   2> 357664 WARN  (TEST-TestSolrCloudWithDelegationTokens.testDelegationTokenRenewFail-seed#[A7F08E1FF27B0DB9]) [    ] o.a.h.c.p.ResponseProcessCookies Invalid cookie header: "Set-Cookie: hadoop.auth=; Path=/; Domain=127.0.0.1; Expires=  , 01-1 -1970 00:00:00 GMT; HttpOnly". Invalid 'expires' attribute: , 01-1 -1970 00:00:00 GMT
   [junit4]   2> 357665 WARN  (qtp18773118-4609) [    ] o.a.h.s.a.s.AuthenticationFilter Authentication exception: org.apache.hadoop.security.AccessControlException: foo tries to renew a token with renewer bar
   [junit4]   2> 357666 WARN  (qtp18773118-4609) [    ] o.a.s.s.KerberosPlugin Could not find org.apache.solr.security.authentication.requestcontinues
   [junit4]   2> 357666 WARN  (TEST-TestSolrCloudWithDelegationTokens.testDelegationTokenRenewFail-seed#[A7F08E1FF27B0DB9]) [    ] o.a.h.c.p.ResponseProcessCookies Invalid cookie header: "Set-Cookie: hadoop.auth=; Path=/; Domain=127.0.0.1; Expires=  , 01-1 -1970 00:00:00 GMT; HttpOnly". Invalid 'expires' attribute: , 01-1 -1970 00:00:00 GMT
   [junit4]   2> 357672 WARN  (qtp8489835-4616) [    ] o.a.h.s.a.s.AuthenticationFilter Authentication exception: org.apache.hadoop.security.AccessControlException: notRenewUser tries to renew a token with renewer renewUser
   [junit4]   2> 357673 WARN  (qtp8489835-4616) [    ] o.a.s.s.KerberosPlugin Could not find org.apache.solr.security.authentication.requestcontinues
   [junit4]   2> 357673 WARN  (TEST-TestSolrCloudWithDelegationTokens.testDelegationTokenRenewFail-seed#[A7F08E1FF27B0DB9]) [    ] o.a.h.c.p.ResponseProcessCookies Invalid cookie header: "Set-Cookie: hadoop.auth=; Path=/; Domain=127.0.0.1; Expires=  , 01-1 -1970 00:00:00 GMT; HttpOnly". Invalid 'expires' attribute: , 01-1 -1970 00:00:00 GMT
   [junit4]   2> 357675 WARN  (qtp18773118-4617) [    ] o.a.h.s.a.s.AuthenticationFilter Authentication exception: org.apache.hadoop.security.AccessControlException: notRenewUser tries to renew a token with renewer renewUser
   [junit4]   2> 357676 WARN  (qtp18773118-4617) [    ] o.a.s.s.KerberosPlugin Could not find org.apache.solr.security.authentication.requestcontinues
   [junit4]   2> 357676 WARN  (TEST-TestSolrCloudWithDelegationTokens.testDelegationTokenRenewFail-seed#[A7F08E1FF27B0DB9]) [    ] o.a.h.c.p.ResponseProcessCookies Invalid cookie header: "Set-Cookie: hadoop.auth=; Path=/; Domain=127.0.0.1; Expires=  , 01-1 -1970 00:00:00 GMT; HttpOnly". Invalid 'expires' attribute: , 01-1 -1970 00:00:00 GMT
   [junit4]   2> 357676 INFO  (TEST-TestSolrCloudWithDelegationTokens.testDelegationTokenRenewFail-seed#[A7F08E1FF27B0DB9]) [    ] o.a.s.SolrTestCaseJ4 ###Ending testDelegationTokenRenewFail
   [junit4]   2> 357688 INFO  (TEST-TestSolrCloudWithDelegationTokens.testDelegationTokenRenew-seed#[A7F08E1FF27B0DB9]) [    ] o.a.s.SolrTestCaseJ4 ###Starting testDelegationTokenRenew
   [junit4]   2> 357694 WARN  (qtp8489835-4612) [    ] o.a.h.s.a.s.AuthenticationFilter Authentication exception: org.apache.hadoop.security.AccessControlException: bar is trying to renew a token with wrong password
   [junit4]   2> 357694 WARN  (qtp8489835-4612) [    ] o.a.s.s.KerberosPlugin Could not find org.apache.solr.security.authentication.requestcontinues
   [junit4]   2> 357695 WARN  (TEST-TestSolrCloudWithDelegationTokens.testDelegationTokenRenew-seed#[A7F08E1FF27B0DB9]) [    ] o.a.h.c.p.ResponseProcessCookies Invalid cookie header: "Set-Cookie: hadoop.auth=; Path=/; Domain=127.0.0.1; Expires=  , 01-1 -1970 00:00:00 GMT; HttpOnly". Invalid 'expires' attribute: , 01-1 -1970 00:00:00 GMT
   [junit4]   2> 357695 INFO  (TEST-TestSolrCloudWithDelegationTokens.testDelegationTokenRenew-seed#[A7F08E1FF27B0DB9]) [    ] o.a.s.SolrTestCaseJ4 ###Ending testDelegationTokenRenew
   [junit4]   2> NOTE: reproduce with: ant test  -Dtestcase=TestSolrCloudWithDelegationTokens -Dtests.method=testDelegationTokenRenew -Dtests.seed=A7F08E1FF27B0DB9 -Dtests.multiplier=3 -Dtests.slow=true -Dtests.locale=yue -Dtests.timezone=Universal -Dtests.asserts=true -Dtests.file.encoding=UTF-8
   [junit4] FAILURE 0.02s J1 | TestSolrCloudWithDelegationTokens.testDelegationTokenRenew <<<
   [junit4]    > Throwable #1: java.lang.AssertionError: expected:<200> but was:<403>
   [junit4]    > 	at __randomizedtesting.SeedInfo.seed([A7F08E1FF27B0DB9:906B7A01CAB7D01D]:0)
   [junit4]    > 	at org.apache.solr.cloud.TestSolrCloudWithDelegationTokens.renewDelegationToken(TestSolrCloudWithDelegationTokens.java:131)
   [junit4]    > 	at org.apache.solr.cloud.TestSolrCloudWithDelegationTokens.verifyDelegationTokenRenew(TestSolrCloudWithDelegationTokens.java:317)
   [junit4]    > 	at org.apache.solr.cloud.TestSolrCloudWithDelegationTokens.testDelegationTokenRenew(TestSolrCloudWithDelegationTokens.java:334)
   [junit4]    > 	at java.base/jdk.internal.reflect.NativeMethodAccessorImpl.invoke0(Native Method)
   [junit4]    > 	at java.base/jdk.internal.reflect.NativeMethodAccessorImpl.invoke(NativeMethodAccessorImpl.java:62)
   [junit4]    > 	at java.base/jdk.internal.reflect.DelegatingMethodAccessorImpl.invoke(DelegatingMethodAccessorImpl.java:43)
   [junit4]    > 	at java.base/java.lang.reflect.Method.invoke(Method.java:564)
   [junit4]    > 	at java.base/java.lang.Thread.run(Thread.java:844)
   [junit4]   2> 357711 INFO  (jetty-closer-729-thread-1) [    ] o.e.j.s.AbstractConnector Stopped ServerConnector@173dc7f{HTTP/1.1,[http/1.1]}{127.0.0.1:0}
   [junit4]   2> 357714 INFO  (jetty-closer-729-thread-1) [    ] o.a.s.c.CoreContainer Shutting down CoreContainer instance=1824848
   [junit4]   2> 357714 INFO  (jetty-closer-729-thread-2) [    ] o.e.j.s.AbstractConnector Stopped ServerConnector@a28146{HTTP/1.1,[http/1.1]}{127.0.0.1:0}
   [junit4]   2> 357714 INFO  (jetty-closer-729-thread-1) [    ] o.a.s.m.SolrMetricManager Closing metric reporters for: solr.node
   [junit4]   2> 357715 INFO  (jetty-closer-729-thread-1) [    ] o.a.s.m.SolrMetricManager Closing metric reporters for: solr.jvm
   [junit4]   2> 357715 INFO  (jetty-closer-729-thread-1) [    ] o.a.s.m.SolrMetricManager Closing metric reporters for: solr.jetty
   [junit4]   2> 357716 INFO  (jetty-closer-729-thread-1) [    ] o.a.s.c.TransientSolrCoreCacheDefault Allocating transient cache for 2147483647 transient cores
   [junit4]   2> 357716 INFO  (jetty-closer-729-thread-1) [    ] o.a.s.c.Overseer Overseer (id=98237824183435270-127.0.0.1:36879_solr-n_0000000000) closing
   [junit4]   2> 357716 INFO  (OverseerStateUpdate-98237824183435270-127.0.0.1:36879_solr-n_0000000000) [    ] o.a.s.c.Overseer Overseer Loop exiting : 127.0.0.1:36879_solr
   [junit4]   2> 357716 INFO  (jetty-closer-729-thread-2) [    ] o.a.s.c.CoreContainer Shutting down CoreContainer instance=23625714
   [junit4]   2> 357717 INFO  (jetty-closer-729-thread-2) [    ] o.a.s.m.SolrMetricManager Closing metric reporters for: solr.node
   [junit4]   2> 357717 INFO  (jetty-closer-729-thread-2) [    ] o.a.s.m.SolrMetricManager Closing metric reporters for: solr.jvm
   [junit4]   2> 357717 INFO  (jetty-closer-729-thread-2) [    ] o.a.s.m.SolrMetricManager Closing metric reporters for: solr.jetty
   [junit4]   2> 357723 WARN  (NIOServerCxn.Factory:0.0.0.0/0.0.0.0:0) [    ] o.a.z.s.NIOServerCnxn caught end of stream exception
   [junit4]   2> EndOfStreamException: Unable to read additional data from client sessionid 0x15d02c7d5f60006, likely client has closed socket
   [junit4]   2> 	at org.apache.zookeeper.server.NIOServerCnxn.doIO(NIOServerCnxn.java:239)
   [junit4]   2> 	at org.apache.zookeeper.server.NIOServerCnxnFactory.run(NIOServerCnxnFactory.java:203)
   [junit4]   2> 	at java.base/java.lang.Thread.run(Thread.java:844)
   [junit4]   2> 357723 INFO  (zkCallback-739-thread-1) [    ] o.a.s.c.c.ZkStateReader Updated live nodes from ZooKeeper... (2) -> (1)
   [junit4]   2> 357723 INFO  (zkCallback-739-thread-2) [    ] o.a.s.c.OverseerElectionContext I am going to be the leader 127.0.0.1:33249_solr
   [junit4]   2> 357724 INFO  (jetty-closer-729-thread-2) [    ] o.a.s.c.TransientSolrCoreCacheDefault Allocating transient cache for 2147483647 transient cores
   [junit4]   2> 359218 WARN  (zkCallback-740-thread-2) [    ] o.a.s.c.c.ZkStateReader ZooKeeper watch triggered, but Solr cannot talk to ZK: [KeeperErrorCode = Session expired for /live_nodes]
   [junit4]   2> 359218 ERROR (Thread[Thread-1197,5,TGRP-TestSolrCloudWithDelegationTokens]) [    ] o.a.h.s.t.d.AbstractDelegationTokenSecretManager ExpiredTokenRemover received java.lang.InterruptedException: sleep interrupted
   [junit4]   2> 359222 INFO  (jetty-closer-729-thread-1) [    ] o.e.j.s.h.ContextHandler Stopped o.e.j.s.ServletContextHandler@fdf8c6{/solr,null,UNAVAILABLE}
   [junit4]   2> 359224 WARN  (zkCallback-739-thread-1) [    ] o.a.s.c.c.ZkStateReader ZooKeeper watch triggered, but Solr cannot talk to ZK: [KeeperErrorCode = Session expired for /live_nodes]
   [junit4]   2> 359225 ERROR (Thread[Thread-1199,5,TGRP-TestSolrCloudWithDelegationTokens]) [    ] o.a.h.s.t.d.AbstractDelegationTokenSecretManager ExpiredTokenRemover received java.lang.InterruptedException: sleep interrupted
   [junit4]   2> 359226 INFO  (jetty-closer-729-thread-2) [    ] o.e.j.s.h.ContextHandler Stopped o.e.j.s.ServletContextHandler@a3f6c0{/solr,null,UNAVAILABLE}
   [junit4]   2> 359226 ERROR (SUITE-TestSolrCloudWithDelegationTokens-seed#[A7F08E1FF27B0DB9]-worker) [    ] o.a.z.s.ZooKeeperServer ZKShutdownHandler is not registered, so ZooKeeper server won't take any action on ERROR or SHUTDOWN server state changes
   [junit4]   2> 359226 INFO  (SUITE-TestSolrCloudWithDelegationTokens-seed#[A7F08E1FF27B0DB9]-worker) [    ] o.a.s.c.ZkTestServer connecting to 127.0.0.1:34907 34907
   [junit4]   2> 359260 INFO  (Thread-1180) [    ] o.a.s.c.ZkTestServer connecting to 127.0.0.1:34907 34907
   [junit4]   2> 359261 WARN  (Thread-1180) [    ] o.a.s.c.ZkTestServer Watch limit violations: 
   [junit4]   2> Maximum concurrent create/delete watches above limit:
   [junit4]   2> 
   [junit4]   2> 	5	/solr/aliases.json
   [junit4]   2> 	5	/solr/clusterprops.json
   [junit4]   2> 	2	/solr/security.json
   [junit4]   2> 
   [junit4]   2> Maximum concurrent data watches above limit:
   [junit4]   2> 
   [junit4]   2> 	5	/solr/clusterstate.json
   [junit4]   2> 	4	/solr/security/zkdtsm/ZKDTSMRoot/ZKDTSMKeyIdRoot
   [junit4]   2> 	2	/solr/security/zkdtsm/ZKDTSMRoot/ZKDTSMTokensRoot/DT_7
   [junit4]   2> 	2	/solr/security/zkdtsm/ZKDTSMRoot/ZKDTSMTokensRoot/DT_6
   [junit4]   2> 	2	/solr/security/zkdtsm/ZKDTSMRoot/ZKDTSMTokensRoot/DT_8
   [junit4]   2> 	2	/solr/security/zkdtsm/ZKDTSMRoot/ZKDTSMMasterKeyRoot/DK_1
   [junit4]   2> 	2	/solr/security/zkdtsm/ZKDTSMRoot/ZKDTSMTokensRoot/DT_1
   [junit4]   2> 	2	/solr/security/zkdtsm/ZKDTSMRoot/ZKDTSMTokensRoot/DT_3
   [junit4]   2> 	2	/solr/security/zkdtsm/ZKDTSMRoot/ZKDTSMMasterKeyRoot/DK_2
   [junit4]   2> 	2	/solr/security/zkdtsm/ZKDTSMRoot/ZKDTSMTokensRoot/DT_2
   [junit4]   2> 	2	/solr/security/zkdtsm/ZKDTSMRoot/ZKDTSMTokensRoot/DT_5
   [junit4]   2> 	2	/solr/security/zkdtsm/ZKDTSMRoot/ZKDTSMMasterKeyRoot/DK_4
   [junit4]   2> 	2	/solr/security/zkdtsm/ZKDTSMRoot/ZKDTSMTokensRoot/DT_4
   [junit4]   2> 	2	/solr/security/zkdtsm/ZKDTSMRoot/ZKDTSMSeqNumRoot
   [junit4]   2> 
   [junit4]   2> Maximum concurrent children watches above limit:
   [junit4]   2> 
   [junit4]   2> 	5	/solr/live_nodes
   [junit4]   2> 	5	/solr/collections
   [junit4]   2> 	2	/solr/security/zkdtsm/ZKDTSMRoot/ZKDTSMMasterKeyRoot
   [junit4]   2> 	2	/solr/security/zkdtsm/ZKDTSMRoot/ZKDTSMTokensRoot
   [junit4]   2> 
   [junit4]   2> 359261 INFO  (SUITE-TestSolrCloudWithDelegationTokens-seed#[A7F08E1FF27B0DB9]-worker) [    ] o.a.s.SolrTestCaseJ4 ###deleteCore
   [junit4]   2> NOTE: leaving temporary files on disk at: /home/jenkins/workspace/Lucene-Solr-6.x-Linux/solr/build/solr-core/test/J1/temp/solr.cloud.TestSolrCloudWithDelegationTokens_A7F08E1FF27B0DB9-001
   [junit4]   2> Jul 02, 2017 10:10:39 AM com.carrotsearch.randomizedtesting.ThreadLeakControl checkThreadLeaks
   [junit4]   2> WARNING: Will linger awaiting termination of 3 leaked thread(s).
   [junit4]   2> NOTE: test params are: codec=Asserting(Lucene62): {}, docValues:{}, maxPointsInLeafNode=55, maxMBSortInHeap=7.348371235290461, sim=RandomSimilarity(queryNorm=false,coord=no): {}, locale=yue, timezone=Universal
   [junit4]   2> NOTE: Linux 4.10.0-21-generic i386/Oracle Corporation 9 (32-bit)/cpus=8,threads=1,free=154766552,total=319815680
   [junit4]   2> NOTE: All tests run in this JVM: [HdfsBasicDistributedZkTest, JvmMetricsTest, TestDeleteCollectionOnDownNodes, BlockJoinFacetRandomTest, MBeansHandlerTest, TestIBSimilarityFactory, TestBinaryResponseWriter, WrapperMergePolicyFactoryTest, SynonymTokenizerTest, TestSimpleTrackingShardHandler, SegmentsInfoRequestHandlerTest, LargeFieldTest, SortSpecParsingTest, TestStressVersions, BigEndianAscendingWordSerializerTest, TestCollectionAPIs, UpdateRequestProcessorFactoryTest, EchoParamsTest, SimpleMLTQParserTest, TestComplexPhraseLeadingWildcard, TestUpdate, TestSystemCollAutoCreate, TestXmlQParser, SolrCloudExampleTest, ConvertedLegacyTest, TestRequestForwarding, TestNonDefinedSimilarityFactory, TestCopyFieldCollectionResource, JSONWriterTest, EnumFieldTest, MetricsHandlerTest, ExternalFileFieldSortTest, TestClusterProperties, TestConfigSetsAPIExclusivity, CollectionsAPIDistributedZkTest, AssignTest, TestDocBasedVersionConstraints, CSVRequestHandlerTest, TestExactSharedStatsCache, OutputWriterTest, DocValuesTest, SolrMetricReporterTest, TestLMDirichletSimilarityFactory, TestFieldCacheVsDocValues, TestSolr4Spatial2, RuleEngineTest, TestSearcherReuse, DisMaxRequestHandlerTest, OutOfBoxZkACLAndCredentialsProvidersTest, LukeRequestHandlerTest, TestFieldCollectionResource, DocValuesMultiTest, DateFieldTest, ZkCLITest, TestLRUCache, CoreSorterTest, DistributedDebugComponentTest, ZkControllerTest, OpenCloseCoreStressTest, PreAnalyzedFieldTest, ZkNodePropsTest, TestBlendedInfixSuggestions, IgnoreCommitOptimizeUpdateProcessorFactoryTest, SparseHLLTest, TestLockTree, HighlighterMaxOffsetTest, TestNumericTerms32, ClassificationUpdateProcessorTest, TestSchemaSimilarityResource, ShardRoutingCustomTest, TestManagedStopFilterFactory, ConnectionReuseTest, TestPhraseSuggestions, TestDistributedGrouping, TestAtomicUpdateErrorCases, TestRawResponseWriter, DocumentAnalysisRequestHandlerTest, SolrIndexConfigTest, DeleteReplicaTest, TestMiniSolrCloudClusterSSL, TestHalfAndHalfDocValues, TestReRankQParserPlugin, SuggesterTSTTest, TestDocSet, AddBlockUpdateTest, TestSchemalessBufferedUpdates, TestFieldCacheSanityChecker, ResourceLoaderTest, TestShardHandlerFactory, DistributedFacetPivotSmallTest, CoreAdminHandlerTest, TestBinaryField, TestSolrCloudWithDelegationTokens]
   [junit4] Completed [172/713 (1!)] on J1 in 3.09s, 8 tests, 1 failure, 1 skipped <<< FAILURES!

[...truncated 38250 lines...]

Mime
View raw message