lucene-dev mailing list archives

Site index · List index
Message view « Date » · « Thread »
Top « Date » · « Thread »
From Apache Jenkins Server <jenk...@builds.apache.org>
Subject [JENKINS] Lucene-Solr-Tests-7.0 - Build # 54 - Still Unstable
Date Thu, 20 Jul 2017 18:17:18 GMT
Build: https://builds.apache.org/job/Lucene-Solr-Tests-7.0/54/

2 tests failed.
FAILED:  org.apache.solr.update.AutoCommitTest.testMaxTime

Error Message:
Exception during query

Stack Trace:
java.lang.RuntimeException: Exception during query
	at __randomizedtesting.SeedInfo.seed([117A45E6A0C262F6:8B8E38043E58FECA]:0)
	at org.apache.solr.SolrTestCaseJ4.assertQ(SolrTestCaseJ4.java:878)
	at org.apache.solr.update.AutoCommitTest.testMaxTime(AutoCommitTest.java:270)
	at sun.reflect.NativeMethodAccessorImpl.invoke0(Native Method)
	at sun.reflect.NativeMethodAccessorImpl.invoke(NativeMethodAccessorImpl.java:62)
	at sun.reflect.DelegatingMethodAccessorImpl.invoke(DelegatingMethodAccessorImpl.java:43)
	at java.lang.reflect.Method.invoke(Method.java:498)
	at com.carrotsearch.randomizedtesting.RandomizedRunner.invoke(RandomizedRunner.java:1713)
	at com.carrotsearch.randomizedtesting.RandomizedRunner$8.evaluate(RandomizedRunner.java:907)
	at com.carrotsearch.randomizedtesting.RandomizedRunner$9.evaluate(RandomizedRunner.java:943)
	at com.carrotsearch.randomizedtesting.RandomizedRunner$10.evaluate(RandomizedRunner.java:957)
	at com.carrotsearch.randomizedtesting.rules.SystemPropertiesRestoreRule$1.evaluate(SystemPropertiesRestoreRule.java:57)
	at org.apache.lucene.util.TestRuleSetupTeardownChained$1.evaluate(TestRuleSetupTeardownChained.java:49)
	at org.apache.lucene.util.AbstractBeforeAfterRule$1.evaluate(AbstractBeforeAfterRule.java:45)
	at org.apache.lucene.util.TestRuleThreadAndTestName$1.evaluate(TestRuleThreadAndTestName.java:48)
	at org.apache.lucene.util.TestRuleIgnoreAfterMaxFailures$1.evaluate(TestRuleIgnoreAfterMaxFailures.java:64)
	at org.apache.lucene.util.TestRuleMarkFailure$1.evaluate(TestRuleMarkFailure.java:47)
	at com.carrotsearch.randomizedtesting.rules.StatementAdapter.evaluate(StatementAdapter.java:36)
	at com.carrotsearch.randomizedtesting.ThreadLeakControl$StatementRunner.run(ThreadLeakControl.java:368)
	at com.carrotsearch.randomizedtesting.ThreadLeakControl.forkTimeoutingTask(ThreadLeakControl.java:817)
	at com.carrotsearch.randomizedtesting.ThreadLeakControl$3.evaluate(ThreadLeakControl.java:468)
	at com.carrotsearch.randomizedtesting.RandomizedRunner.runSingleTest(RandomizedRunner.java:916)
	at com.carrotsearch.randomizedtesting.RandomizedRunner$5.evaluate(RandomizedRunner.java:802)
	at com.carrotsearch.randomizedtesting.RandomizedRunner$6.evaluate(RandomizedRunner.java:852)
	at com.carrotsearch.randomizedtesting.RandomizedRunner$7.evaluate(RandomizedRunner.java:863)
	at com.carrotsearch.randomizedtesting.rules.StatementAdapter.evaluate(StatementAdapter.java:36)
	at com.carrotsearch.randomizedtesting.rules.SystemPropertiesRestoreRule$1.evaluate(SystemPropertiesRestoreRule.java:57)
	at org.apache.lucene.util.AbstractBeforeAfterRule$1.evaluate(AbstractBeforeAfterRule.java:45)
	at com.carrotsearch.randomizedtesting.rules.StatementAdapter.evaluate(StatementAdapter.java:36)
	at org.apache.lucene.util.TestRuleStoreClassName$1.evaluate(TestRuleStoreClassName.java:41)
	at com.carrotsearch.randomizedtesting.rules.NoShadowingOrOverridesOnMethodsRule$1.evaluate(NoShadowingOrOverridesOnMethodsRule.java:40)
	at com.carrotsearch.randomizedtesting.rules.NoShadowingOrOverridesOnMethodsRule$1.evaluate(NoShadowingOrOverridesOnMethodsRule.java:40)
	at com.carrotsearch.randomizedtesting.rules.StatementAdapter.evaluate(StatementAdapter.java:36)
	at com.carrotsearch.randomizedtesting.rules.StatementAdapter.evaluate(StatementAdapter.java:36)
	at com.carrotsearch.randomizedtesting.rules.StatementAdapter.evaluate(StatementAdapter.java:36)
	at org.apache.lucene.util.TestRuleAssertionsRequired$1.evaluate(TestRuleAssertionsRequired.java:53)
	at org.apache.lucene.util.TestRuleMarkFailure$1.evaluate(TestRuleMarkFailure.java:47)
	at org.apache.lucene.util.TestRuleIgnoreAfterMaxFailures$1.evaluate(TestRuleIgnoreAfterMaxFailures.java:64)
	at org.apache.lucene.util.TestRuleIgnoreTestSuites$1.evaluate(TestRuleIgnoreTestSuites.java:54)
	at com.carrotsearch.randomizedtesting.rules.StatementAdapter.evaluate(StatementAdapter.java:36)
	at com.carrotsearch.randomizedtesting.ThreadLeakControl$StatementRunner.run(ThreadLeakControl.java:368)
	at java.lang.Thread.run(Thread.java:748)
Caused by: java.lang.RuntimeException: REQUEST FAILED: xpath=//result[@numFound=1]
	xml response was: <?xml version="1.0" encoding="UTF-8"?>
<response>
<lst name="responseHeader"><int name="status">0</int><int name="QTime">0</int></lst><result name="response" numFound="0" start="0"></result>
</response>

	request was:q=id:529&qt=&start=0&rows=20&version=2.2
	at org.apache.solr.SolrTestCaseJ4.assertQ(SolrTestCaseJ4.java:871)
	... 40 more


FAILED:  org.apache.solr.update.AutoCommitTest.testCommitWithin

Error Message:
Exception during query

Stack Trace:
java.lang.RuntimeException: Exception during query
	at __randomizedtesting.SeedInfo.seed([117A45E6A0C262F6:ABA82A9E23EC8CE3]:0)
	at org.apache.solr.SolrTestCaseJ4.assertQ(SolrTestCaseJ4.java:878)
	at org.apache.solr.update.AutoCommitTest.testCommitWithin(AutoCommitTest.java:353)
	at sun.reflect.NativeMethodAccessorImpl.invoke0(Native Method)
	at sun.reflect.NativeMethodAccessorImpl.invoke(NativeMethodAccessorImpl.java:62)
	at sun.reflect.DelegatingMethodAccessorImpl.invoke(DelegatingMethodAccessorImpl.java:43)
	at java.lang.reflect.Method.invoke(Method.java:498)
	at com.carrotsearch.randomizedtesting.RandomizedRunner.invoke(RandomizedRunner.java:1713)
	at com.carrotsearch.randomizedtesting.RandomizedRunner$8.evaluate(RandomizedRunner.java:907)
	at com.carrotsearch.randomizedtesting.RandomizedRunner$9.evaluate(RandomizedRunner.java:943)
	at com.carrotsearch.randomizedtesting.RandomizedRunner$10.evaluate(RandomizedRunner.java:957)
	at com.carrotsearch.randomizedtesting.rules.SystemPropertiesRestoreRule$1.evaluate(SystemPropertiesRestoreRule.java:57)
	at org.apache.lucene.util.TestRuleSetupTeardownChained$1.evaluate(TestRuleSetupTeardownChained.java:49)
	at org.apache.lucene.util.AbstractBeforeAfterRule$1.evaluate(AbstractBeforeAfterRule.java:45)
	at org.apache.lucene.util.TestRuleThreadAndTestName$1.evaluate(TestRuleThreadAndTestName.java:48)
	at org.apache.lucene.util.TestRuleIgnoreAfterMaxFailures$1.evaluate(TestRuleIgnoreAfterMaxFailures.java:64)
	at org.apache.lucene.util.TestRuleMarkFailure$1.evaluate(TestRuleMarkFailure.java:47)
	at com.carrotsearch.randomizedtesting.rules.StatementAdapter.evaluate(StatementAdapter.java:36)
	at com.carrotsearch.randomizedtesting.ThreadLeakControl$StatementRunner.run(ThreadLeakControl.java:368)
	at com.carrotsearch.randomizedtesting.ThreadLeakControl.forkTimeoutingTask(ThreadLeakControl.java:817)
	at com.carrotsearch.randomizedtesting.ThreadLeakControl$3.evaluate(ThreadLeakControl.java:468)
	at com.carrotsearch.randomizedtesting.RandomizedRunner.runSingleTest(RandomizedRunner.java:916)
	at com.carrotsearch.randomizedtesting.RandomizedRunner$5.evaluate(RandomizedRunner.java:802)
	at com.carrotsearch.randomizedtesting.RandomizedRunner$6.evaluate(RandomizedRunner.java:852)
	at com.carrotsearch.randomizedtesting.RandomizedRunner$7.evaluate(RandomizedRunner.java:863)
	at com.carrotsearch.randomizedtesting.rules.StatementAdapter.evaluate(StatementAdapter.java:36)
	at com.carrotsearch.randomizedtesting.rules.SystemPropertiesRestoreRule$1.evaluate(SystemPropertiesRestoreRule.java:57)
	at org.apache.lucene.util.AbstractBeforeAfterRule$1.evaluate(AbstractBeforeAfterRule.java:45)
	at com.carrotsearch.randomizedtesting.rules.StatementAdapter.evaluate(StatementAdapter.java:36)
	at org.apache.lucene.util.TestRuleStoreClassName$1.evaluate(TestRuleStoreClassName.java:41)
	at com.carrotsearch.randomizedtesting.rules.NoShadowingOrOverridesOnMethodsRule$1.evaluate(NoShadowingOrOverridesOnMethodsRule.java:40)
	at com.carrotsearch.randomizedtesting.rules.NoShadowingOrOverridesOnMethodsRule$1.evaluate(NoShadowingOrOverridesOnMethodsRule.java:40)
	at com.carrotsearch.randomizedtesting.rules.StatementAdapter.evaluate(StatementAdapter.java:36)
	at com.carrotsearch.randomizedtesting.rules.StatementAdapter.evaluate(StatementAdapter.java:36)
	at com.carrotsearch.randomizedtesting.rules.StatementAdapter.evaluate(StatementAdapter.java:36)
	at org.apache.lucene.util.TestRuleAssertionsRequired$1.evaluate(TestRuleAssertionsRequired.java:53)
	at org.apache.lucene.util.TestRuleMarkFailure$1.evaluate(TestRuleMarkFailure.java:47)
	at org.apache.lucene.util.TestRuleIgnoreAfterMaxFailures$1.evaluate(TestRuleIgnoreAfterMaxFailures.java:64)
	at org.apache.lucene.util.TestRuleIgnoreTestSuites$1.evaluate(TestRuleIgnoreTestSuites.java:54)
	at com.carrotsearch.randomizedtesting.rules.StatementAdapter.evaluate(StatementAdapter.java:36)
	at com.carrotsearch.randomizedtesting.ThreadLeakControl$StatementRunner.run(ThreadLeakControl.java:368)
	at java.lang.Thread.run(Thread.java:748)
Caused by: java.lang.RuntimeException: REQUEST FAILED: xpath=//result[@numFound=1]
	xml response was: <?xml version="1.0" encoding="UTF-8"?>
<response>
<lst name="responseHeader"><int name="status">0</int><int name="QTime">0</int></lst><result name="response" numFound="0" start="0"></result>
</response>

	request was:q=id:529&qt=&start=0&rows=20&version=2.2
	at org.apache.solr.SolrTestCaseJ4.assertQ(SolrTestCaseJ4.java:871)
	... 40 more




Build Log:
[...truncated 12082 lines...]
   [junit4] Suite: org.apache.solr.update.AutoCommitTest
   [junit4]   2> Creating dataDir: /x1/jenkins/jenkins-slave/workspace/Lucene-Solr-Tests-7.0/solr/build/solr-core/test/J0/temp/solr.update.AutoCommitTest_117A45E6A0C262F6-001/init-core-data-001
   [junit4]   2> 1160659 INFO  (SUITE-AutoCommitTest-seed#[117A45E6A0C262F6]-worker) [    ] o.a.s.SolrTestCaseJ4 Using TrieFields (NUMERIC_POINTS_SYSPROP=false) w/NUMERIC_DOCVALUES_SYSPROP=false
   [junit4]   2> 1160660 INFO  (SUITE-AutoCommitTest-seed#[117A45E6A0C262F6]-worker) [    ] o.a.s.SolrTestCaseJ4 Randomized ssl (true) and clientAuth (false) via: @org.apache.solr.util.RandomizeSSL(reason=, ssl=NaN, value=NaN, clientAuth=NaN)
   [junit4]   2> 1160660 INFO  (SUITE-AutoCommitTest-seed#[117A45E6A0C262F6]-worker) [    ] o.a.s.SolrTestCaseJ4 ####initCore
   [junit4]   2> 1160661 INFO  (SUITE-AutoCommitTest-seed#[117A45E6A0C262F6]-worker) [    ] o.a.s.c.SolrResourceLoader [null] Added 2 libs to classloader, from paths: [/x1/jenkins/jenkins-slave/workspace/Lucene-Solr-Tests-7.0/solr/core/src/test-files/solr/collection1/lib, /x1/jenkins/jenkins-slave/workspace/Lucene-Solr-Tests-7.0/solr/core/src/test-files/solr/collection1/lib/classes]
   [junit4]   2> 1160697 INFO  (SUITE-AutoCommitTest-seed#[117A45E6A0C262F6]-worker) [    ] o.a.s.c.SolrConfig Using Lucene MatchVersion: 7.0.0
   [junit4]   2> 1160717 INFO  (SUITE-AutoCommitTest-seed#[117A45E6A0C262F6]-worker) [    ] o.a.s.s.IndexSchema [null] Schema name=test
   [junit4]   2> 1160830 INFO  (SUITE-AutoCommitTest-seed#[117A45E6A0C262F6]-worker) [    ] o.a.s.s.IndexSchema Loaded schema test/1.0 with uniqueid field id
   [junit4]   2> 1160859 INFO  (SUITE-AutoCommitTest-seed#[117A45E6A0C262F6]-worker) [    ] o.a.s.m.r.SolrJmxReporter JMX monitoring for 'solr.node' (registry 'solr.node') enabled at server: com.sun.jmx.mbeanserver.JmxMBeanServer@7e16e93d
   [junit4]   2> 1160863 INFO  (SUITE-AutoCommitTest-seed#[117A45E6A0C262F6]-worker) [    ] o.a.s.m.r.SolrJmxReporter JMX monitoring for 'solr.jvm' (registry 'solr.jvm') enabled at server: com.sun.jmx.mbeanserver.JmxMBeanServer@7e16e93d
   [junit4]   2> 1160863 INFO  (SUITE-AutoCommitTest-seed#[117A45E6A0C262F6]-worker) [    ] o.a.s.m.r.SolrJmxReporter JMX monitoring for 'solr.jetty' (registry 'solr.jetty') enabled at server: com.sun.jmx.mbeanserver.JmxMBeanServer@7e16e93d
   [junit4]   2> 1160864 INFO  (coreLoadExecutor-4563-thread-1) [    x:collection1] o.a.s.c.SolrResourceLoader [null] Added 2 libs to classloader, from paths: [/x1/jenkins/jenkins-slave/workspace/Lucene-Solr-Tests-7.0/solr/core/src/test-files/solr/collection1/lib, /x1/jenkins/jenkins-slave/workspace/Lucene-Solr-Tests-7.0/solr/core/src/test-files/solr/collection1/lib/classes]
   [junit4]   2> 1160887 INFO  (coreLoadExecutor-4563-thread-1) [    x:collection1] o.a.s.c.SolrConfig Using Lucene MatchVersion: 7.0.0
   [junit4]   2> 1160907 INFO  (coreLoadExecutor-4563-thread-1) [    x:collection1] o.a.s.s.IndexSchema [collection1] Schema name=test
   [junit4]   2> 1161005 INFO  (coreLoadExecutor-4563-thread-1) [    x:collection1] o.a.s.s.IndexSchema Loaded schema test/1.0 with uniqueid field id
   [junit4]   2> 1161011 INFO  (coreLoadExecutor-4563-thread-1) [    x:collection1] o.a.s.c.CoreContainer Creating SolrCore 'collection1' using configuration from instancedir /x1/jenkins/jenkins-slave/workspace/Lucene-Solr-Tests-7.0/solr/core/src/test-files/solr/collection1, trusted=true
   [junit4]   2> 1161011 INFO  (coreLoadExecutor-4563-thread-1) [    x:collection1] o.a.s.m.r.SolrJmxReporter JMX monitoring for 'solr.core.collection1' (registry 'solr.core.collection1') enabled at server: com.sun.jmx.mbeanserver.JmxMBeanServer@7e16e93d
   [junit4]   2> 1161011 INFO  (coreLoadExecutor-4563-thread-1) [    x:collection1] o.a.s.c.SolrCore solr.RecoveryStrategy.Builder
   [junit4]   2> 1161011 INFO  (coreLoadExecutor-4563-thread-1) [    x:collection1] o.a.s.c.SolrCore [[collection1] ] Opening new SolrCore at [/x1/jenkins/jenkins-slave/workspace/Lucene-Solr-Tests-7.0/solr/core/src/test-files/solr/collection1], dataDir=[/x1/jenkins/jenkins-slave/workspace/Lucene-Solr-Tests-7.0/solr/build/solr-core/test/J0/temp/solr.update.AutoCommitTest_117A45E6A0C262F6-001/init-core-data-001/]
   [junit4]   2> 1161012 INFO  (coreLoadExecutor-4563-thread-1) [    x:collection1] o.a.s.u.RandomMergePolicy RandomMergePolicy wrapping class org.apache.lucene.index.LogByteSizeMergePolicy: [LogByteSizeMergePolicy: minMergeSize=1677721, mergeFactor=50, maxMergeSize=2147483648, maxMergeSizeForForcedMerge=9223372036854775807, calibrateSizeByDeletes=false, maxMergeDocs=2147483647, maxCFSSegmentSizeMB=8.796093022207999E12, noCFSRatio=0.0]
   [junit4]   2> 1161048 INFO  (coreLoadExecutor-4563-thread-1) [    x:collection1] o.a.s.u.UpdateHandler Using UpdateLog implementation: org.apache.solr.update.UpdateLog
   [junit4]   2> 1161048 INFO  (coreLoadExecutor-4563-thread-1) [    x:collection1] o.a.s.u.UpdateLog Initializing UpdateLog: dataDir= defaultSyncLevel=FLUSH numRecordsToKeep=100 maxNumLogsToKeep=10 numVersionBuckets=65536
   [junit4]   2> 1161049 INFO  (coreLoadExecutor-4563-thread-1) [    x:collection1] o.a.s.u.CommitTracker Hard AutoCommit: disabled
   [junit4]   2> 1161049 INFO  (coreLoadExecutor-4563-thread-1) [    x:collection1] o.a.s.u.CommitTracker Soft AutoCommit: disabled
   [junit4]   2> 1161050 INFO  (coreLoadExecutor-4563-thread-1) [    x:collection1] o.a.s.u.RandomMergePolicy RandomMergePolicy wrapping class org.apache.lucene.index.TieredMergePolicy: [TieredMergePolicy: maxMergeAtOnce=14, maxMergeAtOnceExplicit=31, maxMergedSegmentMB=21.49609375, floorSegmentMB=1.5576171875, forceMergeDeletesPctAllowed=10.546624147618264, segmentsPerTier=19.0, maxCFSSegmentSizeMB=8.796093022207999E12, noCFSRatio=0.0
   [junit4]   2> 1161050 INFO  (coreLoadExecutor-4563-thread-1) [    x:collection1] o.a.s.s.SolrIndexSearcher Opening [Searcher@751e64b0[collection1] main]
   [junit4]   2> 1161051 INFO  (coreLoadExecutor-4563-thread-1) [    x:collection1] o.a.s.h.c.SpellCheckComponent Initializing spell checkers
   [junit4]   2> 1161057 INFO  (coreLoadExecutor-4563-thread-1) [    x:collection1] o.a.s.s.DirectSolrSpellChecker init: {name=direct,classname=DirectSolrSpellChecker,field=lowerfilt,minQueryLength=3}
   [junit4]   2> 1161082 INFO  (coreLoadExecutor-4563-thread-1) [    x:collection1] o.a.s.h.ReplicationHandler Commits will be reserved for  10000
   [junit4]   2> 1161082 INFO  (searcherExecutor-4564-thread-1-processing-x:collection1) [    x:collection1] o.a.s.h.c.SpellCheckComponent Loading spell index for spellchecker: default
   [junit4]   2> 1161082 INFO  (coreLoadExecutor-4563-thread-1) [    x:collection1] o.a.s.u.UpdateLog Could not find max version in index or recent updates, using new clock 1573464053599174656
   [junit4]   2> 1161082 INFO  (searcherExecutor-4564-thread-1-processing-x:collection1) [    x:collection1] o.a.s.h.c.SpellCheckComponent Loading spell index for spellchecker: direct
   [junit4]   2> 1161082 INFO  (searcherExecutor-4564-thread-1-processing-x:collection1) [    x:collection1] o.a.s.h.c.SpellCheckComponent Loading spell index for spellchecker: wordbreak
   [junit4]   2> 1161082 INFO  (searcherExecutor-4564-thread-1-processing-x:collection1) [    x:collection1] o.a.s.h.c.SpellCheckComponent Loading spell index for spellchecker: multipleFields
   [junit4]   2> 1161083 INFO  (searcherExecutor-4564-thread-1-processing-x:collection1) [    x:collection1] o.a.s.h.c.SpellCheckComponent Loading spell index for spellchecker: jarowinkler
   [junit4]   2> 1161083 INFO  (searcherExecutor-4564-thread-1-processing-x:collection1) [    x:collection1] o.a.s.h.c.SpellCheckComponent Loading spell index for spellchecker: external
   [junit4]   2> 1161083 INFO  (searcherExecutor-4564-thread-1-processing-x:collection1) [    x:collection1] o.a.s.h.c.SpellCheckComponent Loading spell index for spellchecker: freq
   [junit4]   2> 1161083 INFO  (searcherExecutor-4564-thread-1-processing-x:collection1) [    x:collection1] o.a.s.h.c.SpellCheckComponent Loading spell index for spellchecker: fqcn
   [junit4]   2> 1161083 INFO  (searcherExecutor-4564-thread-1-processing-x:collection1) [    x:collection1] o.a.s.h.c.SpellCheckComponent Loading spell index for spellchecker: perDict
   [junit4]   2> 1161084 INFO  (searcherExecutor-4564-thread-1-processing-x:collection1) [    x:collection1] o.a.s.c.SolrCore [collection1] Registered new searcher Searcher@751e64b0[collection1] main{ExitableDirectoryReader(UninvertingDirectoryReader())}
   [junit4]   2> 1161086 INFO  (SUITE-AutoCommitTest-seed#[117A45E6A0C262F6]-worker) [    ] o.a.s.SolrTestCaseJ4 ####initCore end
   [junit4]   2> 1161088 INFO  (TEST-AutoCommitTest.testMaxDocs-seed#[117A45E6A0C262F6]) [    ] o.a.s.SolrTestCaseJ4 ###Starting testMaxDocs
   [junit4]   2> 1161089 INFO  (TEST-AutoCommitTest.testMaxDocs-seed#[117A45E6A0C262F6]) [    ] o.a.s.u.DirectUpdateHandler2 [collection1] REMOVING ALL DOCUMENTS FROM INDEX
   [junit4]   2> 1161089 INFO  (TEST-AutoCommitTest.testMaxDocs-seed#[117A45E6A0C262F6]) [    ] o.a.s.s.SolrIndexSearcher Opening [Searcher@3e2d2b05[collection1] realtime]
   [junit4]   2> 1161090 INFO  (TEST-AutoCommitTest.testMaxDocs-seed#[117A45E6A0C262F6]) [    ] o.a.s.u.p.LogUpdateProcessorFactory [collection1]  webapp=null path=null params={_version_=-9223372036854775807&update.distrib=FROMLEADER&versions=true&wt=json&indent=true}{deleteByQuery=*:* (-9223372036854775807)} 0 1
   [junit4]   2> 1161090 ERROR (TEST-AutoCommitTest.testMaxDocs-seed#[117A45E6A0C262F6]) [    ] o.a.s.c.CorePropertiesLocator Couldn't load core descriptor from /x1/jenkins/jenkins-slave/workspace/Lucene-Solr-Tests-7.0/solr/core/src/test-files/solr/collection1/core.properties:java.nio.file.NoSuchFileException: /x1/jenkins/jenkins-slave/workspace/Lucene-Solr-Tests-7.0/solr/core/src/test-files/solr/collection1/core.properties
   [junit4]   2> 1161090 INFO  (TEST-AutoCommitTest.testMaxDocs-seed#[117A45E6A0C262F6]) [    ] o.a.s.c.SolrResourceLoader [null] Added 2 libs to classloader, from paths: [/x1/jenkins/jenkins-slave/workspace/Lucene-Solr-Tests-7.0/solr/core/src/test-files/solr/collection1/lib, /x1/jenkins/jenkins-slave/workspace/Lucene-Solr-Tests-7.0/solr/core/src/test-files/solr/collection1/lib/classes]
   [junit4]   2> 1161114 INFO  (TEST-AutoCommitTest.testMaxDocs-seed#[117A45E6A0C262F6]) [    ] o.a.s.c.SolrConfig Using Lucene MatchVersion: 7.0.0
   [junit4]   2> 1161141 INFO  (TEST-AutoCommitTest.testMaxDocs-seed#[117A45E6A0C262F6]) [    ] o.a.s.s.IndexSchema [collection1] Schema name=test
   [junit4]   2> 1161236 INFO  (TEST-AutoCommitTest.testMaxDocs-seed#[117A45E6A0C262F6]) [    ] o.a.s.s.IndexSchema Loaded schema test/1.0 with uniqueid field id
   [junit4]   2> 1161251 INFO  (TEST-AutoCommitTest.testMaxDocs-seed#[117A45E6A0C262F6]) [    ] o.a.s.c.CoreContainer Reloading SolrCore 'collection1' using configuration from instancedir /x1/jenkins/jenkins-slave/workspace/Lucene-Solr-Tests-7.0/solr/core/src/test-files/solr/collection1
   [junit4]   2> 1161265 INFO  (TEST-AutoCommitTest.testMaxDocs-seed#[117A45E6A0C262F6]) [    x:collection1] o.a.s.m.r.SolrJmxReporter JMX monitoring for 'solr.core.collection1' (registry 'solr.core.collection1') enabled at server: com.sun.jmx.mbeanserver.JmxMBeanServer@7e16e93d
   [junit4]   2> 1161265 INFO  (TEST-AutoCommitTest.testMaxDocs-seed#[117A45E6A0C262F6]) [    x:collection1] o.a.s.c.SolrCore [[collection1] ] Opening new SolrCore at [/x1/jenkins/jenkins-slave/workspace/Lucene-Solr-Tests-7.0/solr/core/src/test-files/solr/collection1], dataDir=[/x1/jenkins/jenkins-slave/workspace/Lucene-Solr-Tests-7.0/solr/build/solr-core/test/J0/temp/solr.update.AutoCommitTest_117A45E6A0C262F6-001/init-core-data-001/]
   [junit4]   2> 1161304 INFO  (TEST-AutoCommitTest.testMaxDocs-seed#[117A45E6A0C262F6]) [    x:collection1] o.a.s.u.CommitTracker Hard AutoCommit: disabled
   [junit4]   2> 1161305 INFO  (TEST-AutoCommitTest.testMaxDocs-seed#[117A45E6A0C262F6]) [    x:collection1] o.a.s.u.CommitTracker Soft AutoCommit: disabled
   [junit4]   2> 1161306 INFO  (TEST-AutoCommitTest.testMaxDocs-seed#[117A45E6A0C262F6]) [    x:collection1] o.a.s.s.SolrIndexSearcher Opening [Searcher@26266ebe[collection1] main]
   [junit4]   2> 1161306 INFO  (TEST-AutoCommitTest.testMaxDocs-seed#[117A45E6A0C262F6]) [    x:collection1] o.a.s.h.c.SpellCheckComponent Initializing spell checkers
   [junit4]   2> 1161307 INFO  (TEST-AutoCommitTest.testMaxDocs-seed#[117A45E6A0C262F6]) [    x:collection1] o.a.s.s.DirectSolrSpellChecker init: {name=direct,classname=DirectSolrSpellChecker,field=lowerfilt,minQueryLength=3}
   [junit4]   2> 1161309 INFO  (TEST-AutoCommitTest.testMaxDocs-seed#[117A45E6A0C262F6]) [    x:collection1] o.a.s.h.ReplicationHandler Commits will be reserved for  10000
   [junit4]   2> 1161309 INFO  (searcherExecutor-4569-thread-1-processing-x:collection1) [    x:collection1] o.a.s.h.c.SpellCheckComponent Loading spell index for spellchecker: default
   [junit4]   2> 1161309 INFO  (TEST-AutoCommitTest.testMaxDocs-seed#[117A45E6A0C262F6]) [    x:collection1] o.a.s.u.UpdateLog Could not find max version in index or recent updates, using new clock 1573464053837201408
   [junit4]   2> 1161309 INFO  (searcherExecutor-4569-thread-1-processing-x:collection1) [    x:collection1] o.a.s.h.c.SpellCheckComponent Loading spell index for spellchecker: direct
   [junit4]   2> 1161309 INFO  (searcherExecutor-4569-thread-1-processing-x:collection1) [    x:collection1] o.a.s.h.c.SpellCheckComponent Loading spell index for spellchecker: wordbreak
   [junit4]   2> 1161309 INFO  (searcherExecutor-4569-thread-1-processing-x:collection1) [    x:collection1] o.a.s.h.c.SpellCheckComponent Loading spell index for spellchecker: multipleFields
   [junit4]   2> 1161310 INFO  (searcherExecutor-4569-thread-1-processing-x:collection1) [    x:collection1] o.a.s.h.c.SpellCheckComponent Loading spell index for spellchecker: jarowinkler
   [junit4]   2> 1161310 INFO  (searcherExecutor-4569-thread-1-processing-x:collection1) [    x:collection1] o.a.s.h.c.SpellCheckComponent Loading spell index for spellchecker: external
   [junit4]   2> 1161310 INFO  (searcherExecutor-4569-thread-1-processing-x:collection1) [    x:collection1] o.a.s.h.c.SpellCheckComponent Loading spell index for spellchecker: freq
   [junit4]   2> 1161310 INFO  (searcherExecutor-4569-thread-1-processing-x:collection1) [    x:collection1] o.a.s.h.c.SpellCheckComponent Loading spell index for spellchecker: fqcn
   [junit4]   2> 1161310 INFO  (searcherExecutor-4569-thread-1-processing-x:collection1) [    x:collection1] o.a.s.h.c.SpellCheckComponent Loading spell index for spellchecker: perDict
   [junit4]   2> 1161313 INFO  (searcherExecutor-4569-thread-1-processing-x:collection1) [    x:collection1] o.a.s.c.SolrCore [collection1] Registered new searcher Searcher@26266ebe[collection1] main{ExitableDirectoryReader(UninvertingDirectoryReader())}
   [junit4]   2> 1161313 INFO  (TEST-AutoCommitTest.testMaxDocs-seed#[117A45E6A0C262F6]) [    x:collection1] o.a.s.u.RandomMergePolicy RandomMergePolicy wrapping class org.apache.lucene.index.TieredMergePolicy: [TieredMergePolicy: maxMergeAtOnce=22, maxMergeAtOnceExplicit=19, maxMergedSegmentMB=76.8876953125, floorSegmentMB=1.4501953125, forceMergeDeletesPctAllowed=17.27338611325879, segmentsPerTier=24.0, maxCFSSegmentSizeMB=8.796093022207999E12, noCFSRatio=0.11522640229100266
   [junit4]   2> 1161313 INFO  (TEST-AutoCommitTest.testMaxDocs-seed#[117A45E6A0C262F6]) [    x:collection1] o.a.s.u.DefaultSolrCoreState New IndexWriter is ready to be used.
   [junit4]   2> 1161313 INFO  (TEST-AutoCommitTest.testMaxDocs-seed#[117A45E6A0C262F6]) [    x:collection1] o.a.s.s.SolrIndexSearcher Opening [Searcher@3326d9f2[collection1] main]
   [junit4]   2> 1161314 INFO  (TEST-AutoCommitTest.testMaxDocs-seed#[117A45E6A0C262F6]) [    x:collection1] o.a.s.c.SolrCore [collection1]  CLOSING SolrCore org.apache.solr.core.SolrCore@5741f206
   [junit4]   2> 1161314 INFO  (TEST-AutoCommitTest.testMaxDocs-seed#[117A45E6A0C262F6]) [    x:collection1] o.a.s.m.SolrMetricManager Closing metric reporters for registry=solr.core.collection1, tag=1463939590
   [junit4]   2> 1161315 INFO  (searcherExecutor-4569-thread-1-processing-x:collection1) [    x:collection1] o.a.s.c.SolrCore [collection1] Registered new searcher Searcher@3326d9f2[collection1] main{ExitableDirectoryReader(UninvertingDirectoryReader())}
   [junit4]   2> 1161321 INFO  (TEST-AutoCommitTest.testMaxDocs-seed#[117A45E6A0C262F6]) [    x:collection1] o.a.s.u.p.LogUpdateProcessorFactory [collection1] {add=[0 (1573464053848735744)]} 0 1
   [junit4]   2> 1161321 INFO  (TEST-AutoCommitTest.testMaxDocs-seed#[117A45E6A0C262F6]) [    x:collection1] o.a.s.u.p.LogUpdateProcessorFactory [collection1] {add=[1 (1573464053849784320)]} 0 1
   [junit4]   2> 1161321 INFO  (TEST-AutoCommitTest.testMaxDocs-seed#[117A45E6A0C262F6]) [    x:collection1] o.a.s.u.p.LogUpdateProcessorFactory [collection1] {add=[2 (1573464053849784321)]} 0 2
   [junit4]   2> 1161322 INFO  (TEST-AutoCommitTest.testMaxDocs-seed#[117A45E6A0C262F6]) [    x:collection1] o.a.s.u.p.LogUpdateProcessorFactory [collection1] {add=[3 (1573464053850832896)]} 0 2
   [junit4]   2> 1161322 INFO  (TEST-AutoCommitTest.testMaxDocs-seed#[117A45E6A0C262F6]) [    x:collection1] o.a.s.u.p.LogUpdateProcessorFactory [collection1] {add=[4 (1573464053850832897)]} 0 2
   [junit4]   2> 1161322 INFO  (TEST-AutoCommitTest.testMaxDocs-seed#[117A45E6A0C262F6]) [    x:collection1] o.a.s.u.p.LogUpdateProcessorFactory [collection1] {add=[5 (1573464053850832898)]} 0 2
   [junit4]   2> 1161322 INFO  (TEST-AutoCommitTest.testMaxDocs-seed#[117A45E6A0C262F6]) [    x:collection1] o.a.s.u.p.LogUpdateProcessorFactory [collection1] {add=[6 (1573464053850832899)]} 0 3
   [junit4]   2> 1161322 INFO  (TEST-AutoCommitTest.testMaxDocs-seed#[117A45E6A0C262F6]) [    x:collection1] o.a.s.u.p.LogUpdateProcessorFactory [collection1] {add=[7 (1573464053850832900)]} 0 3
   [junit4]   2> 1161323 INFO  (TEST-AutoCommitTest.testMaxDocs-seed#[117A45E6A0C262F6]) [    x:collection1] o.a.s.u.p.LogUpdateProcessorFactory [collection1] {add=[8 (1573464053851881472)]} 0 3
   [junit4]   2> 1161323 INFO  (TEST-AutoCommitTest.testMaxDocs-seed#[117A45E6A0C262F6]) [    x:collection1] o.a.s.u.p.LogUpdateProcessorFactory [collection1] {add=[9 (1573464053851881473)]} 0 3
   [junit4]   2> 1161323 INFO  (TEST-AutoCommitTest.testMaxDocs-seed#[117A45E6A0C262F6]) [    x:collection1] o.a.s.u.p.LogUpdateProcessorFactory [collection1] {add=[10 (1573464053851881474)]} 0 3
   [junit4]   2> 1161323 INFO  (TEST-AutoCommitTest.testMaxDocs-seed#[117A45E6A0C262F6]) [    x:collection1] o.a.s.u.p.LogUpdateProcessorFactory [collection1] {add=[11 (1573464053851881475)]} 0 3
   [junit4]   2> 1161323 INFO  (TEST-AutoCommitTest.testMaxDocs-seed#[117A45E6A0C262F6]) [    x:collection1] o.a.s.u.p.LogUpdateProcessorFactory [collection1] {add=[12 (1573464053851881476)]} 0 3
   [junit4]   2> 1161323 INFO  (TEST-AutoCommitTest.testMaxDocs-seed#[117A45E6A0C262F6]) [    x:collection1] o.a.s.u.p.LogUpdateProcessorFactory [collection1] {add=[13 (1573464053851881477)]} 0 4
   [junit4]   2> 1161324 INFO  (TEST-AutoCommitTest.testMaxDocs-seed#[117A45E6A0C262F6]) [    x:collection1] o.a.s.c.S.Request [collection1]  webapp=null path=null params={q=id:1&qt=&start=0&rows=20&version=2.2} hits=0 status=0 QTime=0
   [junit4]   2> 1161326 INFO  (TEST-AutoCommitTest.testMaxDocs-seed#[117A45E6A0C262F6]) [    x:collection1] o.a.s.u.p.LogUpdateProcessorFactory [collection1] {add=[14 (1573464053853978624)]} 0 6
   [junit4]   2> 1161327 INFO  (commitScheduler-4572-thread-1) [    x:collection1] o.a.s.u.DirectUpdateHandler2 start commit{,optimize=false,openSearcher=true,waitSearcher=true,expungeDeletes=false,softCommit=true,prepareCommit=false}
   [junit4]   2> 1161329 INFO  (commitScheduler-4572-thread-1) [    x:collection1] o.a.s.s.SolrIndexSearcher Opening [Searcher@4a259c7c[collection1] main]
   [junit4]   2> 1161329 INFO  (commitScheduler-4572-thread-1) [    x:collection1] o.a.s.u.DirectUpdateHandler2 end_commit_flush
   [junit4]   2> 1161330 INFO  (searcherExecutor-4569-thread-1-processing-x:collection1) [    x:collection1] o.a.s.c.SolrCore [collection1] Registered new searcher Searcher@4a259c7c[collection1] main{ExitableDirectoryReader(UninvertingDirectoryReader(Uninverting(_0(7.0.0):c15)))}
   [junit4]   2> 1161576 INFO  (TEST-AutoCommitTest.testMaxDocs-seed#[117A45E6A0C262F6]) [    x:collection1] o.a.s.u.p.LogUpdateProcessorFactory [collection1] {add=[15 (1573464054117171200)]} 0 257
   [junit4]   2> 1161577 INFO  (TEST-AutoCommitTest.testMaxDocs-seed#[117A45E6A0C262F6]) [    x:collection1] o.a.s.c.S.Request [collection1]  webapp=null path=null params={q=id:14&qt=&start=0&rows=20&version=2.2} hits=1 status=0 QTime=0
   [junit4]   2> 1161577 INFO  (TEST-AutoCommitTest.testMaxDocs-seed#[117A45E6A0C262F6]) [    x:collection1] o.a.s.c.S.Request [collection1]  webapp=null path=null params={q=id:15&qt=&start=0&rows=20&version=2.2} hits=0 status=0 QTime=0
   [junit4]   2> 1161578 INFO  (TEST-AutoCommitTest.testMaxDocs-seed#[117A45E6A0C262F6]) [    x:collection1] o.a.s.SolrTestCaseJ4 ###Ending testMaxDocs
   [junit4]   2> 1161580 INFO  (TEST-AutoCommitTest.testMaxTime-seed#[117A45E6A0C262F6]) [    x:collection1] o.a.s.SolrTestCaseJ4 ###Starting testMaxTime
   [junit4]   2> 1161580 INFO  (TEST-AutoCommitTest.testMaxTime-seed#[117A45E6A0C262F6]) [    x:collection1] o.a.s.u.DirectUpdateHandler2 [collection1] REMOVING ALL DOCUMENTS FROM INDEX
   [junit4]   2> 1161580 INFO  (TEST-AutoCommitTest.testMaxTime-seed#[117A45E6A0C262F6]) [    x:collection1] o.a.s.s.SolrIndexSearcher Opening [Searcher@46b2ea57[collection1] realtime]
   [junit4]   2> 1161581 INFO  (TEST-AutoCommitTest.testMaxTime-seed#[117A45E6A0C262F6]) [    x:collection1] o.a.s.u.p.LogUpdateProcessorFactory [collection1]  webapp=null path=null params={_version_=-9223372036854775807&update.distrib=FROMLEADER&versions=true&wt=json&indent=true}{deleteByQuery=*:* (-9223372036854775807)} 0 0
   [junit4]   2> 1161581 ERROR (TEST-AutoCommitTest.testMaxTime-seed#[117A45E6A0C262F6]) [    x:collection1] o.a.s.c.CorePropertiesLocator Couldn't load core descriptor from /x1/jenkins/jenkins-slave/workspace/Lucene-Solr-Tests-7.0/solr/core/src/test-files/solr/collection1/core.properties:java.nio.file.NoSuchFileException: /x1/jenkins/jenkins-slave/workspace/Lucene-Solr-Tests-7.0/solr/core/src/test-files/solr/collection1/core.properties
   [junit4]   2> 1161581 INFO  (TEST-AutoCommitTest.testMaxTime-seed#[117A45E6A0C262F6]) [    x:collection1] o.a.s.c.SolrResourceLoader [null] Added 2 libs to classloader, from paths: [/x1/jenkins/jenkins-slave/workspace/Lucene-Solr-Tests-7.0/solr/core/src/test-files/solr/collection1/lib, /x1/jenkins/jenkins-slave/workspace/Lucene-Solr-Tests-7.0/solr/core/src/test-files/solr/collection1/lib/classes]
   [junit4]   2> 1161623 INFO  (TEST-AutoCommitTest.testMaxTime-seed#[117A45E6A0C262F6]) [    x:collection1] o.a.s.c.SolrConfig Using Lucene MatchVersion: 7.0.0
   [junit4]   2> 1161655 INFO  (TEST-AutoCommitTest.testMaxTime-seed#[117A45E6A0C262F6]) [    x:collection1] o.a.s.s.IndexSchema [collection1] Schema name=test
   [junit4]   2> 1161786 INFO  (TEST-AutoCommitTest.testMaxTime-seed#[117A45E6A0C262F6]) [    x:collection1] o.a.s.s.IndexSchema Loaded schema test/1.0 with uniqueid field id
   [junit4]   2> 1161795 INFO  (TEST-AutoCommitTest.testMaxTime-seed#[117A45E6A0C262F6]) [    x:collection1] o.a.s.c.CoreContainer Reloading SolrCore 'collection1' using configuration from instancedir /x1/jenkins/jenkins-slave/workspace/Lucene-Solr-Tests-7.0/solr/core/src/test-files/solr/collection1
   [junit4]   2> 1161807 INFO  (TEST-AutoCommitTest.testMaxTime-seed#[117A45E6A0C262F6]) [    x:collection1] o.a.s.m.r.SolrJmxReporter JMX monitoring for 'solr.core.collection1' (registry 'solr.core.collection1') enabled at server: com.sun.jmx.mbeanserver.JmxMBeanServer@7e16e93d
   [junit4]   2> 1161807 INFO  (TEST-AutoCommitTest.testMaxTime-seed#[117A45E6A0C262F6]) [    x:collection1] o.a.s.c.SolrCore [[collection1] ] Opening new SolrCore at [/x1/jenkins/jenkins-slave/workspace/Lucene-Solr-Tests-7.0/solr/core/src/test-files/solr/collection1], dataDir=[/x1/jenkins/jenkins-slave/workspace/Lucene-Solr-Tests-7.0/solr/build/solr-core/test/J0/temp/solr.update.AutoCommitTest_117A45E6A0C262F6-001/init-core-data-001/]
   [junit4]   2> 1161850 INFO  (TEST-AutoCommitTest.testMaxTime-seed#[117A45E6A0C262F6]) [    x:collection1] o.a.s.u.CommitTracker Hard AutoCommit: disabled
   [junit4]   2> 1161850 INFO  (TEST-AutoCommitTest.testMaxTime-seed#[117A45E6A0C262F6]) [    x:collection1] o.a.s.u.CommitTracker Soft AutoCommit: disabled
   [junit4]   2> 1161851 INFO  (TEST-AutoCommitTest.testMaxTime-seed#[117A45E6A0C262F6]) [    x:collection1] o.a.s.s.SolrIndexSearcher Opening [Searcher@6af81006[collection1] main]
   [junit4]   2> 1161851 INFO  (TEST-AutoCommitTest.testMaxTime-seed#[117A45E6A0C262F6]) [    x:collection1] o.a.s.h.c.SpellCheckComponent Initializing spell checkers
   [junit4]   2> 1161852 INFO  (TEST-AutoCommitTest.testMaxTime-seed#[117A45E6A0C262F6]) [    x:collection1] o.a.s.s.DirectSolrSpellChecker init: {name=direct,classname=DirectSolrSpellChecker,field=lowerfilt,minQueryLength=3}
   [junit4]   2> 1161854 INFO  (TEST-AutoCommitTest.testMaxTime-seed#[117A45E6A0C262F6]) [    x:collection1] o.a.s.h.ReplicationHandler Commits will be reserved for  10000
   [junit4]   2> 1161857 INFO  (searcherExecutor-4573-thread-1-processing-x:collection1) [    x:collection1] o.a.s.h.c.SpellCheckComponent Loading spell index for spellchecker: default
   [junit4]   2> 1161860 INFO  (TEST-AutoCommitTest.testMaxTime-seed#[117A45E6A0C262F6]) [    x:collection1] o.a.s.u.RandomMergePolicy RandomMergePolicy wrapping class org.apache.lucene.index.TieredMergePolicy: [TieredMergePolicy: maxMergeAtOnce=46, maxMergeAtOnceExplicit=20, maxMergedSegmentMB=66.7578125, floorSegmentMB=0.3642578125, forceMergeDeletesPctAllowed=8.112363320500231, segmentsPerTier=31.0, maxCFSSegmentSizeMB=8.796093022207999E12, noCFSRatio=0.8072499060049307
   [junit4]   2> 1161861 INFO  (TEST-AutoCommitTest.testMaxTime-seed#[117A45E6A0C262F6]) [    x:collection1] o.a.s.u.DefaultSolrCoreState New IndexWriter is ready to be used.
   [junit4]   2> 1161862 INFO  (searcherExecutor-4573-thread-1-processing-x:collection1) [    x:collection1] o.a.s.h.c.SpellCheckComponent Loading spell index for spellchecker: direct
   [junit4]   2> 1161862 INFO  (searcherExecutor-4573-thread-1-processing-x:collection1) [    x:collection1] o.a.s.h.c.SpellCheckComponent Loading spell index for spellchecker: wordbreak
   [junit4]   2> 1161862 INFO  (searcherExecutor-4573-thread-1-processing-x:collection1) [    x:collection1] o.a.s.h.c.SpellCheckComponent Loading spell index for spellchecker: multipleFields
   [junit4]   2> 1161862 INFO  (searcherExecutor-4573-thread-1-processing-x:collection1) [    x:collection1] o.a.s.h.c.SpellCheckComponent Loading spell index for spellchecker: jarowinkler
   [junit4]   2> 1161862 INFO  (searcherExecutor-4573-thread-1-processing-x:collection1) [    x:collection1] o.a.s.h.c.SpellCheckComponent Loading spell index for spellchecker: external
   [junit4]   2> 1161862 INFO  (searcherExecutor-4573-thread-1-processing-x:collection1) [    x:collection1] o.a.s.h.c.SpellCheckComponent Loading spell index for spellchecker: freq
   [junit4]   2> 1161863 INFO  (searcherExecutor-4573-thread-1-processing-x:collection1) [    x:collection1] o.a.s.h.c.SpellCheckComponent Loading spell index for spellchecker: fqcn
   [junit4]   2> 1161863 INFO  (searcherExecutor-4573-thread-1-processing-x:collection1) [    x:collection1] o.a.s.h.c.SpellCheckComponent Loading spell index for spellchecker: perDict
   [junit4]   2> 1161865 INFO  (searcherExecutor-4573-thread-1-processing-x:collection1) [    x:collection1] o.a.s.c.SolrCore [collection1] Registered new searcher Searcher@6af81006[collection1] main{ExitableDirectoryReader(UninvertingDirectoryReader())}
   [junit4]   2> 1161865 INFO  (TEST-AutoCommitTest.testMaxTime-seed#[117A45E6A0C262F6]) [    x:collection1] o.a.s.s.SolrIndexSearcher Opening [Searcher@2a7a351c[collection1] main]
   [junit4]   2> 1161865 INFO  (TEST-AutoCommitTest.testMaxTime-seed#[117A45E6A0C262F6]) [    x:collection1] o.a.s.c.SolrCore [collection1]  CLOSING SolrCore org.apache.solr.core.SolrCore@4b013637
   [junit4]   2> 1161865 INFO  (TEST-AutoCommitTest.testMaxTime-seed#[117A45E6A0C262F6]) [    x:collection1] o.a.s.m.SolrMetricManager Closing metric reporters for registry=solr.core.collection1, tag=1258370615
   [junit4]   2> 1161870 INFO  (TEST-AutoCommitTest.testMaxTime-seed#[117A45E6A0C262F6]) [    x:collection1] o.a.s.u.p.LogUpdateProcessorFactory [collection1] {add=[529 (1573464054422306816)]} 0 2
   [junit4]   2> 1161871 INFO  (searcherExecutor-4573-thread-1-processing-x:collection1) [    x:collection1] o.a.s.c.SolrCore [collection1] Registered new searcher Searcher@2a7a351c[collection1] main{ExitableDirectoryReader(UninvertingDirectoryReader())}
   [junit4]   2> 1161871 INFO  (TEST-AutoCommitTest.testMaxTime-seed#[117A45E6A0C262F6]) [    x:collection1] o.a.s.c.S.Request [collection1]  webapp=null path=null params={q=id:529&qt=&start=0&rows=20&version=2.2} hits=0 status=0 QTime=0
   [junit4]   2> 1161871 INFO  (TEST-AutoCommitTest.testMaxTime-seed#[117A45E6A0C262F6]) [    x:collection1] o.a.s.u.p.LogUpdateProcessorFactory [collection1] {add=[530 (1573464054426501120)]} 0 4
   [junit4]   2> 1161871 INFO  (TEST-AutoCommitTest.testMaxTime-seed#[117A45E6A0C262F6]) [    x:collection1] o.a.s.c.S.Request [collection1]  webapp=null path=null params={q=id:529&qt=&start=0&rows=20&version=2.2} hits=0 status=0 QTime=0
   [junit4]   2> 1161872 ERROR (TEST-AutoCommitTest.testMaxTime-seed#[117A45E6A0C262F6]) [    x:collection1] o.a.s.SolrTestCaseJ4 REQUEST FAILED: xpath=//result[@numFound=1]
   [junit4]   2> 	xml response was: <?xml version="1.0" encoding="UTF-8"?>
   [junit4]   2> <response>
   [junit4]   2> <lst name="responseHeader"><int name="status">0</int><int name="QTime">0</int></lst><result name="response" numFound="0" start="0"></result>
   [junit4]   2> </response>
   [junit4]   2> 
   [junit4]   2> 	request was:q=id:529&qt=&start=0&rows=20&version=2.2
   [junit4]   2> 1161872 ERROR (TEST-AutoCommitTest.testMaxTime-seed#[117A45E6A0C262F6]) [    x:collection1] o.a.s.SolrTestCaseJ4 REQUEST FAILED: q=id:529&qt=&start=0&rows=20&version=2.2:java.lang.RuntimeException: REQUEST FAILED: xpath=//result[@numFound=1]
   [junit4]   2> 	xml response was: <?xml version="1.0" encoding="UTF-8"?>
   [junit4]   2> <response>
   [junit4]   2> <lst name="responseHeader"><int name="status">0</int><int name="QTime">0</int></lst><result name="response" numFound="0" start="0"></result>
   [junit4]   2> </response>
   [junit4]   2> 
   [junit4]   2> 	request was:q=id:529&qt=&start=0&rows=20&version=2.2
   [junit4]   2> 	at org.apache.solr.SolrTestCaseJ4.assertQ(SolrTestCaseJ4.java:871)
   [junit4]   2> 	at org.apache.solr.update.AutoCommitTest.testMaxTime(AutoCommitTest.java:270)
   [junit4]   2> 	at sun.reflect.NativeMethodAccessorImpl.invoke0(Native Method)
   [junit4]   2> 	at sun.reflect.NativeMethodAccessorImpl.invoke(NativeMethodAccessorImpl.java:62)
   [junit4]   2> 	at sun.reflect.DelegatingMethodAccessorImpl.invoke(DelegatingMethodAccessorImpl.java:43)
   [junit4]   2> 	at java.lang.reflect.Method.invoke(Method.java:498)
   [junit4]   2> 	at com.carrotsearch.randomizedtesting.RandomizedRunner.invoke(RandomizedRunner.java:1713)
   [junit4]   2> 	at com.carrotsearch.randomizedtesting.RandomizedRunner$8.evaluate(RandomizedRunner.java:907)
   [junit4]   2> 	at com.carrotsearch.randomizedtesting.RandomizedRunner$9.evaluate(RandomizedRunner.java:943)
   [junit4]   2> 	at com.carrotsearch.randomizedtesting.RandomizedRunner$10.evaluate(RandomizedRunner.java:957)
   [junit4]   2> 	at com.carrotsearch.randomizedtesting.rules.SystemPropertiesRestoreRule$1.evaluate(SystemPropertiesRestoreRule.java:57)
   [junit4]   2> 	at org.apache.lucene.util.TestRuleSetupTeardownChained$1.evaluate(TestRuleSetupTeardownChained.java:49)
   [junit4]   2> 	at org.apache.lucene.util.AbstractBeforeAfterRule$1.evaluate(AbstractBeforeAfterRule.java:45)
   [junit4]   2> 	at org.apache.lucene.util.TestRuleThreadAndTestName$1.evaluate(TestRuleThreadAndTestName.java:48)
   [junit4]   2> 	at org.apache.lucene.util.TestRuleIgnoreAfterMaxFailures$1.evaluate(TestRuleIgnoreAfterMaxFailures.java:64)
   [junit4]   2> 	at org.apache.lucene.util.TestRuleMarkFailure$1.evaluate(TestRuleMarkFailure.java:47)
   [junit4]   2> 	at com.carrotsearch.randomizedtesting.rules.StatementAdapter.evaluate(StatementAdapter.java:36)
   [junit4]   2> 	at com.carrotsearch.randomizedtesting.ThreadLeakControl$StatementRunner.run(ThreadLeakControl.java:368)
   [junit4]   2> 	at com.carrotsearch.randomizedtesting.ThreadLeakControl.forkTimeoutingTask(ThreadLeakControl.java:817)
   [junit4]   2> 	at com.carrotsearch.randomizedtesting.ThreadLeakControl$3.evaluate(ThreadLeakControl.java:468)
   [junit4]   2> 	at com.carrotsearch.randomizedtesting.RandomizedRunner.runSingleTest(RandomizedRunner.java:916)
   [junit4]   2> 	at com.carrotsearch.randomizedtesting.RandomizedRunner$5.evaluate(RandomizedRunner.java:802)
   [junit4]   2> 	at com.carrotsearch.randomizedtesting.RandomizedRunner$6.evaluate(RandomizedRunner.java:852)
   [junit4]   2> 	at com.carrotsearch.randomizedtesting.RandomizedRunner$7.evaluate(RandomizedRunner.java:863)
   [junit4]   2> 	at com.carrotsearch.randomizedtesting.rules.StatementAdapter.evaluate(StatementAdapter.java:36)
   [junit4]   2> 	at com.carrotsearch.randomizedtesting.rules.SystemPropertiesRestoreRule$1.evaluate(SystemPropertiesRestoreRule.java:57)
   [junit4]   2> 	at org.apache.lucene.util.AbstractBeforeAfterRule$1.evaluate(AbstractBeforeAfterRule.java:45)
   [junit4]   2> 	at com.carrotsearch.randomizedtesting.rules.StatementAdapter.evaluate(StatementAdapter.java:36)
   [junit4]   2> 	at org.apache.lucene.util.TestRuleStoreClassName$1.evaluate(TestRuleStoreClassName.java:41)
   [junit4]   2> 	at com.carrotsearch.randomizedtesting.rules.NoShadowingOrOverridesOnMethodsRule$1.evaluate(NoShadowingOrOverridesOnMethodsRule.java:40)
   [junit4]   2> 	at com.carrotsearch.randomizedtesting.rules.NoShadowingOrOverridesOnMethodsRule$1.evaluate(NoShadowingOrOverridesOnMethodsRule.java:40)
   [junit4]   2> 	at com.carrotsearch.randomizedtesting.rules.StatementAdapter.evaluate(StatementAdapter.java:36)
   [junit4]   2> 	at com.carrotsearch.randomizedtesting.rules.StatementAdapter.evaluate(StatementAdapter.java:36)
   [junit4]   2> 	at com.carrotsearch.randomizedtesting.rules.StatementAdapter.evaluate(StatementAdapter.java:36)
   [junit4]   2> 	at org.apache.lucene.util.TestRuleAssertionsRequired$1.evaluate(TestRuleAssertionsRequired.java:53)
   [junit4]   2> 	at org.apache.lucene.util.TestRuleMarkFailure$1.evaluate(TestRuleMarkFailure.java:47)
   [junit4]   2> 	at org.apache.lucene.util.TestRuleIgnoreAfterMaxFailures$1.evaluate(TestRuleIgnoreAfterMaxFailures.java:64)
   [junit4]   2> 	at org.apache.lucene.util.TestRuleIgnoreTestSuites$1.evaluate(TestRuleIgnoreTestSuites.java:54)
   [junit4]   2> 	at com.carrotsearch.randomizedtesting.rules.StatementAdapter.evaluate(StatementAdapter.java:36)
   [junit4]   2> 	at com.carrotsearch.randomizedtesting.ThreadLeakControl$StatementRunner.run(ThreadLeakControl.java:368)
   [junit4]   2> 	at java.lang.Thread.run(Thread.java:748)
   [junit4]   2> 
   [junit4]   2> 1161873 INFO  (TEST-AutoCommitTest.testMaxTime-seed#[117A45E6A0C262F6]) [    x:collection1] o.a.s.SolrTestCaseJ4 ###Ending testMaxTime
   [junit4]   2> NOTE: reproduce with: ant test  -Dtestcase=AutoCommitTest -Dtests.method=testMaxTime -Dtests.seed=117A45E6A0C262F6 -Dtests.multiplier=2 -Dtests.slow=true -Dtests.locale=is-IS -Dtests.timezone=America/Hermosillo -Dtests.asserts=true -Dtests.file.encoding=ISO-8859-1
   [junit4] ERROR   0.30s J0 | AutoCommitTest.testMaxTime <<<
   [junit4]    > Throwable #1: java.lang.RuntimeException: Exception during query
   [junit4]    > 	at __randomizedtesting.SeedInfo.seed([117A45E6A0C262F6:8B8E38043E58FECA]:0)
   [junit4]    > 	at org.apache.solr.SolrTestCaseJ4.assertQ(SolrTestCaseJ4.java:878)
   [junit4]    > 	at org.apache.solr.update.AutoCommitTest.testMaxTime(AutoCommitTest.java:270)
   [junit4]    > 	at java.lang.Thread.run(Thread.java:748)
   [junit4]    > Caused by: java.lang.RuntimeException: REQUEST FAILED: xpath=//result[@numFound=1]
   [junit4]    > 	xml response was: <?xml version="1.0" encoding="UTF-8"?>
   [junit4]    > <response>
   [junit4]    > <lst name="responseHeader"><int name="status">0</int><int name="QTime">0</int></lst><result name="response" numFound="0" start="0"></result>
   [junit4]    > </response>
   [junit4]    > 	request was:q=id:529&qt=&start=0&rows=20&version=2.2
   [junit4]    > 	at org.apache.solr.SolrTestCaseJ4.assertQ(SolrTestCaseJ4.java:871)
   [junit4]    > 	... 40 more
   [junit4]   2> 1161876 INFO  (TEST-AutoCommitTest.testCommitWithin-seed#[117A45E6A0C262F6]) [    x:collection1] o.a.s.SolrTestCaseJ4 ###Starting testCommitWithin
   [junit4]   2> 1161877 INFO  (TEST-AutoCommitTest.testCommitWithin-seed#[117A45E6A0C262F6]) [    x:collection1] o.a.s.u.DirectUpdateHandler2 [collection1] REMOVING ALL DOCUMENTS FROM INDEX
   [junit4]   2> 1161877 INFO  (TEST-AutoCommitTest.testCommitWithin-seed#[117A45E6A0C262F6]) [    x:collection1] o.a.s.s.SolrIndexSearcher Opening [Searcher@41ae8968[collection1] realtime]
   [junit4]   2> 1161877 INFO  (TEST-AutoCommitTest.testCommitWithin-seed#[117A45E6A0C262F6]) [    x:collection1] o.a.s.u.p.LogUpdateProcessorFactory [collection1]  webapp=null path=null params={_version_=-9223372036854775807&update.distrib=FROMLEADER&versions=true&wt=json&indent=true}{deleteByQuery=*:* (-9223372036854775807)} 0 0
   [junit4]   2> 1161877 ERROR (TEST-AutoCommitTest.testCommitWithin-seed#[117A45E6A0C262F6]) [    x:collection1] o.a.s.c.CorePropertiesLocator Couldn't load core descriptor from /x1/jenkins/jenkins-slave/workspace/Lucene-Solr-Tests-7.0/solr/core/src/test-files/solr/collection1/core.properties:java.nio.file.NoSuchFileException: /x1/jenkins/jenkins-slave/workspace/Lucene-Solr-Tests-7.0/solr/core/src/test-files/solr/collection1/core.properties
   [junit4]   2> 1161878 INFO  (TEST-AutoCommitTest.testCommitWithin-seed#[117A45E6A0C262F6]) [    x:collection1] o.a.s.c.SolrResourceLoader [null] Added 2 libs to classloader, from paths: [/x1/jenkins/jenkins-slave/workspace/Lucene-Solr-Tests-7.0/solr/core/src/test-files/solr/collection1/lib, /x1/jenkins/jenkins-slave/workspace/Lucene-Solr-Tests-7.0/solr/core/src/test-files/solr/collection1/lib/classes]
   [junit4]   2> 1161946 INFO  (TEST-AutoCommitTest.testCommitWithin-seed#[117A45E6A0C262F6]) [    x:collection1] o.a.s.c.SolrConfig Using Lucene MatchVersion: 7.0.0
   [junit4]   2> 1161992 INFO  (TEST-AutoCommitTest.testCommitWithin-seed#[117A45E6A0C262F6]) [    x:collection1] o.a.s.s.IndexSchema [collection1] Schema name=test
   [junit4]   2> 1162270 INFO  (TEST-AutoCommitTest.testCommitWithin-seed#[117A45E6A0C262F6]) [    x:collection1] o.a.s.s.IndexSchema Loaded schema test/1.0 with uniqueid field id
   [junit4]   2> 1162282 INFO  (TEST-AutoCommitTest.testCommitWithin-seed#[117A45E6A0C262F6]) [    x:collection1] o.a.s.c.CoreContainer Reloading SolrCore 'collection1' using configuration from instancedir /x1/jenkins/jenkins-slave/workspace/Lucene-Solr-Tests-7.0/solr/core/src/test-files/solr/collection1
   [junit4]   2> 1162316 INFO  (TEST-AutoCommitTest.testCommitWithin-seed#[117A45E6A0C262F6]) [    x:collection1] o.a.s.m.r.SolrJmxReporter JMX monitoring for 'solr.core.collection1' (registry 'solr.core.collection1') enabled at server: com.sun.jmx.mbeanserver.JmxMBeanServer@7e16e93d
   [junit4]   2> 1162316 INFO  (TEST-AutoCommitTest.testCommitWithin-seed#[117A45E6A0C262F6]) [    x:collection1] o.a.s.c.SolrCore [[collection1] ] Opening new SolrCore at [/x1/jenkins/jenkins-slave/workspace/Lucene-Solr-Tests-7.0/solr/core/src/test-files/solr/collection1], dataDir=[/x1/jenkins/jenkins-slave/workspace/Lucene-Solr-Tests-7.0/solr/build/solr-core/test/J0/temp/solr.update.AutoCommitTest_117A45E6A0C262F6-001/init-core-data-001/]
   [junit4]   2> 1162495 INFO  (TEST-AutoCommitTest.testCommitWithin-seed#[117A45E6A0C262F6]) [    x:collection1] o.a.s.u.CommitTracker Hard AutoCommit: disabled
   [junit4]   2> 1162495 INFO  (TEST-AutoCommitTest.testCommitWithin-seed#[117A45E6A0C262F6]) [    x:collection1] o.a.s.u.CommitTracker Soft AutoCommit: disabled
   [junit4]   2> 1162496 INFO  (TEST-AutoCommitTest.testCommitWithin-seed#[117A45E6A0C262F6]) [    x:collection1] o.a.s.s.SolrIndexSearcher Opening [Searcher@3e521b28[collection1] main]
   [junit4]   2> 1162496 INFO  (TEST-AutoCommitTest.testCommitWithin-seed#[117A45E6A0C262F6]) [    x:collection1] o.a.s.h.c.SpellCheckComponent Initializing spell checkers
   [junit4]   2> 1162497 INFO  (TEST-AutoCommitTest.testCommitWithin-seed#[117A45E6A0C262F6]) [    x:collection1] o.a.s.s.DirectSolrSpellChecker init: {name=direct,classname=DirectSolrSpellChecker,field=lowerfilt,minQueryLength=3}
   [junit4]   2> 1162499 INFO  (TEST-AutoCommitTest.testCommitWithin-seed#[117A45E6A0C262F6]) [    x:collection1] o.a.s.h.ReplicationHandler Commits will be reserved for  10000
   [junit4]   2> 1162501 INFO  (searcherExecutor-4577-thread-1-processing-x:collection1) [    x:collection1] o.a.s.h.c.SpellCheckComponent Loading spell index for spellchecker: default
   [junit4]   2> 1162501 INFO  (searcherExecutor-4577-thread-1-processing-x:collection1) [    x:collection1] o.a.s.h.c.SpellCheckComponent Loading spell index for spellchecker: direct
   [junit4]   2> 1162502 INFO  (searcherExecutor-4577-thread-1-processing-x:collection1) [    x:collection1] o.a.s.h.c.SpellCheckComponent Loading spell index for spellchecker: wordbreak
   [junit4]   2> 1162502 INFO  (searcherExecutor-4577-thread-1-processing-x:collection1) [    x:collection1] o.a.s.h.c.SpellCheckComponent Loading spell index for spellchecker: multipleFields
   [junit4]   2> 1162502 INFO  (searcherExecutor-4577-thread-1-processing-x:collection1) [    x:collection1] o.a.s.h.c.SpellCheckComponent Loading spell index for spellchecker: jarowinkler
   [junit4]   2> 1162502 INFO  (TEST-AutoCommitTest.testCommitWithin-seed#[117A45E6A0C262F6]) [    x:collection1] o.a.s.u.RandomMergePolicy RandomMergePolicy wrapping class org.apache.lucene.index.LogByteSizeMergePolicy: [LogByteSizeMergePolicy: minMergeSize=1677721, mergeFactor=10, maxMergeSize=2147483648, maxMergeSizeForForcedMerge=9223372036854775807, calibrateSizeByDeletes=true, maxMergeDocs=2147483647, maxCFSSegmentSizeMB=1.5400390625, noCFSRatio=0.5000379421398947]
   [junit4]   2> 1162502 INFO  (searcherExecutor-4577-thread-1-processing-x:collection1) [    x:collection1] o.a.s.h.c.SpellCheckComponent Loading spell index for spellchecker: external
   [junit4]   2> 1162502 INFO  (TEST-AutoCommitTest.testCommitWithin-seed#[117A45E6A0C262F6]) [    x:collection1] o.a.s.u.DefaultSolrCoreState New IndexWriter is ready to be used.
   [junit4]   2> 1162503 INFO  (searcherExecutor-4577-thread-1-processing-x:collection1) [    x:collection1] o.a.s.h.c.SpellCheckComponent Loading spell index for spellchecker: freq
   [junit4]   2> 1162503 INFO  (searcherExecutor-4577-thread-1-processing-x:collection1) [    x:collection1] o.a.s.h.c.SpellCheckComponent Loading spell index for spellchecker: fqcn
   [junit4]   2> 1162503 INFO  (searcherExecutor-4577-thread-1-processing-x:collection1) [    x:collection1] o.a.s.h.c.SpellCheckComponent Loading spell index for spellchecker: perDict
   [junit4]   2> 1162505 INFO  (searcherExecutor-4577-thread-1-processing-x:collection1) [    x:collection1] o.a.s.c.SolrCore [collection1] Registered new searcher Searcher@3e521b28[collection1] main{ExitableDirectoryReader(UninvertingDirectoryReader())}
   [junit4]   2> 1162505 INFO  (TEST-AutoCommitTest.testCommitWithin-seed#[117A45E6A0C262F6]) [    x:collection1] o.a.s.s.SolrIndexSearcher Opening [Searcher@faaff37[collection1] main]
   [junit4]   2> 1162505 INFO  (TEST-AutoCommitTest.testCommitWithin-seed#[117A45E6A0C262F6]) [    x:collection1] o.a.s.c.SolrCore [collection1]  CLOSING SolrCore org.apache.solr.core.SolrCore@36455d14
   [junit4]   2> 1162506 INFO  (TEST-AutoCommitTest.testCommitWithin-seed#[117A45E6A0C262F6]) [    x:collection1] o.a.s.m.SolrMetricManager Closing metric reporters for registry=solr.core.collection1, tag=910515476
   [junit4]   2> 1162515 INFO  (searcherExecutor-4577-thread-1-processing-x:collection1) [    x:collection1] o.a.s.c.SolrCore [collection1] Registered new searcher Searcher@faaff37[collection1] main{ExitableDirectoryReader(UninvertingDirectoryReader())}
   [junit4]   2> 1162525 INFO  (TEST-AutoCommitTest.testCommitWithin-seed#[117A45E6A0C262F6]) [    x:collection1] o.a.s.u.p.LogUpdateProcessorFactory [collection1] {add=[529 (1573464055100735488)]} 0 11
   [junit4]   2> 1162525 INFO  (TEST-AutoCommitTest.testCommitWithin-seed#[117A45E6A0C262F6]) [    x:collection1] o.a.s.c.S.Request [collection1]  webapp=null path=null params={q=id:529&qt=&start=0&rows=20&version=2.2} hits=0 status=0 QTime=0
   [junit4]   2> 1162526 INFO  (TEST-AutoCommitTest.testCommitWithin-seed#[117A45E6A0C262F6]) [    x:collection1] o.a.s.u.p.LogUpdateProcessorFactory [collection1] {add=[530 (1573464055113318400)]} 0 12
   [junit4]   2> 1162526 INFO  (TEST-AutoCommitTest.testCommitWithin-seed#[117A45E6A0C262F6]) [    x:collection1] o.a.s.c.S.Request [collection1]  webapp=null path=null params={q=id:530&qt=&start=0&rows=20&version=2.2} hits=0 status=0 QTime=0
   [junit4]   2> 1162527 INFO  (TEST-AutoCommitTest.testCommitWithin-seed#[117A45E6A0C262F6]) [    x:collection1] o.a.s.u.p.LogUpdateProcessorFactory [collection1] {delete=[529 (-1573464055114366976)]} 0 13
   [junit4]   2> 1162527 INFO  (TEST-AutoCommitTest.testCommitWithin-seed#[117A45E6A0C262F6]) [    x:collection1] o.a.s.c.S.Request [collection1]  webapp=null path=null params={q=id:529&qt=&start=0&rows=20&version=2.2} hits=0 status=0 QTime=0
   [junit4]   2> 1162527 ERROR (TEST-AutoCommitTest.testCommitWithin-seed#[117A45E6A0C262F6]) [    x:collection1] o.a.s.SolrTestCaseJ4 REQUEST FAILED: xpath=//result[@numFound=1]
   [junit4]   2> 	xml response was: <?xml version="1.0" encoding="UTF-8"?>
   [junit4]   2> <response>
   [junit4]   2> <lst name="responseHeader"><int name="status">0</int><int name="QTime">0</int></lst><result name="response" numFound="0" start="0"></result>
   [junit4]   2> </response>
   [junit4]   2> 
   [junit4]   2> 	request was:q=id:529&qt=&start=0&rows=20&version=2.2
   [junit4]   2> 1162527 ERROR (TEST-AutoCommitTest.testCommitWithin-seed#[117A45E6A0C262F6]) [    x:collection1] o.a.s.SolrTestCaseJ4 REQUEST FAILED: q=id:529&qt=&start=0&rows=20&version=2.2:java.lang.RuntimeException: REQUEST FAILED: xpath=//result[@numFound=1]
   [junit4]   2> 	xml response was: <?xml version="1.0" encoding="UTF-8"?>
   [junit4]   2> <response>
   [junit4]   2> <lst name="responseHeader"><int name="status">0</int><int name="QTime">0</int></lst><result name="response" numFound="0" start="0"></result>
   [junit4]   2> </response>
   [junit4]   2> 
   [junit4]   2> 	request was:q=id:529&qt=&start=0&rows=20&version=2.2
   [junit4]   2> 	at org.apache.solr.SolrTestCaseJ4.assertQ(SolrTestCaseJ4.java:871)
   [junit4]   2> 	at org.apache.solr.update.AutoCommitTest.testCommitWithin(AutoCommitTest.java:353)
   [junit4]   2> 	at sun.reflect.NativeMethodAccessorImpl.invoke0(Native Method)
   [junit4]   2> 	at sun.reflect.NativeMethodAccessorImpl.invoke(NativeMethodAccessorImpl.java:62)
   [junit4]   2> 	at sun.reflect.DelegatingMethodAccessorImpl.invoke(DelegatingMethodAccessorImpl.java:43)
   [junit4]   2> 	at java.lang.reflect.Method.invoke(Method.java:498)
   [junit4]   2> 	at com.carrotsearch.randomizedtesting.RandomizedRunner.invoke(RandomizedRunner.java:1713)
   [junit4]   2> 	at com.carrotsearch.randomizedtesting.RandomizedRunner$8.evaluate(RandomizedRunner.java:907)
   [junit4]   2> 	at com.carrotsearch.randomizedtesting.RandomizedRunner$9.evaluate(RandomizedRunner.java:943)
   [junit4]   2> 	at com.carrotsearch.randomizedtesting.RandomizedRunner$10.evaluate(RandomizedRunner.java:957)
   [junit4]   2> 	at com.carrotsearch.randomizedtesting.rules.SystemPropertiesRestoreRule$1.evaluate(SystemPropertiesRestoreRule.java:57)
   [junit4]   2> 	at org.apache.lucene.util.TestRuleSetupTeardownChained$1.evaluate(TestRuleSetupTeardownChained.java:49)
   [junit4]   2> 	at org.apache.lucene.util.AbstractBeforeAfterRule$1.evaluate(AbstractBeforeAfterRule.java:45)
   [junit4]   2> 	at org.apache.lucene.util.TestRuleThreadAndTestName$1.evaluate(TestRuleThreadAndTestName.java:48)
   [junit4]   2> 	at org.apache.lucene.util.TestRuleIgnoreAfterMaxFailures$1.evaluate(TestRuleIgnoreAfterMaxFailures.java:64)
   [junit4]   2> 	at org.apache.lucene.util.TestRuleMarkFailure$1.evaluate(TestRuleMarkFailure.java:47)
   [junit4]   2> 	at com.carrotsearch.randomizedtesting.rules.StatementAdapter.evaluate(StatementAdapter.java:36)
   [junit4]   2> 	at com.carrotsearch.randomizedtesting.ThreadLeakControl$StatementRunner.run(ThreadLeakControl.java:368)
   [junit4]   2> 	at com.carrotsearch.randomizedtesting.ThreadLeakControl.forkTimeoutingTask(ThreadLeakControl.java:817)
   [junit4]   2> 	at com.carrotsearch.randomizedtesting.ThreadLeakControl$3.evaluate(ThreadLeakControl.java:468)
   [junit4]   2> 	at com.carrotsearch.randomizedtesting.RandomizedRunner.runSingleTest(RandomizedRunner.java:916)
   [junit4]   2> 	at com.carrotsearch.randomizedtesting.RandomizedRunner$5.evaluate(RandomizedRunner.java:802)
   [junit4]   2> 	at com.carrotsearch.randomizedtesting.RandomizedRunner$6.evaluate(RandomizedRunner.java:852)
   [junit4]   2> 	at com.carrotsearch.randomizedtesting.RandomizedRunner$7.evaluate(RandomizedRunner.java:863)
   [junit4]   2> 	at com.carrotsearch.randomizedtesting.rules.StatementAdapter.evaluate(StatementAdapter.java:36)
   [junit4]   2> 	at com.carrotsearch.randomizedtesting.rules.SystemPropertiesRestoreRule$1.evaluate(SystemPropertiesRestoreRule.java:57)
   [junit4]   2> 	at org.apache.lucene.util.AbstractBeforeAfterRule$1.evaluate(AbstractBeforeAfterRule.java:45)
   [junit4]   2> 	at com.carrotsearch.randomizedtesting.rules.StatementAdapter.evaluate(StatementAdapter.java:36)
   [junit4]   2> 	at org.apache.lucene.util.TestRuleStoreClassName$1.evaluate(TestRuleStoreClassName.java:41)
   [junit4]   2> 	at com.carrotsearch.randomizedtesting.rules.NoShadowingOrOverridesOnMethodsRule$1.evaluate(NoShadowingOrOverridesOnMethodsRule.java:40)
   [junit4]   2> 	at com.carrotsearch.randomizedtesting.rules.NoShadowingOrOverridesOnMethodsRule$1.evaluate(NoShadowingOrOverridesOnMethodsRule.java:40)
   [junit4]   2> 	at com.carrotsearch.randomizedtesting.rules.StatementAdapter.evaluate(StatementAdapter.java:36)
   [junit4]   2> 	at com.carrotsearch.randomizedtesting.rules.StatementAdapter.evaluate(StatementAdapter.java:36)
   [junit4]   2> 	at com.carrotsearch.randomizedtesting.rules.StatementAdapter.evaluate(StatementAdapter.java:36)
   [junit4]   2> 	at org.apache.lucene.util.TestRuleAssertionsRequired$1.evaluate(TestRuleAssertionsRequired.java:53)
   [junit4]   2> 	at org.apache.lucene.util.TestRuleMarkFailure$1.evaluate(TestRuleMarkFailure.java:47)
   [junit4]   2> 	at org.apache.lucene.util.TestRuleIgnoreAfterMaxFailures$1.evaluate(TestRuleIgnoreAfterMaxFailures.java:64)
   [junit4]   2> 	at org.apache.lucene.util.TestRuleIgnoreTestSuites$1.evaluate(TestRuleIgnoreTestSuites.java:54)
   [junit4]   2> 	at com.carrotsearch.randomizedtesting.rules.StatementAdapter.evaluate(StatementAdapter.java:36)
   [junit4]   2> 	at com.carrotsearch.randomizedtesting.ThreadLeakControl$StatementRunner.run(ThreadLeakControl.java:368)
   [junit4]   2> 	at java.lang.Thread.run(Thread.java:748)
   [junit4]   2> 
   [junit4]   2> 1162528 INFO  (TEST-AutoCommitTest.testCommitWithin-seed#[117A45E6A0C262F6]) [    x:collection1] o.a.s.SolrTestCaseJ4 ###Ending testCommitWithin
   [junit4]   2> NOTE: reproduce with: ant test  -Dtestcase=AutoCommitTest -Dtests.method=testCommitWithin -Dtests.seed=117A45E6A0C262F6 -Dtests.multiplier=2 -Dtests.slow=true -Dtests.locale=is-IS -Dtests.timezone=America/Hermosillo -Dtests.asserts=true -Dtests.file.encoding=ISO-8859-1
   [junit4] ERROR   0.65s J0 | AutoCommitTest.testCommitWithin <<<
   [junit4]    > Throwable #1: java.lang.RuntimeException: Exception during query
   [junit4]    > 	at __randomizedtesting.SeedInfo.seed([117A45E6A0C262F6:ABA82A9E23EC8CE3]:0)
   [junit4]    > 	at org.apache.solr.SolrTestCaseJ4.assertQ(SolrTestCaseJ4.java:878)
   [junit4]    > 	at org.apache.solr.update.AutoCommitTest.testCommitWithin(AutoCommitTest.java:353)
   [junit4]    > 	at java.lang.Thread.run(Thread.java:748)
   [junit4]    > Caused by: java.lang.RuntimeException: REQUEST FAILED: xpath=//result[@numFound=1]
   [junit4]    > 	xml response was: <?xml version="1.0" encoding="UTF-8"?>
   [junit4]    > <response>
   [junit4]    > <lst name="responseHeader"><int name="status">0</int><int name="QTime">0</int></lst><result name="response" numFound="0" start="0"></result>
   [junit4]    > </response>
   [junit4]    > 	request was:q=id:529&qt=&start=0&rows=20&version=2.2
   [junit4]    > 	at org.apache.solr.SolrTestCaseJ4.assertQ(SolrTestCaseJ4.java:871)
   [junit4]    > 	... 40 more
   [junit4]   2> 1162528 INFO  (SUITE-AutoCommitTest-seed#[117A45E6A0C262F6]-worker) [    x:collection1] o.a.s.SolrTestCaseJ4 ###deleteCore
   [junit4]   2> 1162528 INFO  (SUITE-AutoCommitTest-seed#[117A45E6A0C262F6]-worker) [    x:collection1] o.a.s.c.CoreContainer Shutting down CoreContainer instance=1170699366
   [junit4]   2> 1162528 INFO  (SUITE-AutoCommitTest-seed#[117A45E6A0C262F6]-worker) [    x:collection1] o.a.s.m.SolrMetricManager Closing metric reporters for registry=solr.node, tag=null
   [junit4]   2> 1162530 INFO  (SUITE-AutoCommitTest-seed#[117A45E6A0C262F6]-worker) [    x:collection1] o.a.s.m.SolrMetricManager Closing metric reporters for registry=solr.jvm, tag=null
   [junit4]   2> 1162530 INFO  (SUITE-AutoCommitTest-seed#[117A45E6A0C262F6]-worker) [    x:collection1] o.a.s.m.SolrMetricManager Closing metric reporters for registry=solr.jetty, tag=null
   [junit4]   2> 1162531 INFO  (SUITE-AutoCommitTest-seed#[117A45E6A0C262F6]-worker) [    x:collection1] o.a.s.c.TransientSolrCoreCacheDefault Allocating transient cache for 2147483647 transient cores
   [junit4]   2> 1162548 INFO  (coreCloseExecutor-4581-thread-1-processing-x:collection1) [    x:collection1] o.a.s.c.SolrCore [collection1]  CLOSING SolrCore org.apache.solr.core.SolrCore@7dd09646
   [junit4]   2> 1162549 INFO  (coreCloseExecutor-4581-thread-1-processing-x:collection1) [    x:collection1] o.a.s.u.DirectUpdateHandler2 Committing on IndexWriter close.
   [junit4]   2> 1162549 INFO  (coreCloseExecutor-4581-thread-1-processing-x:collection1) [    x:collection1] o.a.s.u.SolrIndexWriter Calling setCommitData with IW:org.apache.solr.update.SolrIndexWriter@6b19f140 commitCommandVersion:0
   [junit4]   2> 1162563 INFO  (coreCloseExecutor-4581-thread-1-processing-x:collection1) [    x:collection1] o.a.s.m.SolrMetricManager Closing metric reporters for registry=solr.core.collection1, tag=2110821958
   [junit4]   2> NOTE: leaving temporary files on disk at: /x1/jenkins/jenkins-slave/workspace/Lucene-Solr-Tests-7.0/solr/build/solr-core/test/J0/temp/solr.update.AutoCommitTest_117A45E6A0C262F6-001
   [junit4]   2> NOTE: test params are: codec=Asserting(Lucene70): {range_facet_l_dv=Lucene50(blocksize=128), field_t=Lucene50(blocksize=128), multiDefault=PostingsFormat(name=Memory), subject=PostingsFormat(name=Memory), intDefault=Lucene50(blocksize=128), id_i1=Lucene50(blocksize=128), id=Lucene50(blocksize=128), range_facet_i_dv=PostingsFormat(name=Memory), text=BlockTreeOrds(blocksize=128), range_facet_l=PostingsFormat(name=Memory), timestamp=PostingsFormat(name=Memory)}, docValues:{range_facet_l_dv=DocValuesFormat(name=Direct), _version_=DocValuesFormat(name=Lucene70), range_facet_i_dv=DocValuesFormat(name=Lucene70), intDvoDefault=DocValuesFormat(name=Direct), timestamp=DocValuesFormat(name=Lucene70)}, maxPointsInLeafNode=822, maxMBSortInHeap=6.014919939113879, sim=RandomSimilarity(queryNorm=false): {}, locale=is-IS, timezone=America/Hermosillo
   [junit4]   2> NOTE: Linux 3.13.0-88-generic amd64/Oracle Corporation 1.8.0_131 (64-bit)/cpus=4,threads=1,free=174823576,total=525860864
   [junit4]   2> NOTE: All tests run in this JVM: [TestLazyCores, TestSolrFieldCacheBean, DistributedVersionInfoTest, TestManagedSchemaThreadSafety, HdfsChaosMonkeySafeLeaderTest, HdfsSyncSliceTest, TestBinaryResponseWriter, SolrCloudReportersTest, UUIDFieldTest, GraphQueryTest, TestTolerantUpdateProcessorRandomCloud, ConcurrentDeleteAndCreateCollectionTest, ConnectionReuseTest, TestCollationField, ExplicitHLLTest, MoveReplicaHDFSUlogDirTest, TestCloudJSONFacetJoinDomain, DistributedFacetPivotLongTailTest, ConjunctionSolrSpellCheckerTest, TestDistributedSearch, FieldAnalysisRequestHandlerTest, SolrRequestParserTest, DistribDocExpirationUpdateProcessorTest, TestReplicationHandler, TestReplicaProperties, IndexBasedSpellCheckerTest, CollectionTooManyReplicasTest, TestInfoStreamLogging, TestCSVResponseWriter, RAMDirectoryFactoryTest, TestDFISimilarityFactory, TestIBSimilarityFactory, QueryElevationComponentTest, DistributedSuggestComponentTest, TestRangeQuery, ChaosMonkeySafeLeaderWithPullReplicasTest, HdfsUnloadDistributedZkTest, TestRandomFaceting, TestMaxScoreQueryParser, TestExpandComponent, PropertiesRequestHandlerTest, RequestHandlersTest, DeleteLastCustomShardedReplicaTest, LargeFieldTest, TestSolrQueryResponse, TestSolrCloudWithHadoopAuthPlugin, DocumentAnalysisRequestHandlerTest, TestClusterStateMutator, SolrIndexConfigTest, OverseerStatusTest, ExternalFileFieldSortTest, TestFastOutputStream, TestIndexingPerformance, CdcrBootstrapTest, TestComponentsName, ReplicaListTransformerTest, TestSubQueryTransformerCrossCore, TestOrdValues, TestNumericTokenStream, RecoveryAfterSoftCommitTest, TestConfigsApi, DistributedExpandComponentTest, CdcrRequestHandlerTest, TestHighFrequencyDictionaryFactory, TestGeoJSONResponseWriter, MBeansHandlerTest, SpellCheckCollatorTest, TestBadConfig, TestFieldCacheSort, TestRandomDVFaceting, TestLuceneMatchVersion, TestInPlaceUpdatesStandalone, BooleanFieldTest, HttpPartitionTest, OutputWriterTest, TestSolrDeletionPolicy1, CoreMergeIndexesAdminHandlerTest, TestManagedSynonymFilterFactory, TestCryptoKeys, DistributedSpellCheckComponentTest, XmlUpdateRequestHandlerTest, TestBackupRepositoryFactory, TestClassNameShortening, TestPrepRecovery, SolrCoreTest, BufferStoreTest, EchoParamsTest, TestDocumentBuilder, TestBinaryField, BigEndianAscendingWordDeserializerTest, TestMultiValuedNumericRangeQuery, OpenExchangeRatesOrgProviderTest, CursorPagingTest, TestJoin, StatsReloadRaceTest, TestFaceting, TestTrackingShardHandlerFactory, ReplicationFactorTest, AnalysisErrorHandlingTest, DebugComponentTest, TestConfig, TestWriterPerf, TestPushWriter, TestSmileRequest, TestSolrConfigHandler, SolrMetricReporterTest, UUIDUpdateProcessorFallbackTest, VMParamsZkACLAndCredentialsProvidersTest, PluginInfoTest, TestJsonFacetRefinement, UpdateParamsTest, HLLUtilTest, TestSizeLimitedDistributedMap, TestNumericTerms64, TestDocSet, TestSchemaResource, ChaosMonkeySafeLeaderTest, SyncSliceTest, OpenCloseCoreStressTest, OverseerTest, LeaderElectionIntegrationTest, TestZkChroot, AutoCommitTest]
   [junit4] Completed [372/727 (1!)] on J0 in 1.93s, 3 tests, 2 errors <<< FAILURES!

[...truncated 44477 lines...]

Mime
View raw message