lucene-dev mailing list archives

Site index · List index
Message view « Date » · « Thread »
Top « Date » · « Thread »
From Policeman Jenkins Server <jenk...@thetaphi.de>
Subject [JENKINS] Lucene-Solr-7.x-Linux (64bit/jdk1.8.0_131) - Build # 108 - Unstable!
Date Thu, 20 Jul 2017 01:48:01 GMT
Build: https://jenkins.thetaphi.de/job/Lucene-Solr-7.x-Linux/108/
Java: 64bit/jdk1.8.0_131 -XX:+UseCompressedOops -XX:+UseSerialGC

1 tests failed.
FAILED:  org.apache.solr.cloud.TestSolrCloudWithDelegationTokens.testDelegationTokenRenew

Error Message:
expected:<200> but was:<403>

Stack Trace:
java.lang.AssertionError: expected:<200> but was:<403>
	at __randomizedtesting.SeedInfo.seed([2CD0B8012F068FCC:1B4B4C1F17CA5268]:0)
	at org.junit.Assert.fail(Assert.java:93)
	at org.junit.Assert.failNotEquals(Assert.java:647)
	at org.junit.Assert.assertEquals(Assert.java:128)
	at org.junit.Assert.assertEquals(Assert.java:472)
	at org.junit.Assert.assertEquals(Assert.java:456)
	at org.apache.solr.cloud.TestSolrCloudWithDelegationTokens.renewDelegationToken(TestSolrCloudWithDelegationTokens.java:130)
	at org.apache.solr.cloud.TestSolrCloudWithDelegationTokens.verifyDelegationTokenRenew(TestSolrCloudWithDelegationTokens.java:316)
	at org.apache.solr.cloud.TestSolrCloudWithDelegationTokens.testDelegationTokenRenew(TestSolrCloudWithDelegationTokens.java:333)
	at sun.reflect.NativeMethodAccessorImpl.invoke0(Native Method)
	at sun.reflect.NativeMethodAccessorImpl.invoke(NativeMethodAccessorImpl.java:62)
	at sun.reflect.DelegatingMethodAccessorImpl.invoke(DelegatingMethodAccessorImpl.java:43)
	at java.lang.reflect.Method.invoke(Method.java:498)
	at com.carrotsearch.randomizedtesting.RandomizedRunner.invoke(RandomizedRunner.java:1713)
	at com.carrotsearch.randomizedtesting.RandomizedRunner$8.evaluate(RandomizedRunner.java:907)
	at com.carrotsearch.randomizedtesting.RandomizedRunner$9.evaluate(RandomizedRunner.java:943)
	at com.carrotsearch.randomizedtesting.RandomizedRunner$10.evaluate(RandomizedRunner.java:957)
	at com.carrotsearch.randomizedtesting.rules.SystemPropertiesRestoreRule$1.evaluate(SystemPropertiesRestoreRule.java:57)
	at org.apache.lucene.util.TestRuleSetupTeardownChained$1.evaluate(TestRuleSetupTeardownChained.java:49)
	at org.apache.lucene.util.AbstractBeforeAfterRule$1.evaluate(AbstractBeforeAfterRule.java:45)
	at org.apache.lucene.util.TestRuleThreadAndTestName$1.evaluate(TestRuleThreadAndTestName.java:48)
	at org.apache.lucene.util.TestRuleIgnoreAfterMaxFailures$1.evaluate(TestRuleIgnoreAfterMaxFailures.java:64)
	at org.apache.lucene.util.TestRuleMarkFailure$1.evaluate(TestRuleMarkFailure.java:47)
	at com.carrotsearch.randomizedtesting.rules.StatementAdapter.evaluate(StatementAdapter.java:36)
	at com.carrotsearch.randomizedtesting.ThreadLeakControl$StatementRunner.run(ThreadLeakControl.java:368)
	at com.carrotsearch.randomizedtesting.ThreadLeakControl.forkTimeoutingTask(ThreadLeakControl.java:817)
	at com.carrotsearch.randomizedtesting.ThreadLeakControl$3.evaluate(ThreadLeakControl.java:468)
	at com.carrotsearch.randomizedtesting.RandomizedRunner.runSingleTest(RandomizedRunner.java:916)
	at com.carrotsearch.randomizedtesting.RandomizedRunner$5.evaluate(RandomizedRunner.java:802)
	at com.carrotsearch.randomizedtesting.RandomizedRunner$6.evaluate(RandomizedRunner.java:852)
	at com.carrotsearch.randomizedtesting.RandomizedRunner$7.evaluate(RandomizedRunner.java:863)
	at com.carrotsearch.randomizedtesting.rules.StatementAdapter.evaluate(StatementAdapter.java:36)
	at com.carrotsearch.randomizedtesting.rules.SystemPropertiesRestoreRule$1.evaluate(SystemPropertiesRestoreRule.java:57)
	at org.apache.lucene.util.AbstractBeforeAfterRule$1.evaluate(AbstractBeforeAfterRule.java:45)
	at com.carrotsearch.randomizedtesting.rules.StatementAdapter.evaluate(StatementAdapter.java:36)
	at org.apache.lucene.util.TestRuleStoreClassName$1.evaluate(TestRuleStoreClassName.java:41)
	at com.carrotsearch.randomizedtesting.rules.NoShadowingOrOverridesOnMethodsRule$1.evaluate(NoShadowingOrOverridesOnMethodsRule.java:40)
	at com.carrotsearch.randomizedtesting.rules.NoShadowingOrOverridesOnMethodsRule$1.evaluate(NoShadowingOrOverridesOnMethodsRule.java:40)
	at com.carrotsearch.randomizedtesting.rules.StatementAdapter.evaluate(StatementAdapter.java:36)
	at com.carrotsearch.randomizedtesting.rules.StatementAdapter.evaluate(StatementAdapter.java:36)
	at com.carrotsearch.randomizedtesting.rules.StatementAdapter.evaluate(StatementAdapter.java:36)
	at org.apache.lucene.util.TestRuleAssertionsRequired$1.evaluate(TestRuleAssertionsRequired.java:53)
	at org.apache.lucene.util.TestRuleMarkFailure$1.evaluate(TestRuleMarkFailure.java:47)
	at org.apache.lucene.util.TestRuleIgnoreAfterMaxFailures$1.evaluate(TestRuleIgnoreAfterMaxFailures.java:64)
	at org.apache.lucene.util.TestRuleIgnoreTestSuites$1.evaluate(TestRuleIgnoreTestSuites.java:54)
	at com.carrotsearch.randomizedtesting.rules.StatementAdapter.evaluate(StatementAdapter.java:36)
	at com.carrotsearch.randomizedtesting.ThreadLeakControl$StatementRunner.run(ThreadLeakControl.java:368)
	at java.lang.Thread.run(Thread.java:748)




Build Log:
[...truncated 12590 lines...]
   [junit4] Suite: org.apache.solr.cloud.TestSolrCloudWithDelegationTokens
   [junit4]   2> Creating dataDir: /home/jenkins/workspace/Lucene-Solr-7.x-Linux/solr/build/solr-core/test/J0/temp/solr.cloud.TestSolrCloudWithDelegationTokens_2CD0B8012F068FCC-001/init-core-data-001
   [junit4]   2> 1983671 WARN  (SUITE-TestSolrCloudWithDelegationTokens-seed#[2CD0B8012F068FCC]-worker)
[    ] o.a.s.SolrTestCaseJ4 startTrackingSearchers: numOpens=10 numCloses=10
   [junit4]   2> 1983671 INFO  (SUITE-TestSolrCloudWithDelegationTokens-seed#[2CD0B8012F068FCC]-worker)
[    ] o.a.s.SolrTestCaseJ4 Using TrieFields (NUMERIC_POINTS_SYSPROP=false) w/NUMERIC_DOCVALUES_SYSPROP=false
   [junit4]   2> 1983672 INFO  (SUITE-TestSolrCloudWithDelegationTokens-seed#[2CD0B8012F068FCC]-worker)
[    ] o.a.s.SolrTestCaseJ4 Randomized ssl (true) and clientAuth (true) via: @org.apache.solr.util.RandomizeSSL(reason=,
ssl=NaN, value=NaN, clientAuth=NaN)
   [junit4]   2> 1983673 INFO  (SUITE-TestSolrCloudWithDelegationTokens-seed#[2CD0B8012F068FCC]-worker)
[    ] o.a.s.c.MiniSolrCloudCluster Starting cluster of 2 servers in /home/jenkins/workspace/Lucene-Solr-7.x-Linux/solr/build/solr-core/test/J0/temp/solr.cloud.TestSolrCloudWithDelegationTokens_2CD0B8012F068FCC-001/tempDir-001
   [junit4]   2> 1983673 INFO  (SUITE-TestSolrCloudWithDelegationTokens-seed#[2CD0B8012F068FCC]-worker)
[    ] o.a.s.c.ZkTestServer STARTING ZK TEST SERVER
   [junit4]   2> 1983673 INFO  (Thread-7894) [    ] o.a.s.c.ZkTestServer client port:0.0.0.0/0.0.0.0:0
   [junit4]   2> 1983674 INFO  (Thread-7894) [    ] o.a.s.c.ZkTestServer Starting server
   [junit4]   2> 1983674 ERROR (Thread-7894) [    ] o.a.z.s.ZooKeeperServer ZKShutdownHandler
is not registered, so ZooKeeper server won't take any action on ERROR or SHUTDOWN server state
changes
   [junit4]   2> 1983774 INFO  (SUITE-TestSolrCloudWithDelegationTokens-seed#[2CD0B8012F068FCC]-worker)
[    ] o.a.s.c.ZkTestServer start zk server on port:33397
   [junit4]   2> 1983777 INFO  (jetty-launcher-2953-thread-2) [    ] o.e.j.s.Server jetty-9.3.14.v20161028
   [junit4]   2> 1983777 INFO  (jetty-launcher-2953-thread-1) [    ] o.e.j.s.Server jetty-9.3.14.v20161028
   [junit4]   2> 1983777 INFO  (jetty-launcher-2953-thread-1) [    ] o.e.j.s.h.ContextHandler
Started o.e.j.s.ServletContextHandler@32b876a3{/solr,null,AVAILABLE}
   [junit4]   2> 1983777 INFO  (jetty-launcher-2953-thread-2) [    ] o.e.j.s.h.ContextHandler
Started o.e.j.s.ServletContextHandler@72201360{/solr,null,AVAILABLE}
   [junit4]   2> 1983778 INFO  (jetty-launcher-2953-thread-1) [    ] o.e.j.s.AbstractConnector
Started ServerConnector@56ff8779{SSL,[ssl, http/1.1]}{127.0.0.1:34795}
   [junit4]   2> 1983778 INFO  (jetty-launcher-2953-thread-2) [    ] o.e.j.s.AbstractConnector
Started ServerConnector@3233cfa3{SSL,[ssl, http/1.1]}{127.0.0.1:42875}
   [junit4]   2> 1983778 INFO  (jetty-launcher-2953-thread-1) [    ] o.e.j.s.Server Started
@1985810ms
   [junit4]   2> 1983778 INFO  (jetty-launcher-2953-thread-2) [    ] o.e.j.s.Server Started
@1985810ms
   [junit4]   2> 1983778 INFO  (jetty-launcher-2953-thread-1) [    ] o.a.s.c.s.e.JettySolrRunner
Jetty properties: {hostContext=/solr, hostPort=34795}
   [junit4]   2> 1983778 INFO  (jetty-launcher-2953-thread-2) [    ] o.a.s.c.s.e.JettySolrRunner
Jetty properties: {hostContext=/solr, hostPort=42875}
   [junit4]   2> 1983778 ERROR (jetty-launcher-2953-thread-2) [    ] o.a.s.s.StartupLoggingUtils
Missing Java Option solr.log.dir. Logging may be missing or incomplete.
   [junit4]   2> 1983778 ERROR (jetty-launcher-2953-thread-1) [    ] o.a.s.s.StartupLoggingUtils
Missing Java Option solr.log.dir. Logging may be missing or incomplete.
   [junit4]   2> 1983778 INFO  (jetty-launcher-2953-thread-2) [    ] o.a.s.s.SolrDispatchFilter
 ___      _       Welcome to Apache Solr? version 7.1.0
   [junit4]   2> 1983778 INFO  (jetty-launcher-2953-thread-1) [    ] o.a.s.s.SolrDispatchFilter
 ___      _       Welcome to Apache Solr? version 7.1.0
   [junit4]   2> 1983778 INFO  (jetty-launcher-2953-thread-2) [    ] o.a.s.s.SolrDispatchFilter
/ __| ___| |_ _   Starting in cloud mode on port null
   [junit4]   2> 1983778 INFO  (jetty-launcher-2953-thread-1) [    ] o.a.s.s.SolrDispatchFilter
/ __| ___| |_ _   Starting in cloud mode on port null
   [junit4]   2> 1983778 INFO  (jetty-launcher-2953-thread-2) [    ] o.a.s.s.SolrDispatchFilter
\__ \/ _ \ | '_|  Install dir: null, Default config dir: null
   [junit4]   2> 1983778 INFO  (jetty-launcher-2953-thread-1) [    ] o.a.s.s.SolrDispatchFilter
\__ \/ _ \ | '_|  Install dir: null, Default config dir: null
   [junit4]   2> 1983778 INFO  (jetty-launcher-2953-thread-2) [    ] o.a.s.s.SolrDispatchFilter
|___/\___/_|_|    Start time: 2017-07-20T01:31:09.455Z
   [junit4]   2> 1983778 INFO  (jetty-launcher-2953-thread-1) [    ] o.a.s.s.SolrDispatchFilter
|___/\___/_|_|    Start time: 2017-07-20T01:31:09.455Z
   [junit4]   2> 1983779 INFO  (jetty-launcher-2953-thread-2) [    ] o.a.s.s.SolrDispatchFilter
solr.xml found in ZooKeeper. Loading...
   [junit4]   2> 1983779 INFO  (jetty-launcher-2953-thread-1) [    ] o.a.s.s.SolrDispatchFilter
solr.xml found in ZooKeeper. Loading...
   [junit4]   2> 1983783 INFO  (jetty-launcher-2953-thread-2) [    ] o.a.s.c.ZkContainer
Zookeeper client=127.0.0.1:33397/solr
   [junit4]   2> 1983783 INFO  (jetty-launcher-2953-thread-1) [    ] o.a.s.c.ZkContainer
Zookeeper client=127.0.0.1:33397/solr
   [junit4]   2> 1983807 INFO  (jetty-launcher-2953-thread-1) [n:127.0.0.1:34795_solr 
  ] o.a.s.c.Overseer Overseer (id=null) closing
   [junit4]   2> 1983807 INFO  (jetty-launcher-2953-thread-2) [n:127.0.0.1:42875_solr 
  ] o.a.s.c.Overseer Overseer (id=null) closing
   [junit4]   2> 1983807 INFO  (jetty-launcher-2953-thread-1) [n:127.0.0.1:34795_solr 
  ] o.a.s.c.OverseerElectionContext I am going to be the leader 127.0.0.1:34795_solr
   [junit4]   2> 1983808 INFO  (jetty-launcher-2953-thread-2) [n:127.0.0.1:42875_solr 
  ] o.a.s.c.ZkController Register node as live in ZooKeeper:/live_nodes/127.0.0.1:42875_solr
   [junit4]   2> 1983808 INFO  (jetty-launcher-2953-thread-1) [n:127.0.0.1:34795_solr 
  ] o.a.s.c.Overseer Overseer (id=98337703156187142-127.0.0.1:34795_solr-n_0000000000) starting
   [junit4]   2> 1983808 INFO  (zkCallback-2965-thread-1-processing-n:127.0.0.1:34795_solr)
[n:127.0.0.1:34795_solr    ] o.a.s.c.c.ZkStateReader Updated live nodes from ZooKeeper...
(0) -> (1)
   [junit4]   2> 1983809 INFO  (zkCallback-2964-thread-1-processing-n:127.0.0.1:42875_solr)
[n:127.0.0.1:42875_solr    ] o.a.s.c.c.ZkStateReader Updated live nodes from ZooKeeper...
(0) -> (1)
   [junit4]   2> 1983810 INFO  (jetty-launcher-2953-thread-1) [n:127.0.0.1:34795_solr 
  ] o.a.s.c.ZkController Register node as live in ZooKeeper:/live_nodes/127.0.0.1:34795_solr
   [junit4]   2> 1983810 INFO  (zkCallback-2964-thread-1-processing-n:127.0.0.1:42875_solr)
[n:127.0.0.1:42875_solr    ] o.a.s.c.c.ZkStateReader Updated live nodes from ZooKeeper...
(1) -> (2)
   [junit4]   2> 1983810 INFO  (zkCallback-2965-thread-1-processing-n:127.0.0.1:34795_solr)
[n:127.0.0.1:34795_solr    ] o.a.s.c.c.ZkStateReader Updated live nodes from ZooKeeper...
(1) -> (2)
   [junit4]   2> 1983834 INFO  (jetty-launcher-2953-thread-1) [n:127.0.0.1:34795_solr 
  ] o.a.s.c.CoreContainer Initializing authentication plugin: org.apache.solr.security.HttpParamDelegationTokenPlugin
   [junit4]   2> 1983836 WARN  (jetty-launcher-2953-thread-1) [n:127.0.0.1:34795_solr 
  ] o.a.s.c.s.i.Krb5HttpClientBuilder org.apache.solr.client.solrj.impl.Krb5HttpClientBuilder
is configured without specifying system property 'java.security.auth.login.config'
   [junit4]   2> 1983837 INFO  (jetty-launcher-2953-thread-1) [n:127.0.0.1:34795_solr 
  ] o.a.s.s.KerberosPlugin Params: {token.valid=30, delegation-token.token-kind=solr-dt, cookie.domain=127.0.0.1,
cookie.path=/, zk-dt-secret-manager.znodeWorkingPath=solr/security/zkdtsm, token.validity=36000,
signer.secret.provider.zookeeper.path=/token, type=kerberos, zk-dt-secret-manager.enable=true,
kerberos.name.rules=DEFAULT, signer.secret.provider=zookeeper}
   [junit4]   2> 1983839 INFO  (jetty-launcher-2953-thread-2) [n:127.0.0.1:42875_solr 
  ] o.a.s.c.CoreContainer Initializing authentication plugin: org.apache.solr.security.HttpParamDelegationTokenPlugin
   [junit4]   2> 1983839 INFO  (jetty-launcher-2953-thread-1) [n:127.0.0.1:34795_solr 
  ] o.a.c.f.i.CuratorFrameworkImpl Starting
   [junit4]   2> 1983839 WARN  (jetty-launcher-2953-thread-2) [n:127.0.0.1:42875_solr 
  ] o.a.s.c.s.i.Krb5HttpClientBuilder org.apache.solr.client.solrj.impl.Krb5HttpClientBuilder
is configured without specifying system property 'java.security.auth.login.config'
   [junit4]   2> 1983840 INFO  (jetty-launcher-2953-thread-2) [n:127.0.0.1:42875_solr 
  ] o.a.s.s.KerberosPlugin Params: {token.valid=30, delegation-token.token-kind=solr-dt, cookie.domain=127.0.0.1,
cookie.path=/, zk-dt-secret-manager.znodeWorkingPath=solr/security/zkdtsm, token.validity=36000,
signer.secret.provider.zookeeper.path=/token, type=kerberos, zk-dt-secret-manager.enable=true,
kerberos.name.rules=DEFAULT, signer.secret.provider=zookeeper}
   [junit4]   2> 1983840 INFO  (jetty-launcher-2953-thread-2) [n:127.0.0.1:42875_solr 
  ] o.a.c.f.i.CuratorFrameworkImpl Starting
   [junit4]   2> 1983842 INFO  (jetty-launcher-2953-thread-2-EventThread) [n:127.0.0.1:42875_solr
   ] o.a.c.f.s.ConnectionStateManager State change: CONNECTED
   [junit4]   2> 1983842 INFO  (jetty-launcher-2953-thread-1-EventThread) [n:127.0.0.1:34795_solr
   ] o.a.c.f.s.ConnectionStateManager State change: CONNECTED
   [junit4]   2> 1983849 WARN  (jetty-launcher-2953-thread-2) [n:127.0.0.1:42875_solr 
  ] o.a.s.c.s.i.Krb5HttpClientBuilder org.apache.solr.client.solrj.impl.Krb5HttpClientBuilder
is configured without specifying system property 'java.security.auth.login.config'
   [junit4]   2> 1983851 WARN  (jetty-launcher-2953-thread-1) [n:127.0.0.1:34795_solr 
  ] o.a.s.c.s.i.Krb5HttpClientBuilder org.apache.solr.client.solrj.impl.Krb5HttpClientBuilder
is configured without specifying system property 'java.security.auth.login.config'
   [junit4]   2> 1983879 INFO  (jetty-launcher-2953-thread-2) [n:127.0.0.1:42875_solr 
  ] o.a.s.m.r.SolrJmxReporter JMX monitoring for 'solr_42875.solr.node' (registry 'solr.node')
enabled at server: com.sun.jmx.mbeanserver.JmxMBeanServer@710368b4
   [junit4]   2> 1983879 INFO  (jetty-launcher-2953-thread-1) [n:127.0.0.1:34795_solr 
  ] o.a.s.m.r.SolrJmxReporter JMX monitoring for 'solr_34795.solr.node' (registry 'solr.node')
enabled at server: com.sun.jmx.mbeanserver.JmxMBeanServer@710368b4
   [junit4]   2> 1983882 INFO  (jetty-launcher-2953-thread-1) [n:127.0.0.1:34795_solr 
  ] o.a.s.m.r.SolrJmxReporter JMX monitoring for 'solr_34795.solr.jvm' (registry 'solr.jvm')
enabled at server: com.sun.jmx.mbeanserver.JmxMBeanServer@710368b4
   [junit4]   2> 1983882 INFO  (jetty-launcher-2953-thread-1) [n:127.0.0.1:34795_solr 
  ] o.a.s.m.r.SolrJmxReporter JMX monitoring for 'solr_34795.solr.jetty' (registry 'solr.jetty')
enabled at server: com.sun.jmx.mbeanserver.JmxMBeanServer@710368b4
   [junit4]   2> 1983882 INFO  (jetty-launcher-2953-thread-2) [n:127.0.0.1:42875_solr 
  ] o.a.s.m.r.SolrJmxReporter JMX monitoring for 'solr_42875.solr.jvm' (registry 'solr.jvm')
enabled at server: com.sun.jmx.mbeanserver.JmxMBeanServer@710368b4
   [junit4]   2> 1983882 INFO  (jetty-launcher-2953-thread-2) [n:127.0.0.1:42875_solr 
  ] o.a.s.m.r.SolrJmxReporter JMX monitoring for 'solr_42875.solr.jetty' (registry 'solr.jetty')
enabled at server: com.sun.jmx.mbeanserver.JmxMBeanServer@710368b4
   [junit4]   2> 1983882 INFO  (jetty-launcher-2953-thread-1) [n:127.0.0.1:34795_solr 
  ] o.a.s.c.CorePropertiesLocator Found 0 core definitions underneath /home/jenkins/workspace/Lucene-Solr-7.x-Linux/solr/build/solr-core/test/J0/temp/solr.cloud.TestSolrCloudWithDelegationTokens_2CD0B8012F068FCC-001/tempDir-001/node1/.
   [junit4]   2> 1983882 INFO  (jetty-launcher-2953-thread-2) [n:127.0.0.1:42875_solr 
  ] o.a.s.c.CorePropertiesLocator Found 0 core definitions underneath /home/jenkins/workspace/Lucene-Solr-7.x-Linux/solr/build/solr-core/test/J0/temp/solr.cloud.TestSolrCloudWithDelegationTokens_2CD0B8012F068FCC-001/tempDir-001/node2/.
   [junit4] IGNOR/A 0.00s J0 | TestSolrCloudWithDelegationTokens.testDelegationTokenCancelFail
   [junit4]    > Assumption #1: 'awaitsfix' test group is disabled (@AwaitsFix(bugUrl=https://issues.apache.org/jira/browse/HADOOP-14044))
   [junit4]   2> 1983910 INFO  (TEST-TestSolrCloudWithDelegationTokens.testDelegationTokenVerify-seed#[2CD0B8012F068FCC])
[    ] o.a.s.SolrTestCaseJ4 ###Starting testDelegationTokenVerify
   [junit4]   2> 1983942 INFO  (TEST-TestSolrCloudWithDelegationTokens.testDelegationTokenVerify-seed#[2CD0B8012F068FCC])
[    ] o.a.s.c.c.ZkStateReader Updated live nodes from ZooKeeper... (0) -> (2)
   [junit4]   2> 1983942 INFO  (TEST-TestSolrCloudWithDelegationTokens.testDelegationTokenVerify-seed#[2CD0B8012F068FCC])
[    ] o.a.s.c.s.i.ZkClientClusterStateProvider Cluster at 127.0.0.1:33397/solr ready
   [junit4]   2> 1983949 INFO  (qtp1947949347-23084) [n:127.0.0.1:34795_solr    ] o.a.s.h.a.CollectionsHandler
Invoked Collection Action :list with params action=LIST&delegation=GgADYmFyA2JhcgCKAV1dnrmpigFdgas9qQEEFBWsqI7x328IOQUEVllDyE2c_uAxB3NvbHItZHQA&wt=javabin&version=2
and sendToOCPQueue=true
   [junit4]   2> 1983949 INFO  (qtp1947949347-23084) [n:127.0.0.1:34795_solr    ] o.a.s.s.HttpSolrCall
[admin] webapp=null path=/admin/collections params={action=LIST&delegation=GgADYmFyA2JhcgCKAV1dnrmpigFdgas9qQEEFBWsqI7x328IOQUEVllDyE2c_uAxB3NvbHItZHQA&wt=javabin&version=2}
status=0 QTime=0
   [junit4]   2> 1983957 WARN  (TEST-TestSolrCloudWithDelegationTokens.testDelegationTokenVerify-seed#[2CD0B8012F068FCC])
[    ] o.a.h.c.p.ResponseProcessCookies Invalid cookie header: "Set-Cookie: hadoop.auth=;
Path=/; Domain=127.0.0.1; Expires=      , 01-            -1970 00:00:00 GMT; Secure; HttpOnly".
Invalid 'expires' attribute: , 01- -1970 00:00:00 GMT
   [junit4]   2> 1983979 INFO  (qtp559926168-23083) [n:127.0.0.1:42875_solr    ] o.a.s.h.a.CollectionsHandler
Invoked Collection Action :list with params action=LIST&delegation=GgADYmFyA2JhcgCKAV1dnrmpigFdgas9qQEEFBWsqI7x328IOQUEVllDyE2c_uAxB3NvbHItZHQA&wt=javabin&version=2
and sendToOCPQueue=true
   [junit4]   2> 1983979 INFO  (qtp559926168-23083) [n:127.0.0.1:42875_solr    ] o.a.s.s.HttpSolrCall
[admin] webapp=null path=/admin/collections params={action=LIST&delegation=GgADYmFyA2JhcgCKAV1dnrmpigFdgas9qQEEFBWsqI7x328IOQUEVllDyE2c_uAxB3NvbHItZHQA&wt=javabin&version=2}
status=0 QTime=0
   [junit4]   2> 1983982 WARN  (TEST-TestSolrCloudWithDelegationTokens.testDelegationTokenVerify-seed#[2CD0B8012F068FCC])
[    ] o.a.h.c.p.ResponseProcessCookies Invalid cookie header: "Set-Cookie: hadoop.auth=;
Path=/; Domain=127.0.0.1; Expires=      , 01-            -1970 00:00:00 GMT; Secure; HttpOnly".
Invalid 'expires' attribute: , 01- -1970 00:00:00 GMT
   [junit4]   2> 1983983 INFO  (TEST-TestSolrCloudWithDelegationTokens.testDelegationTokenVerify-seed#[2CD0B8012F068FCC])
[    ] o.a.s.SolrTestCaseJ4 ###Ending testDelegationTokenVerify
   [junit4]   2> 1983994 INFO  (TEST-TestSolrCloudWithDelegationTokens.testDelegationTokenRenewFail-seed#[2CD0B8012F068FCC])
[    ] o.a.s.SolrTestCaseJ4 ###Starting testDelegationTokenRenewFail
   [junit4]   2> 1983999 WARN  (qtp1947949347-23084) [n:127.0.0.1:34795_solr    ] o.a.h.s.a.s.AuthenticationFilter
Authentication exception: org.apache.hadoop.security.AccessControlException: foo tries to
renew a token with renewer bar
   [junit4]   2> 1984000 WARN  (qtp1947949347-23084) [n:127.0.0.1:34795_solr    ] o.a.s.s.KerberosPlugin
Could not find org.apache.solr.security.authentication.requestcontinues
   [junit4]   2> 1984000 WARN  (TEST-TestSolrCloudWithDelegationTokens.testDelegationTokenRenewFail-seed#[2CD0B8012F068FCC])
[    ] o.a.h.c.p.ResponseProcessCookies Invalid cookie header: "Set-Cookie: hadoop.auth=;
Path=/; Domain=127.0.0.1; Expires=      , 01-            -1970 00:00:00 GMT; Secure; HttpOnly".
Invalid 'expires' attribute: , 01- -1970 00:00:00 GMT
   [junit4]   2> 1984001 WARN  (qtp559926168-23097) [    ] o.a.h.s.a.s.AuthenticationFilter
Authentication exception: org.apache.hadoop.security.AccessControlException: foo tries to
renew a token with renewer bar
   [junit4]   2> 1984002 WARN  (qtp559926168-23097) [    ] o.a.s.s.KerberosPlugin Could
not find org.apache.solr.security.authentication.requestcontinues
   [junit4]   2> 1984002 WARN  (TEST-TestSolrCloudWithDelegationTokens.testDelegationTokenRenewFail-seed#[2CD0B8012F068FCC])
[    ] o.a.h.c.p.ResponseProcessCookies Invalid cookie header: "Set-Cookie: hadoop.auth=;
Path=/; Domain=127.0.0.1; Expires=      , 01-            -1970 00:00:00 GMT; Secure; HttpOnly".
Invalid 'expires' attribute: , 01- -1970 00:00:00 GMT
   [junit4]   2> 1984006 WARN  (qtp1947949347-23088) [    ] o.a.h.s.a.s.AuthenticationFilter
Authentication exception: org.apache.hadoop.security.AccessControlException: notRenewUser
tries to renew a token with renewer renewUser
   [junit4]   2> 1984007 WARN  (qtp1947949347-23088) [    ] o.a.s.s.KerberosPlugin Could
not find org.apache.solr.security.authentication.requestcontinues
   [junit4]   2> 1984007 WARN  (TEST-TestSolrCloudWithDelegationTokens.testDelegationTokenRenewFail-seed#[2CD0B8012F068FCC])
[    ] o.a.h.c.p.ResponseProcessCookies Invalid cookie header: "Set-Cookie: hadoop.auth=;
Path=/; Domain=127.0.0.1; Expires=      , 01-            -1970 00:00:00 GMT; Secure; HttpOnly".
Invalid 'expires' attribute: , 01- -1970 00:00:00 GMT
   [junit4]   2> 1984007 WARN  (qtp559926168-23087) [    ] o.a.h.s.a.s.AuthenticationFilter
Authentication exception: org.apache.hadoop.security.AccessControlException: notRenewUser
tries to renew a token with renewer renewUser
   [junit4]   2> 1984008 WARN  (qtp559926168-23087) [    ] o.a.s.s.KerberosPlugin Could
not find org.apache.solr.security.authentication.requestcontinues
   [junit4]   2> 1984008 WARN  (TEST-TestSolrCloudWithDelegationTokens.testDelegationTokenRenewFail-seed#[2CD0B8012F068FCC])
[    ] o.a.h.c.p.ResponseProcessCookies Invalid cookie header: "Set-Cookie: hadoop.auth=;
Path=/; Domain=127.0.0.1; Expires=      , 01-            -1970 00:00:00 GMT; Secure; HttpOnly".
Invalid 'expires' attribute: , 01- -1970 00:00:00 GMT
   [junit4]   2> 1984008 INFO  (TEST-TestSolrCloudWithDelegationTokens.testDelegationTokenRenewFail-seed#[2CD0B8012F068FCC])
[    ] o.a.s.SolrTestCaseJ4 ###Ending testDelegationTokenRenewFail
   [junit4]   2> 1984021 INFO  (TEST-TestSolrCloudWithDelegationTokens.testDelegationTokenSolrClient-seed#[2CD0B8012F068FCC])
[    ] o.a.s.SolrTestCaseJ4 ###Starting testDelegationTokenSolrClient
   [junit4]   2> 1984043 WARN  (TEST-TestSolrCloudWithDelegationTokens.testDelegationTokenSolrClient-seed#[2CD0B8012F068FCC])
[    ] o.a.h.c.p.ResponseProcessCookies Invalid cookie header: "Set-Cookie: hadoop.auth=;
Path=/; Domain=127.0.0.1; Expires=      , 01-            -1970 00:00:00 GMT; Secure; HttpOnly".
Invalid 'expires' attribute: , 01- -1970 00:00:00 GMT
   [junit4]   2> 1984046 INFO  (qtp1947949347-23094) [n:127.0.0.1:34795_solr    ] o.a.s.h.a.CollectionsHandler
Invoked Collection Action :list with params action=LIST&delegation=GgADYmFyA2JhcgCKAV1dnroCigFdgas-AgQEFLhCQbuYI0VO7t8ifVNezx_w5b_aB3NvbHItZHQA&wt=javabin&version=2
and sendToOCPQueue=true
   [junit4]   2> 1984046 INFO  (qtp1947949347-23094) [n:127.0.0.1:34795_solr    ] o.a.s.s.HttpSolrCall
[admin] webapp=null path=/admin/collections params={action=LIST&delegation=GgADYmFyA2JhcgCKAV1dnroCigFdgas-AgQEFLhCQbuYI0VO7t8ifVNezx_w5b_aB3NvbHItZHQA&wt=javabin&version=2}
status=0 QTime=0
   [junit4]   2> 1984046 INFO  (TEST-TestSolrCloudWithDelegationTokens.testDelegationTokenSolrClient-seed#[2CD0B8012F068FCC])
[    ] o.a.s.SolrTestCaseJ4 ###Ending testDelegationTokenSolrClient
   [junit4]   2> 1984062 INFO  (TEST-TestSolrCloudWithDelegationTokens.testDelegationTokenRenew-seed#[2CD0B8012F068FCC])
[    ] o.a.s.SolrTestCaseJ4 ###Starting testDelegationTokenRenew
   [junit4]   2> 1984078 WARN  (qtp1947949347-23088) [    ] o.a.h.s.a.s.AuthenticationFilter
Authentication exception: org.apache.hadoop.security.AccessControlException: bar is trying
to renew a token with wrong password
   [junit4]   2> 1984078 WARN  (qtp1947949347-23088) [    ] o.a.s.s.KerberosPlugin Could
not find org.apache.solr.security.authentication.requestcontinues
   [junit4]   2> 1984078 WARN  (TEST-TestSolrCloudWithDelegationTokens.testDelegationTokenRenew-seed#[2CD0B8012F068FCC])
[    ] o.a.h.c.p.ResponseProcessCookies Invalid cookie header: "Set-Cookie: hadoop.auth=;
Path=/; Domain=127.0.0.1; Expires=      , 01-            -1970 00:00:00 GMT; Secure; HttpOnly".
Invalid 'expires' attribute: , 01- -1970 00:00:00 GMT
   [junit4]   2> 1984079 INFO  (TEST-TestSolrCloudWithDelegationTokens.testDelegationTokenRenew-seed#[2CD0B8012F068FCC])
[    ] o.a.s.SolrTestCaseJ4 ###Ending testDelegationTokenRenew
   [junit4]   2> NOTE: reproduce with: ant test  -Dtestcase=TestSolrCloudWithDelegationTokens
-Dtests.method=testDelegationTokenRenew -Dtests.seed=2CD0B8012F068FCC -Dtests.multiplier=3
-Dtests.slow=true -Dtests.locale=ar-SY -Dtests.timezone=Etc/GMT-11 -Dtests.asserts=true -Dtests.file.encoding=US-ASCII
   [junit4] FAILURE 0.03s J0 | TestSolrCloudWithDelegationTokens.testDelegationTokenRenew
<<<
   [junit4]    > Throwable #1: java.lang.AssertionError: expected:<200> but was:<403>
   [junit4]    > 	at __randomizedtesting.SeedInfo.seed([2CD0B8012F068FCC:1B4B4C1F17CA5268]:0)
   [junit4]    > 	at org.apache.solr.cloud.TestSolrCloudWithDelegationTokens.renewDelegationToken(TestSolrCloudWithDelegationTokens.java:130)
   [junit4]    > 	at org.apache.solr.cloud.TestSolrCloudWithDelegationTokens.verifyDelegationTokenRenew(TestSolrCloudWithDelegationTokens.java:316)
   [junit4]    > 	at org.apache.solr.cloud.TestSolrCloudWithDelegationTokens.testDelegationTokenRenew(TestSolrCloudWithDelegationTokens.java:333)
   [junit4]    > 	at java.lang.Thread.run(Thread.java:748)
   [junit4]   2> 1984102 INFO  (TEST-TestSolrCloudWithDelegationTokens.testDelegationOtherOp-seed#[2CD0B8012F068FCC])
[    ] o.a.s.SolrTestCaseJ4 ###Starting testDelegationOtherOp
   [junit4]   2> 1984104 INFO  (TEST-TestSolrCloudWithDelegationTokens.testDelegationOtherOp-seed#[2CD0B8012F068FCC])
[    ] o.a.s.c.c.ZkStateReader Updated live nodes from ZooKeeper... (0) -> (2)
   [junit4]   2> 1984104 INFO  (TEST-TestSolrCloudWithDelegationTokens.testDelegationOtherOp-seed#[2CD0B8012F068FCC])
[    ] o.a.s.c.s.i.ZkClientClusterStateProvider Cluster at 127.0.0.1:33397/solr ready
   [junit4]   2> 1984106 INFO  (qtp1947949347-23094) [n:127.0.0.1:34795_solr    ] o.a.s.h.a.CollectionsHandler
Invoked Collection Action :list with params op=someSolrOperation&action=LIST&wt=javabin&version=2
and sendToOCPQueue=true
   [junit4]   2> 1984106 INFO  (qtp1947949347-23094) [n:127.0.0.1:34795_solr    ] o.a.s.s.HttpSolrCall
[admin] webapp=null path=/admin/collections params={op=someSolrOperation&action=LIST&wt=javabin&version=2}
status=0 QTime=0
   [junit4]   2> 1984106 WARN  (TEST-TestSolrCloudWithDelegationTokens.testDelegationOtherOp-seed#[2CD0B8012F068FCC])
[    ] o.a.h.c.p.ResponseProcessCookies Invalid cookie header: "Set-Cookie: hadoop.auth="u=bar&p=bar&t=test&e=1500550269782&s=0jaFs06ywnuolzLRU4spNtPdN9k=";
Path=/; Domain=127.0.0.1; Expires=      , 20-    -2017 11:31:09 GMT; Secure; HttpOnly". Invalid
'expires' attribute: , 20- -2017 11:31:09 GMT
   [junit4]   2> 1984107 INFO  (TEST-TestSolrCloudWithDelegationTokens.testDelegationOtherOp-seed#[2CD0B8012F068FCC])
[    ] o.a.s.SolrTestCaseJ4 ###Ending testDelegationOtherOp
   [junit4]   2> 1984119 INFO  (TEST-TestSolrCloudWithDelegationTokens.testZNodePaths-seed#[2CD0B8012F068FCC])
[    ] o.a.s.SolrTestCaseJ4 ###Starting testZNodePaths
   [junit4]   2> 1984123 INFO  (TEST-TestSolrCloudWithDelegationTokens.testZNodePaths-seed#[2CD0B8012F068FCC])
[    ] o.a.s.SolrTestCaseJ4 ###Ending testZNodePaths
   [junit4]   2> 1984136 INFO  (TEST-TestSolrCloudWithDelegationTokens.testDelegationTokenCancel-seed#[2CD0B8012F068FCC])
[    ] o.a.s.SolrTestCaseJ4 ###Starting testDelegationTokenCancel
   [junit4]   2> 1984146 INFO  (TEST-TestSolrCloudWithDelegationTokens.testDelegationTokenCancel-seed#[2CD0B8012F068FCC])
[    ] o.a.s.c.c.ZkStateReader Updated live nodes from ZooKeeper... (0) -> (2)
   [junit4]   2> 1984147 INFO  (TEST-TestSolrCloudWithDelegationTokens.testDelegationTokenCancel-seed#[2CD0B8012F068FCC])
[    ] o.a.s.c.s.i.ZkClientClusterStateProvider Cluster at 127.0.0.1:33397/solr ready
   [junit4]   2> 1984148 ERROR (qtp1947949347-23084) [n:127.0.0.1:34795_solr    ] o.a.h.s.t.d.ZKDelegationTokenSecretManager
No node in path [/ZKDTSMTokensRoot/DT_7]
   [junit4]   2> 1984152 INFO  (TEST-TestSolrCloudWithDelegationTokens.testDelegationTokenCancel-seed#[2CD0B8012F068FCC])
[    ] o.a.s.c.c.ZkStateReader Updated live nodes from ZooKeeper... (0) -> (2)
   [junit4]   2> 1984152 INFO  (TEST-TestSolrCloudWithDelegationTokens.testDelegationTokenCancel-seed#[2CD0B8012F068FCC])
[    ] o.a.s.c.s.i.ZkClientClusterStateProvider Cluster at 127.0.0.1:33397/solr ready
   [junit4]   2> 1984154 WARN  (TEST-TestSolrCloudWithDelegationTokens.testDelegationTokenCancel-seed#[2CD0B8012F068FCC])
[    ] o.a.h.c.p.ResponseProcessCookies Invalid cookie header: "Set-Cookie: hadoop.auth=;
Path=/; Domain=127.0.0.1; Expires=      , 01-            -1970 00:00:00 GMT; Secure; HttpOnly".
Invalid 'expires' attribute: , 01- -1970 00:00:00 GMT
   [junit4]   2> 1984157 WARN  (TEST-TestSolrCloudWithDelegationTokens.testDelegationTokenCancel-seed#[2CD0B8012F068FCC])
[    ] o.a.h.c.p.ResponseProcessCookies Invalid cookie header: "Set-Cookie: hadoop.auth=;
Path=/; Domain=127.0.0.1; Expires=      , 01-            -1970 00:00:00 GMT; Secure; HttpOnly".
Invalid 'expires' attribute: , 01- -1970 00:00:00 GMT
   [junit4]   2> 1984162 INFO  (TEST-TestSolrCloudWithDelegationTokens.testDelegationTokenCancel-seed#[2CD0B8012F068FCC])
[    ] o.a.s.c.c.ZkStateReader Updated live nodes from ZooKeeper... (0) -> (2)
   [junit4]   2> 1984162 INFO  (TEST-TestSolrCloudWithDelegationTokens.testDelegationTokenCancel-seed#[2CD0B8012F068FCC])
[    ] o.a.s.c.s.i.ZkClientClusterStateProvider Cluster at 127.0.0.1:33397/solr ready
   [junit4]   2> 1984164 ERROR (qtp1947949347-23096) [    ] o.a.h.s.t.d.ZKDelegationTokenSecretManager
No node in path [/ZKDTSMTokensRoot/DT_8]
   [junit4]   2> 1984170 INFO  (TEST-TestSolrCloudWithDelegationTokens.testDelegationTokenCancel-seed#[2CD0B8012F068FCC])
[    ] o.a.s.c.c.ZkStateReader Updated live nodes from ZooKeeper... (0) -> (2)
   [junit4]   2> 1984170 INFO  (TEST-TestSolrCloudWithDelegationTokens.testDelegationTokenCancel-seed#[2CD0B8012F068FCC])
[    ] o.a.s.c.s.i.ZkClientClusterStateProvider Cluster at 127.0.0.1:33397/solr ready
   [junit4]   2> 1984171 WARN  (TEST-TestSolrCloudWithDelegationTokens.testDelegationTokenCancel-seed#[2CD0B8012F068FCC])
[    ] o.a.h.c.p.ResponseProcessCookies Invalid cookie header: "Set-Cookie: hadoop.auth=;
Path=/; Domain=127.0.0.1; Expires=      , 01-            -1970 00:00:00 GMT; Secure; HttpOnly".
Invalid 'expires' attribute: , 01- -1970 00:00:00 GMT
   [junit4]   2> 1984174 WARN  (TEST-TestSolrCloudWithDelegationTokens.testDelegationTokenCancel-seed#[2CD0B8012F068FCC])
[    ] o.a.h.c.p.ResponseProcessCookies Invalid cookie header: "Set-Cookie: hadoop.auth=;
Path=/; Domain=127.0.0.1; Expires=      , 01-            -1970 00:00:00 GMT; Secure; HttpOnly".
Invalid 'expires' attribute: , 01- -1970 00:00:00 GMT
   [junit4]   2> 1984174 INFO  (TEST-TestSolrCloudWithDelegationTokens.testDelegationTokenCancel-seed#[2CD0B8012F068FCC])
[    ] o.a.s.SolrTestCaseJ4 ###Ending testDelegationTokenCancel
   [junit4]   2> 1984177 INFO  (jetty-closer-2954-thread-1) [    ] o.e.j.s.AbstractConnector
Stopped ServerConnector@56ff8779{SSL,[ssl, http/1.1]}{127.0.0.1:0}
   [junit4]   2> 1984178 INFO  (jetty-closer-2954-thread-1) [    ] o.a.s.c.CoreContainer
Shutting down CoreContainer instance=1029039770
   [junit4]   2> 1984178 INFO  (jetty-closer-2954-thread-1) [    ] o.a.s.m.SolrMetricManager
Closing metric reporters for registry=solr.node, tag=null
   [junit4]   2> 1984178 INFO  (jetty-closer-2954-thread-2) [    ] o.e.j.s.AbstractConnector
Stopped ServerConnector@3233cfa3{SSL,[ssl, http/1.1]}{127.0.0.1:0}
   [junit4]   2> 1984179 INFO  (jetty-closer-2954-thread-2) [    ] o.a.s.c.CoreContainer
Shutting down CoreContainer instance=250569906
   [junit4]   2> 1984179 INFO  (jetty-closer-2954-thread-2) [    ] o.a.s.m.SolrMetricManager
Closing metric reporters for registry=solr.node, tag=null
   [junit4]   2> 1984180 INFO  (jetty-closer-2954-thread-1) [    ] o.a.s.m.SolrMetricManager
Closing metric reporters for registry=solr.jvm, tag=null
   [junit4]   2> 1984180 INFO  (jetty-closer-2954-thread-2) [    ] o.a.s.m.SolrMetricManager
Closing metric reporters for registry=solr.jvm, tag=null
   [junit4]   2> 1984181 INFO  (jetty-closer-2954-thread-1) [    ] o.a.s.m.SolrMetricManager
Closing metric reporters for registry=solr.jetty, tag=null
   [junit4]   2> 1984181 INFO  (jetty-closer-2954-thread-1) [    ] o.a.s.m.SolrMetricManager
Closing metric reporters for registry=solr.cluster, tag=null
   [junit4]   2> 1984181 INFO  (jetty-closer-2954-thread-1) [    ] o.a.s.c.TransientSolrCoreCacheDefault
Allocating transient cache for 2147483647 transient cores
   [junit4]   2> 1984181 INFO  (jetty-closer-2954-thread-1) [    ] o.a.s.c.Overseer Overseer
(id=98337703156187142-127.0.0.1:34795_solr-n_0000000000) closing
   [junit4]   2> 1984181 INFO  (jetty-closer-2954-thread-2) [    ] o.a.s.m.SolrMetricManager
Closing metric reporters for registry=solr.jetty, tag=null
   [junit4]   2> 1984182 INFO  (OverseerStateUpdate-98337703156187142-127.0.0.1:34795_solr-n_0000000000)
[n:127.0.0.1:34795_solr    ] o.a.s.c.Overseer Overseer Loop exiting : 127.0.0.1:34795_solr
   [junit4]   2> 1984183 INFO  (zkCallback-2964-thread-1-processing-n:127.0.0.1:42875_solr)
[n:127.0.0.1:42875_solr    ] o.a.s.c.OverseerElectionContext I am going to be the leader 127.0.0.1:42875_solr
   [junit4]   2> 1984183 INFO  (jetty-closer-2954-thread-2) [    ] o.a.s.m.SolrMetricManager
Closing metric reporters for registry=solr.cluster, tag=null
   [junit4]   2> 1984183 INFO  (zkCallback-2964-thread-2-processing-n:127.0.0.1:42875_solr)
[n:127.0.0.1:42875_solr    ] o.a.s.c.c.ZkStateReader Updated live nodes from ZooKeeper...
(2) -> (1)
   [junit4]   2> 1984183 INFO  (jetty-closer-2954-thread-2) [    ] o.a.s.c.TransientSolrCoreCacheDefault
Allocating transient cache for 2147483647 transient cores
   [junit4]   2> 1985682 WARN  (zkCallback-2965-thread-1-processing-n:127.0.0.1:34795_solr)
[n:127.0.0.1:34795_solr    ] o.a.s.c.c.ZkStateReader ZooKeeper watch triggered, but Solr cannot
talk to ZK: [KeeperErrorCode = Session expired for /live_nodes]
   [junit4]   2> 1985682 ERROR (Thread[Thread-7913,5,TGRP-TestSolrCloudWithDelegationTokens])
[n:127.0.0.1:34795_solr    ] o.a.h.s.t.d.AbstractDelegationTokenSecretManager ExpiredTokenRemover
received java.lang.InterruptedException: sleep interrupted
   [junit4]   2> 1985683 INFO  (jetty-closer-2954-thread-1) [    ] o.e.j.s.h.ContextHandler
Stopped o.e.j.s.ServletContextHandler@32b876a3{/solr,null,UNAVAILABLE}
   [junit4]   2> 1985685 WARN  (zkCallback-2964-thread-2-processing-n:127.0.0.1:42875_solr)
[n:127.0.0.1:42875_solr    ] o.a.s.c.c.ZkStateReader ZooKeeper watch triggered, but Solr cannot
talk to ZK: [KeeperErrorCode = Session expired for /live_nodes]
   [junit4]   2> 1985685 ERROR (Thread[Thread-7911,5,TGRP-TestSolrCloudWithDelegationTokens])
[n:127.0.0.1:42875_solr    ] o.a.h.s.t.d.AbstractDelegationTokenSecretManager ExpiredTokenRemover
received java.lang.InterruptedException: sleep interrupted
   [junit4]   2> 1985687 INFO  (jetty-closer-2954-thread-2) [    ] o.e.j.s.h.ContextHandler
Stopped o.e.j.s.ServletContextHandler@72201360{/solr,null,UNAVAILABLE}
   [junit4]   2> 1985687 ERROR (SUITE-TestSolrCloudWithDelegationTokens-seed#[2CD0B8012F068FCC]-worker)
[    ] o.a.z.s.ZooKeeperServer ZKShutdownHandler is not registered, so ZooKeeper server won't
take any action on ERROR or SHUTDOWN server state changes
   [junit4]   2> 1985687 INFO  (SUITE-TestSolrCloudWithDelegationTokens-seed#[2CD0B8012F068FCC]-worker)
[    ] o.a.s.c.ZkTestServer connecting to 127.0.0.1:33397 33397
   [junit4]   2> 1985716 INFO  (Thread-7894) [    ] o.a.s.c.ZkTestServer connecting to
127.0.0.1:33397 33397
   [junit4]   2> 1985717 WARN  (Thread-7894) [    ] o.a.s.c.ZkTestServer Watch limit violations:

   [junit4]   2> Maximum concurrent create/delete watches above limit:
   [junit4]   2> 
   [junit4]   2> 	8	/solr/aliases.json
   [junit4]   2> 	2	/solr/security.json
   [junit4]   2> 
   [junit4]   2> Maximum concurrent data watches above limit:
   [junit4]   2> 
   [junit4]   2> 	8	/solr/clusterprops.json
   [junit4]   2> 	8	/solr/clusterstate.json
   [junit4]   2> 	3	/solr/security/zkdtsm/ZKDTSMRoot/ZKDTSMKeyIdRoot
   [junit4]   2> 	2	/solr/security/zkdtsm/ZKDTSMRoot/ZKDTSMTokensRoot/DT_7
   [junit4]   2> 	2	/solr/security/zkdtsm/ZKDTSMRoot/ZKDTSMTokensRoot/DT_6
   [junit4]   2> 	2	/solr/security/zkdtsm/ZKDTSMRoot/ZKDTSMTokensRoot/DT_8
   [junit4]   2> 	2	/solr/security/zkdtsm/ZKDTSMRoot/ZKDTSMMasterKeyRoot/DK_1
   [junit4]   2> 	2	/solr/security/zkdtsm/ZKDTSMRoot/ZKDTSMTokensRoot/DT_1
   [junit4]   2> 	2	/solr/security/zkdtsm/ZKDTSMRoot/ZKDTSMTokensRoot/DT_3
   [junit4]   2> 	2	/solr/security/zkdtsm/ZKDTSMRoot/ZKDTSMMasterKeyRoot/DK_2
   [junit4]   2> 	2	/solr/security/zkdtsm/ZKDTSMRoot/ZKDTSMTokensRoot/DT_2
   [junit4]   2> 	2	/solr/security/zkdtsm/ZKDTSMRoot/ZKDTSMTokensRoot/DT_5
   [junit4]   2> 	2	/solr/security/zkdtsm/ZKDTSMRoot/ZKDTSMMasterKeyRoot/DK_4
   [junit4]   2> 	2	/solr/security/zkdtsm/ZKDTSMRoot/ZKDTSMTokensRoot/DT_4
   [junit4]   2> 	2	/solr/security/zkdtsm/ZKDTSMRoot/ZKDTSMSeqNumRoot
   [junit4]   2> 
   [junit4]   2> Maximum concurrent children watches above limit:
   [junit4]   2> 
   [junit4]   2> 	8	/solr/live_nodes
   [junit4]   2> 	8	/solr/collections
   [junit4]   2> 	2	/solr/security/zkdtsm/ZKDTSMRoot/ZKDTSMMasterKeyRoot
   [junit4]   2> 	2	/solr/security/zkdtsm/ZKDTSMRoot/ZKDTSMTokensRoot
   [junit4]   2> 
   [junit4]   2> NOTE: leaving temporary files on disk at: /home/jenkins/workspace/Lucene-Solr-7.x-Linux/solr/build/solr-core/test/J0/temp/solr.cloud.TestSolrCloudWithDelegationTokens_2CD0B8012F068FCC-001
   [junit4]   2> Jul 20, 2017 1:31:11 AM com.carrotsearch.randomizedtesting.ThreadLeakControl
checkThreadLeaks
   [junit4]   2> WARNING: Will linger awaiting termination of 3 leaked thread(s).
   [junit4]   2> NOTE: test params are: codec=HighCompressionCompressingStoredFields(storedFieldsFormat=CompressingStoredFieldsFormat(compressionMode=HIGH_COMPRESSION,
chunkSize=10, maxDocsPerChunk=602, blockSize=412), termVectorsFormat=CompressingTermVectorsFormat(compressionMode=HIGH_COMPRESSION,
chunkSize=10, blockSize=412)), sim=RandomSimilarity(queryNorm=true): {}, locale=ar-SY, timezone=Etc/GMT-11
   [junit4]   2> NOTE: Linux 4.10.0-26-generic amd64/Oracle Corporation 1.8.0_131 (64-bit)/cpus=8,threads=1,free=167579712,total=518979584
   [junit4]   2> NOTE: All tests run in this JVM: [CollectionTooManyReplicasTest, ZkNodePropsTest,
BlockJoinFacetSimpleTest, HdfsUnloadDistributedZkTest, TestWriterPerf, TestLMDirichletSimilarityFactory,
TestReloadAndDeleteDocs, DistributedSpellCheckComponentTest, AddBlockUpdateTest, WordBreakSolrSpellCheckerTest,
SolrCloudReportersTest, BinaryUpdateRequestHandlerTest, SolrMetricReporterTest, TestCloudRecovery,
UpdateParamsTest, TestCrossCoreJoin, TestMultiWordSynonyms, ClassificationUpdateProcessorTest,
TestRealTimeGet, ImplicitSnitchTest, TestLegacyFieldReuse, TolerantUpdateProcessorTest, BasicZkTest,
RankQueryTest, CoreMergeIndexesAdminHandlerTest, TestIndexingPerformance, QueryElevationComponentTest,
AssignTest, TestBlobHandler, TestSolr4Spatial, TestSolrConfigHandler, TestNumericTokenStream,
SuggestComponentContextFilterQueryTest, CdcrRequestHandlerTest, TestWordDelimiterFilterFactory,
AtomicUpdatesTest, RecoveryAfterSoftCommitTest, SpellingQueryConverterTest, PluginInfoTest,
TestAuthenticationFramework, TestBulkSchemaAPI, TestHighlightDedupGrouping, CursorMarkTest,
TestSchemaVersionResource, DebugComponentTest, UUIDFieldTest, DistributedQueryElevationComponentTest,
TestRandomCollapseQParserPlugin, DocumentAnalysisRequestHandlerTest, CdcrBootstrapTest, TestBackupRepositoryFactory,
SSLMigrationTest, TestSubQueryTransformer, TestInfoStreamLogging, TestSSLRandomization, NodeMutatorTest,
CreateCollectionCleanupTest, PKIAuthenticationIntegrationTest, TestCollationFieldDocValues,
TestMaxTokenLenTokenizer, SharedFSAutoReplicaFailoverTest, IndexBasedSpellCheckerTest, TestRemoteStreaming,
TestInPlaceUpdatesDistrib, PropertiesRequestHandlerTest, DistributedFacetPivotLongTailTest,
HdfsBasicDistributedZk2Test, TestRuleBasedAuthorizationPlugin, SolrCLIZkUtilsTest, TestDistributedSearch,
IgnoreCommitOptimizeUpdateProcessorFactoryTest, MoveReplicaHDFSUlogDirTest, MetricUtilsTest,
TestRecoveryHdfs, DistribDocExpirationUpdateProcessorTest, BitVectorTest, TestMacroExpander,
SuggesterWFSTTest, TestManagedResource, TestUseDocValuesAsStored2, TestCryptoKeys, DefaultValueUpdateProcessorTest,
HttpPartitionTest, TestFaceting, LeaderElectionIntegrationTest, TestClusterStateMutator, SolrCoreTest,
TestMergePolicyConfig, WrapperMergePolicyFactoryTest, ConfigureRecoveryStrategyTest, TestStressLucene,
TestReplicaProperties, TestFieldResource, HLLSerializationTest, ConcurrentDeleteAndCreateCollectionTest,
CursorPagingTest, HdfsChaosMonkeySafeLeaderTest, HdfsLockFactoryTest, TestDownShardTolerantSearch,
TestReplicationHandler, TestPayloadCheckQParserPlugin, TestLRUStatsCache, OutputWriterTest,
TestSolrQueryParser, DataDrivenBlockJoinTest, ChaosMonkeySafeLeaderWithPullReplicasTest, TestCustomStream,
TestFastOutputStream, TestImpersonationWithHadoopAuth, ReplicationFactorTest, TestCollapseQParserPlugin,
TestXmlQParserPlugin, TestSolrConfigHandlerConcurrent, TestManagedStopFilterFactory, TestJavabinTupleStreamParser,
VersionInfoTest, FieldAnalysisRequestHandlerTest, ChaosMonkeySafeLeaderTest, BasicDistributedZk2Test,
SyncSliceTest, OverseerTest, RecoveryZkTest, TestRandomFaceting, TestRandomDVFaceting, TestDistributedGrouping,
TestStressReorder, TestJoin, TestRangeQuery, SimpleFacetsTest, SpellCheckComponentTest, PeerSyncTest,
TestBadConfig, HighlighterTest, SolrIndexSplitterTest, SimplePostToolTest, TestExtendedDismaxParser,
SolrRequestParserTest, DocValuesTest, DirectUpdateHandlerOptimizeTest, TestSolrDeletionPolicy1,
TestReversedWildcardFilterFactory, PrimitiveFieldTypeTest, TestOmitPositions, XmlUpdateRequestHandlerTest,
TestValueSourceCache, TermVectorComponentTest, LoggingHandlerTest, TestJmxIntegration, MBeansHandlerTest,
TestAnalyzedSuggestions, TestPHPSerializedResponseWriter, CSVRequestHandlerTest, TestComponentsName,
SearchHandlerTest, TestDocSet, TestBinaryField, TestConfig, TestLuceneMatchVersion, TestCharFilters,
SynonymTokenizerTest, TestXIncludeConfig, EchoParamsTest, TestSweetSpotSimilarityFactory,
TestPerFieldSimilarity, TimeZoneUtilsTest, URLClassifyProcessorTest, ChaosMonkeyNothingIsSafeTest,
ConfigSetsAPITest, DeleteInactiveReplicaTest, DeleteShardTest, DistribJoinFromCollectionTest,
DocValuesNotIndexedTest, ForceLeaderTest, MigrateRouteKeyTest, OutOfBoxZkACLAndCredentialsProvidersTest,
OverseerCollectionConfigSetProcessorTest, OverseerModifyCollectionTest, OverseerStatusTest,
ReplaceNodeTest, RestartWhileUpdatingTest, RollingRestartTest, SolrXmlInZkTest, TestCloudDeleteByQuery,
TestCloudPseudoReturnFields, TestClusterProperties, TestCollectionAPI, TestConfigSetsAPIZkFailure,
TestDeleteCollectionOnDownNodes, TestHdfsCloudBackupRestore, TestLeaderElectionWithEmptyReplica,
TestLeaderElectionZkExpiry, TestLocalFSCloudBackupRestore, TestLockTree, TestMiniSolrCloudCluster,
TestPullReplica, TestRandomRequestDistribution, TestShortCircuitedRequests, TestSolrCloudWithDelegationTokens]
   [junit4] Completed [541/728 (1!)] on J0 in 2.81s, 8 tests, 1 failure, 1 skipped <<<
FAILURES!

[...truncated 43988 lines...]

Mime
View raw message