lucene-dev mailing list archives

Site index · List index
Message view « Date » · « Thread »
Top « Date » · « Thread »
From Policeman Jenkins Server <jenk...@thetaphi.de>
Subject [JENKINS-EA] Lucene-Solr-master-Linux (32bit/jdk-9-ea+178) - Build # 20162 - Unstable!
Date Thu, 20 Jul 2017 00:35:04 GMT
Build: https://jenkins.thetaphi.de/job/Lucene-Solr-master-Linux/20162/
Java: 32bit/jdk-9-ea+178 -client -XX:+UseSerialGC --illegal-access=deny

1 tests failed.
FAILED:  org.apache.solr.handler.TestSQLHandler.doTest

Error Message:


Stack Trace:
java.lang.AssertionError
	at __randomizedtesting.SeedInfo.seed([7D76B8CCEE1A22AE:DA32006883A13117]:0)
	at org.apache.solr.handler.TestSQLHandler.testBasicSelect(TestSQLHandler.java:186)
	at org.apache.solr.handler.TestSQLHandler.doTest(TestSQLHandler.java:87)
	at java.base/jdk.internal.reflect.NativeMethodAccessorImpl.invoke0(Native Method)
	at java.base/jdk.internal.reflect.NativeMethodAccessorImpl.invoke(NativeMethodAccessorImpl.java:62)
	at java.base/jdk.internal.reflect.DelegatingMethodAccessorImpl.invoke(DelegatingMethodAccessorImpl.java:43)
	at java.base/java.lang.reflect.Method.invoke(Method.java:564)
	at com.carrotsearch.randomizedtesting.RandomizedRunner.invoke(RandomizedRunner.java:1713)
	at com.carrotsearch.randomizedtesting.RandomizedRunner$8.evaluate(RandomizedRunner.java:907)
	at com.carrotsearch.randomizedtesting.RandomizedRunner$9.evaluate(RandomizedRunner.java:943)
	at com.carrotsearch.randomizedtesting.RandomizedRunner$10.evaluate(RandomizedRunner.java:957)
	at org.apache.solr.BaseDistributedSearchTestCase$ShardsRepeatRule$ShardsFixedStatement.callStatement(BaseDistributedSearchTestCase.java:985)
	at org.apache.solr.BaseDistributedSearchTestCase$ShardsRepeatRule$ShardsStatement.evaluate(BaseDistributedSearchTestCase.java:960)
	at com.carrotsearch.randomizedtesting.rules.SystemPropertiesRestoreRule$1.evaluate(SystemPropertiesRestoreRule.java:57)
	at org.apache.lucene.util.TestRuleSetupTeardownChained$1.evaluate(TestRuleSetupTeardownChained.java:49)
	at org.apache.lucene.util.AbstractBeforeAfterRule$1.evaluate(AbstractBeforeAfterRule.java:45)
	at org.apache.lucene.util.TestRuleThreadAndTestName$1.evaluate(TestRuleThreadAndTestName.java:48)
	at org.apache.lucene.util.TestRuleIgnoreAfterMaxFailures$1.evaluate(TestRuleIgnoreAfterMaxFailures.java:64)
	at org.apache.lucene.util.TestRuleMarkFailure$1.evaluate(TestRuleMarkFailure.java:47)
	at com.carrotsearch.randomizedtesting.rules.StatementAdapter.evaluate(StatementAdapter.java:36)
	at com.carrotsearch.randomizedtesting.ThreadLeakControl$StatementRunner.run(ThreadLeakControl.java:368)
	at com.carrotsearch.randomizedtesting.ThreadLeakControl.forkTimeoutingTask(ThreadLeakControl.java:817)
	at com.carrotsearch.randomizedtesting.ThreadLeakControl$3.evaluate(ThreadLeakControl.java:468)
	at com.carrotsearch.randomizedtesting.RandomizedRunner.runSingleTest(RandomizedRunner.java:916)
	at com.carrotsearch.randomizedtesting.RandomizedRunner$5.evaluate(RandomizedRunner.java:802)
	at com.carrotsearch.randomizedtesting.RandomizedRunner$6.evaluate(RandomizedRunner.java:852)
	at com.carrotsearch.randomizedtesting.RandomizedRunner$7.evaluate(RandomizedRunner.java:863)
	at com.carrotsearch.randomizedtesting.rules.StatementAdapter.evaluate(StatementAdapter.java:36)
	at com.carrotsearch.randomizedtesting.rules.SystemPropertiesRestoreRule$1.evaluate(SystemPropertiesRestoreRule.java:57)
	at org.apache.lucene.util.AbstractBeforeAfterRule$1.evaluate(AbstractBeforeAfterRule.java:45)
	at com.carrotsearch.randomizedtesting.rules.StatementAdapter.evaluate(StatementAdapter.java:36)
	at org.apache.lucene.util.TestRuleStoreClassName$1.evaluate(TestRuleStoreClassName.java:41)
	at com.carrotsearch.randomizedtesting.rules.NoShadowingOrOverridesOnMethodsRule$1.evaluate(NoShadowingOrOverridesOnMethodsRule.java:40)
	at com.carrotsearch.randomizedtesting.rules.NoShadowingOrOverridesOnMethodsRule$1.evaluate(NoShadowingOrOverridesOnMethodsRule.java:40)
	at com.carrotsearch.randomizedtesting.rules.StatementAdapter.evaluate(StatementAdapter.java:36)
	at com.carrotsearch.randomizedtesting.rules.StatementAdapter.evaluate(StatementAdapter.java:36)
	at org.apache.lucene.util.TestRuleAssertionsRequired$1.evaluate(TestRuleAssertionsRequired.java:53)
	at org.apache.lucene.util.TestRuleMarkFailure$1.evaluate(TestRuleMarkFailure.java:47)
	at org.apache.lucene.util.TestRuleIgnoreAfterMaxFailures$1.evaluate(TestRuleIgnoreAfterMaxFailures.java:64)
	at org.apache.lucene.util.TestRuleIgnoreTestSuites$1.evaluate(TestRuleIgnoreTestSuites.java:54)
	at com.carrotsearch.randomizedtesting.rules.StatementAdapter.evaluate(StatementAdapter.java:36)
	at com.carrotsearch.randomizedtesting.ThreadLeakControl$StatementRunner.run(ThreadLeakControl.java:368)
	at java.base/java.lang.Thread.run(Thread.java:844)




Build Log:
[...truncated 12739 lines...]
   [junit4] Suite: org.apache.solr.handler.TestSQLHandler
   [junit4]   2> Creating dataDir: /home/jenkins/workspace/Lucene-Solr-master-Linux/solr/build/solr-core/test/J0/temp/solr.handler.TestSQLHandler_7D76B8CCEE1A22AE-001/init-core-data-001
   [junit4]   2> 1812598 WARN  (SUITE-TestSQLHandler-seed#[7D76B8CCEE1A22AE]-worker) [    ] o.a.s.SolrTestCaseJ4 startTrackingSearchers: numOpens=52 numCloses=52
   [junit4]   2> 1812598 INFO  (SUITE-TestSQLHandler-seed#[7D76B8CCEE1A22AE]-worker) [    ] o.a.s.SolrTestCaseJ4 Using TrieFields (NUMERIC_POINTS_SYSPROP=false) w/NUMERIC_DOCVALUES_SYSPROP=false
   [junit4]   2> 1812598 INFO  (SUITE-TestSQLHandler-seed#[7D76B8CCEE1A22AE]-worker) [    ] o.a.s.SolrTestCaseJ4 Randomized ssl (false) and clientAuth (true) via: @org.apache.solr.util.RandomizeSSL(reason="", ssl=0.0/0.0, value=0.0/0.0, clientAuth=0.0/0.0)
   [junit4]   2> 1812598 INFO  (SUITE-TestSQLHandler-seed#[7D76B8CCEE1A22AE]-worker) [    ] o.a.s.BaseDistributedSearchTestCase Setting hostContext system property: /e/i
   [junit4]   2> 1812600 INFO  (TEST-TestSQLHandler.doTest-seed#[7D76B8CCEE1A22AE]) [    ] o.a.s.c.ZkTestServer STARTING ZK TEST SERVER
   [junit4]   2> 1812600 INFO  (Thread-4567) [    ] o.a.s.c.ZkTestServer client port:0.0.0.0/0.0.0.0:0
   [junit4]   2> 1812600 INFO  (Thread-4567) [    ] o.a.s.c.ZkTestServer Starting server
   [junit4]   2> 1812601 ERROR (Thread-4567) [    ] o.a.z.s.ZooKeeperServer ZKShutdownHandler is not registered, so ZooKeeper server won't take any action on ERROR or SHUTDOWN server state changes
   [junit4]   2> 1812700 INFO  (TEST-TestSQLHandler.doTest-seed#[7D76B8CCEE1A22AE]) [    ] o.a.s.c.ZkTestServer start zk server on port:45519
   [junit4]   2> 1812709 INFO  (TEST-TestSQLHandler.doTest-seed#[7D76B8CCEE1A22AE]) [    ] o.a.s.c.AbstractZkTestCase put /home/jenkins/workspace/Lucene-Solr-master-Linux/solr/core/src/test-files/solr/collection1/conf/solrconfig-sql.xml to /configs/conf1/solrconfig.xml
   [junit4]   2> 1812710 INFO  (TEST-TestSQLHandler.doTest-seed#[7D76B8CCEE1A22AE]) [    ] o.a.s.c.AbstractZkTestCase put /home/jenkins/workspace/Lucene-Solr-master-Linux/solr/core/src/test-files/solr/collection1/conf/schema-sql.xml to /configs/conf1/schema.xml
   [junit4]   2> 1812710 INFO  (TEST-TestSQLHandler.doTest-seed#[7D76B8CCEE1A22AE]) [    ] o.a.s.c.AbstractZkTestCase put /home/jenkins/workspace/Lucene-Solr-master-Linux/solr/core/src/test-files/solr/collection1/conf/solrconfig.snippet.randomindexconfig.xml to /configs/conf1/solrconfig.snippet.randomindexconfig.xml
   [junit4]   2> 1812711 INFO  (TEST-TestSQLHandler.doTest-seed#[7D76B8CCEE1A22AE]) [    ] o.a.s.c.AbstractZkTestCase put /home/jenkins/workspace/Lucene-Solr-master-Linux/solr/core/src/test-files/solr/collection1/conf/stopwords.txt to /configs/conf1/stopwords.txt
   [junit4]   2> 1812711 INFO  (TEST-TestSQLHandler.doTest-seed#[7D76B8CCEE1A22AE]) [    ] o.a.s.c.AbstractZkTestCase put /home/jenkins/workspace/Lucene-Solr-master-Linux/solr/core/src/test-files/solr/collection1/conf/protwords.txt to /configs/conf1/protwords.txt
   [junit4]   2> 1812711 INFO  (TEST-TestSQLHandler.doTest-seed#[7D76B8CCEE1A22AE]) [    ] o.a.s.c.AbstractZkTestCase put /home/jenkins/workspace/Lucene-Solr-master-Linux/solr/core/src/test-files/solr/collection1/conf/currency.xml to /configs/conf1/currency.xml
   [junit4]   2> 1812712 INFO  (TEST-TestSQLHandler.doTest-seed#[7D76B8CCEE1A22AE]) [    ] o.a.s.c.AbstractZkTestCase put /home/jenkins/workspace/Lucene-Solr-master-Linux/solr/core/src/test-files/solr/collection1/conf/enumsConfig.xml to /configs/conf1/enumsConfig.xml
   [junit4]   2> 1812712 INFO  (TEST-TestSQLHandler.doTest-seed#[7D76B8CCEE1A22AE]) [    ] o.a.s.c.AbstractZkTestCase put /home/jenkins/workspace/Lucene-Solr-master-Linux/solr/core/src/test-files/solr/collection1/conf/open-exchange-rates.json to /configs/conf1/open-exchange-rates.json
   [junit4]   2> 1812712 INFO  (TEST-TestSQLHandler.doTest-seed#[7D76B8CCEE1A22AE]) [    ] o.a.s.c.AbstractZkTestCase put /home/jenkins/workspace/Lucene-Solr-master-Linux/solr/core/src/test-files/solr/collection1/conf/mapping-ISOLatin1Accent.txt to /configs/conf1/mapping-ISOLatin1Accent.txt
   [junit4]   2> 1812713 INFO  (TEST-TestSQLHandler.doTest-seed#[7D76B8CCEE1A22AE]) [    ] o.a.s.c.AbstractZkTestCase put /home/jenkins/workspace/Lucene-Solr-master-Linux/solr/core/src/test-files/solr/collection1/conf/old_synonyms.txt to /configs/conf1/old_synonyms.txt
   [junit4]   2> 1812713 INFO  (TEST-TestSQLHandler.doTest-seed#[7D76B8CCEE1A22AE]) [    ] o.a.s.c.AbstractZkTestCase put /home/jenkins/workspace/Lucene-Solr-master-Linux/solr/core/src/test-files/solr/collection1/conf/synonyms.txt to /configs/conf1/synonyms.txt
   [junit4]   2> 1812714 INFO  (TEST-TestSQLHandler.doTest-seed#[7D76B8CCEE1A22AE]) [    ] o.a.s.c.AbstractFullDistribZkTestBase Will use NRT replicas unless explicitly asked otherwise
   [junit4]   2> 1812786 INFO  (TEST-TestSQLHandler.doTest-seed#[7D76B8CCEE1A22AE]) [    ] o.e.j.s.Server jetty-9.3.14.v20161028
   [junit4]   2> 1812786 INFO  (TEST-TestSQLHandler.doTest-seed#[7D76B8CCEE1A22AE]) [    ] o.e.j.s.h.ContextHandler Started o.e.j.s.ServletContextHandler@3b1b65{/e/i,null,AVAILABLE}
   [junit4]   2> 1812787 INFO  (TEST-TestSQLHandler.doTest-seed#[7D76B8CCEE1A22AE]) [    ] o.e.j.s.AbstractConnector Started ServerConnector@16856d2{HTTP/1.1,[http/1.1]}{127.0.0.1:40981}
   [junit4]   2> 1812787 INFO  (TEST-TestSQLHandler.doTest-seed#[7D76B8CCEE1A22AE]) [    ] o.e.j.s.Server Started @1829105ms
   [junit4]   2> 1812787 INFO  (TEST-TestSQLHandler.doTest-seed#[7D76B8CCEE1A22AE]) [    ] o.a.s.c.s.e.JettySolrRunner Jetty properties: {hostContext=/e/i, solr.data.dir=/home/jenkins/workspace/Lucene-Solr-master-Linux/solr/build/solr-core/test/J0/temp/solr.handler.TestSQLHandler_7D76B8CCEE1A22AE-001/tempDir-001/control/data, hostPort=40981, coreRootDirectory=/home/jenkins/workspace/Lucene-Solr-master-Linux/solr/build/solr-core/test/J0/../../../../../../../../../home/jenkins/workspace/Lucene-Solr-master-Linux/solr/build/solr-core/test/J0/temp/solr.handler.TestSQLHandler_7D76B8CCEE1A22AE-001/control-001/cores, replicaType=NRT}
   [junit4]   2> 1812787 ERROR (TEST-TestSQLHandler.doTest-seed#[7D76B8CCEE1A22AE]) [    ] o.a.s.s.StartupLoggingUtils Missing Java Option solr.log.dir. Logging may be missing or incomplete.
   [junit4]   2> 1812787 INFO  (TEST-TestSQLHandler.doTest-seed#[7D76B8CCEE1A22AE]) [    ] o.a.s.s.SolrDispatchFilter  ___      _       Welcome to Apache Solr™ version 8.0.0
   [junit4]   2> 1812788 INFO  (TEST-TestSQLHandler.doTest-seed#[7D76B8CCEE1A22AE]) [    ] o.a.s.s.SolrDispatchFilter / __| ___| |_ _   Starting in cloud mode on port null
   [junit4]   2> 1812788 INFO  (TEST-TestSQLHandler.doTest-seed#[7D76B8CCEE1A22AE]) [    ] o.a.s.s.SolrDispatchFilter \__ \/ _ \ | '_|  Install dir: null, Default config dir: null
   [junit4]   2> 1812788 INFO  (TEST-TestSQLHandler.doTest-seed#[7D76B8CCEE1A22AE]) [    ] o.a.s.s.SolrDispatchFilter |___/\___/_|_|    Start time: 2017-07-20T00:24:22.635121Z
   [junit4]   2> 1812792 INFO  (TEST-TestSQLHandler.doTest-seed#[7D76B8CCEE1A22AE]) [    ] o.a.s.s.SolrDispatchFilter Loading solr.xml from SolrHome (not found in ZooKeeper)
   [junit4]   2> 1812792 INFO  (TEST-TestSQLHandler.doTest-seed#[7D76B8CCEE1A22AE]) [    ] o.a.s.c.SolrXmlConfig Loading container configuration from /home/jenkins/workspace/Lucene-Solr-master-Linux/solr/build/solr-core/test/J0/temp/solr.handler.TestSQLHandler_7D76B8CCEE1A22AE-001/control-001/solr.xml
   [junit4]   2> 1812795 INFO  (TEST-TestSQLHandler.doTest-seed#[7D76B8CCEE1A22AE]) [    ] o.a.s.c.SolrXmlConfig MBean server found: com.sun.jmx.mbeanserver.JmxMBeanServer@c0d0d3, but no JMX reporters were configured - adding default JMX reporter.
   [junit4]   2> 1812798 INFO  (TEST-TestSQLHandler.doTest-seed#[7D76B8CCEE1A22AE]) [    ] o.a.s.c.ZkContainer Zookeeper client=127.0.0.1:45519/solr
   [junit4]   2> 1812835 INFO  (TEST-TestSQLHandler.doTest-seed#[7D76B8CCEE1A22AE]) [    ] o.a.s.c.Overseer Overseer (id=null) closing
   [junit4]   2> 1812836 INFO  (TEST-TestSQLHandler.doTest-seed#[7D76B8CCEE1A22AE]) [    ] o.a.s.c.OverseerElectionContext I am going to be the leader 127.0.0.1:40981_e%2Fi
   [junit4]   2> 1812836 INFO  (TEST-TestSQLHandler.doTest-seed#[7D76B8CCEE1A22AE]) [    ] o.a.s.c.Overseer Overseer (id=98337440559792132-127.0.0.1:40981_e%2Fi-n_0000000000) starting
   [junit4]   2> 1812838 INFO  (TEST-TestSQLHandler.doTest-seed#[7D76B8CCEE1A22AE]) [    ] o.a.s.c.ZkController Register node as live in ZooKeeper:/live_nodes/127.0.0.1:40981_e%2Fi
   [junit4]   2> 1812839 INFO  (zkCallback-5293-thread-1) [    ] o.a.s.c.c.ZkStateReader Updated live nodes from ZooKeeper... (0) -> (1)
   [junit4]   2> 1812958 INFO  (TEST-TestSQLHandler.doTest-seed#[7D76B8CCEE1A22AE]) [    ] o.a.s.m.r.SolrJmxReporter JMX monitoring for 'solr.node' (registry 'solr.node') enabled at server: com.sun.jmx.mbeanserver.JmxMBeanServer@c0d0d3
   [junit4]   2> 1812962 INFO  (TEST-TestSQLHandler.doTest-seed#[7D76B8CCEE1A22AE]) [    ] o.a.s.m.r.SolrJmxReporter JMX monitoring for 'solr.jvm' (registry 'solr.jvm') enabled at server: com.sun.jmx.mbeanserver.JmxMBeanServer@c0d0d3
   [junit4]   2> 1812962 INFO  (TEST-TestSQLHandler.doTest-seed#[7D76B8CCEE1A22AE]) [    ] o.a.s.m.r.SolrJmxReporter JMX monitoring for 'solr.jetty' (registry 'solr.jetty') enabled at server: com.sun.jmx.mbeanserver.JmxMBeanServer@c0d0d3
   [junit4]   2> 1812962 INFO  (TEST-TestSQLHandler.doTest-seed#[7D76B8CCEE1A22AE]) [    ] o.a.s.c.CorePropertiesLocator Found 0 core definitions underneath /home/jenkins/workspace/Lucene-Solr-master-Linux/solr/build/solr-core/test/J0/../../../../../../../../../home/jenkins/workspace/Lucene-Solr-master-Linux/solr/build/solr-core/test/J0/temp/solr.handler.TestSQLHandler_7D76B8CCEE1A22AE-001/control-001/cores
   [junit4]   2> 1812972 INFO  (TEST-TestSQLHandler.doTest-seed#[7D76B8CCEE1A22AE]) [    ] o.a.s.c.c.ZkStateReader Updated live nodes from ZooKeeper... (0) -> (1)
   [junit4]   2> 1812972 INFO  (TEST-TestSQLHandler.doTest-seed#[7D76B8CCEE1A22AE]) [    ] o.a.s.c.s.i.ZkClientClusterStateProvider Cluster at 127.0.0.1:45519/solr ready
   [junit4]   2> 1812973 INFO  (qtp31663374-26063) [    ] o.a.s.h.a.CollectionsHandler Invoked Collection Action :create with params replicationFactor=1&collection.configName=conf1&name=control_collection&nrtReplicas=1&action=CREATE&numShards=1&createNodeSet=127.0.0.1:40981_e%252Fi&wt=javabin&version=2 and sendToOCPQueue=true
   [junit4]   2> 1812974 INFO  (OverseerThreadFactory-7728-thread-1) [    ] o.a.s.c.CreateCollectionCmd Create collection control_collection
   [junit4]   2> 1813076 INFO  (qtp31663374-26065) [    ] o.a.s.h.a.CoreAdminOperation core create command qt=/admin/cores&collection.configName=conf1&newCollection=true&name=control_collection_shard1_replica_n1&action=CREATE&numShards=1&collection=control_collection&shard=shard1&wt=javabin&version=2&replicaType=NRT
   [junit4]   2> 1813076 INFO  (qtp31663374-26065) [    ] o.a.s.c.TransientSolrCoreCacheDefault Allocating transient cache for 4 transient cores
   [junit4]   2> 1813178 INFO  (zkCallback-5293-thread-1) [    ] o.a.s.c.c.ZkStateReader A cluster state change: [WatchedEvent state:SyncConnected type:NodeDataChanged path:/collections/control_collection/state.json] for collection [control_collection] has occurred - updating... (live nodes size: [1])
   [junit4]   2> 1814085 INFO  (qtp31663374-26065) [    ] o.a.s.c.SolrConfig Using Lucene MatchVersion: 8.0.0
   [junit4]   2> 1814118 INFO  (qtp31663374-26065) [    ] o.a.s.s.IndexSchema [control_collection_shard1_replica_n1] Schema name=test
   [junit4]   2> 1814177 WARN  (qtp31663374-26065) [    ] o.a.s.s.IndexSchema Field lowerfilt1and2 is not multivalued and destination for multiple copyFields (2)
   [junit4]   2> 1814177 WARN  (qtp31663374-26065) [    ] o.a.s.s.IndexSchema Field text is not multivalued and destination for multiple copyFields (3)
   [junit4]   2> 1814178 INFO  (qtp31663374-26065) [    ] o.a.s.s.IndexSchema Loaded schema test/1.6 with uniqueid field id
   [junit4]   2> 1814178 INFO  (qtp31663374-26065) [    ] o.a.s.c.CoreContainer Creating SolrCore 'control_collection_shard1_replica_n1' using configuration from collection control_collection, trusted=true
   [junit4]   2> 1814178 INFO  (qtp31663374-26065) [    ] o.a.s.m.r.SolrJmxReporter JMX monitoring for 'solr.core.control_collection.shard1.replica_n1' (registry 'solr.core.control_collection.shard1.replica_n1') enabled at server: com.sun.jmx.mbeanserver.JmxMBeanServer@c0d0d3
   [junit4]   2> 1814178 INFO  (qtp31663374-26065) [    ] o.a.s.c.SolrCore solr.RecoveryStrategy.Builder
   [junit4]   2> 1814178 INFO  (qtp31663374-26065) [    ] o.a.s.c.SolrCore [[control_collection_shard1_replica_n1] ] Opening new SolrCore at [/home/jenkins/workspace/Lucene-Solr-master-Linux/solr/build/solr-core/test/J0/temp/solr.handler.TestSQLHandler_7D76B8CCEE1A22AE-001/control-001/cores/control_collection_shard1_replica_n1], dataDir=[/home/jenkins/workspace/Lucene-Solr-master-Linux/solr/build/solr-core/test/J0/../../../../../../../../../home/jenkins/workspace/Lucene-Solr-master-Linux/solr/build/solr-core/test/J0/temp/solr.handler.TestSQLHandler_7D76B8CCEE1A22AE-001/control-001/cores/control_collection_shard1_replica_n1/data/]
   [junit4]   2> 1814203 INFO  (qtp31663374-26065) [    ] o.a.s.u.UpdateHandler Using UpdateLog implementation: org.apache.solr.update.UpdateLog
   [junit4]   2> 1814203 INFO  (qtp31663374-26065) [    ] o.a.s.u.UpdateLog Initializing UpdateLog: dataDir= defaultSyncLevel=FLUSH numRecordsToKeep=100 maxNumLogsToKeep=10 numVersionBuckets=65536
   [junit4]   2> 1814204 INFO  (qtp31663374-26065) [    ] o.a.s.u.CommitTracker Hard AutoCommit: disabled
   [junit4]   2> 1814204 INFO  (qtp31663374-26065) [    ] o.a.s.u.CommitTracker Soft AutoCommit: disabled
   [junit4]   2> 1814205 INFO  (qtp31663374-26065) [    ] o.a.s.s.SolrIndexSearcher Opening [Searcher@10d7fd2[control_collection_shard1_replica_n1] main]
   [junit4]   2> 1814206 INFO  (qtp31663374-26065) [    ] o.a.s.r.ManagedResourceStorage Configured ZooKeeperStorageIO with znodeBase: /configs/conf1
   [junit4]   2> 1814206 INFO  (qtp31663374-26065) [    ] o.a.s.r.ManagedResourceStorage Loaded null at path _rest_managed.json using ZooKeeperStorageIO:path=/configs/conf1
   [junit4]   2> 1814207 INFO  (searcherExecutor-7731-thread-1) [    ] o.a.s.c.SolrCore [control_collection_shard1_replica_n1] Registered new searcher Searcher@10d7fd2[control_collection_shard1_replica_n1] main{ExitableDirectoryReader(UninvertingDirectoryReader())}
   [junit4]   2> 1814207 INFO  (qtp31663374-26065) [    ] o.a.s.u.UpdateLog Could not find max version in index or recent updates, using new clock 1573399050640687104
   [junit4]   2> 1814209 INFO  (qtp31663374-26065) [    ] o.a.s.c.ShardLeaderElectionContext Enough replicas found to continue.
   [junit4]   2> 1814209 INFO  (qtp31663374-26065) [    ] o.a.s.c.ShardLeaderElectionContext I may be the new leader - try and sync
   [junit4]   2> 1814209 INFO  (qtp31663374-26065) [    ] o.a.s.c.SyncStrategy Sync replicas to http://127.0.0.1:40981/e/i/control_collection_shard1_replica_n1/
   [junit4]   2> 1814209 INFO  (qtp31663374-26065) [    ] o.a.s.c.SyncStrategy Sync Success - now sync replicas to me
   [junit4]   2> 1814210 INFO  (qtp31663374-26065) [    ] o.a.s.c.SyncStrategy http://127.0.0.1:40981/e/i/control_collection_shard1_replica_n1/ has no replicas
   [junit4]   2> 1814210 INFO  (qtp31663374-26065) [    ] o.a.s.c.ShardLeaderElectionContext Found all replicas participating in election, clear LIR
   [junit4]   2> 1814211 INFO  (qtp31663374-26065) [    ] o.a.s.c.ShardLeaderElectionContext I am the new leader: http://127.0.0.1:40981/e/i/control_collection_shard1_replica_n1/ shard1
   [junit4]   2> 1814312 INFO  (zkCallback-5293-thread-1) [    ] o.a.s.c.c.ZkStateReader A cluster state change: [WatchedEvent state:SyncConnected type:NodeDataChanged path:/collections/control_collection/state.json] for collection [control_collection] has occurred - updating... (live nodes size: [1])
   [junit4]   2> 1814361 INFO  (qtp31663374-26065) [    ] o.a.s.c.ZkController I am the leader, no recovery necessary
   [junit4]   2> 1814363 INFO  (qtp31663374-26065) [    ] o.a.s.s.HttpSolrCall [admin] webapp=null path=/admin/cores params={qt=/admin/cores&collection.configName=conf1&newCollection=true&name=control_collection_shard1_replica_n1&action=CREATE&numShards=1&collection=control_collection&shard=shard1&wt=javabin&version=2&replicaType=NRT} status=0 QTime=1287
   [junit4]   2> 1814365 INFO  (qtp31663374-26063) [    ] o.a.s.h.a.CollectionsHandler Wait for new collection to be active for at most 30 seconds. Check all shard replicas
   [junit4]   2> 1814465 INFO  (zkCallback-5293-thread-1) [    ] o.a.s.c.c.ZkStateReader A cluster state change: [WatchedEvent state:SyncConnected type:NodeDataChanged path:/collections/control_collection/state.json] for collection [control_collection] has occurred - updating... (live nodes size: [1])
   [junit4]   2> 1814975 INFO  (OverseerCollectionConfigSetProcessor-98337440559792132-127.0.0.1:40981_e%2Fi-n_0000000000) [    ] o.a.s.c.OverseerTaskQueue Response ZK path: /overseer/collection-queue-work/qnr-0000000000 doesn't exist.  Requestor may have disconnected from ZooKeeper
   [junit4]   2> 1815366 INFO  (qtp31663374-26063) [    ] o.a.s.s.HttpSolrCall [admin] webapp=null path=/admin/collections params={replicationFactor=1&collection.configName=conf1&name=control_collection&nrtReplicas=1&action=CREATE&numShards=1&createNodeSet=127.0.0.1:40981_e%252Fi&wt=javabin&version=2} status=0 QTime=2392
   [junit4]   2> 1815369 INFO  (TEST-TestSQLHandler.doTest-seed#[7D76B8CCEE1A22AE]) [    ] o.a.s.c.c.ZkStateReader Updated live nodes from ZooKeeper... (0) -> (1)
   [junit4]   2> 1815369 INFO  (TEST-TestSQLHandler.doTest-seed#[7D76B8CCEE1A22AE]) [    ] o.a.s.c.s.i.ZkClientClusterStateProvider Cluster at 127.0.0.1:45519/solr ready
   [junit4]   2> 1815369 INFO  (TEST-TestSQLHandler.doTest-seed#[7D76B8CCEE1A22AE]) [    ] o.a.s.c.ChaosMonkey monkey: init - expire sessions:false cause connection loss:false
   [junit4]   2> 1815370 INFO  (qtp31663374-26063) [    ] o.a.s.h.a.CollectionsHandler Invoked Collection Action :create with params replicationFactor=1&collection.configName=conf1&name=collection1&nrtReplicas=1&action=CREATE&numShards=2&createNodeSet=&stateFormat=1&wt=javabin&version=2 and sendToOCPQueue=true
   [junit4]   2> 1815371 INFO  (OverseerThreadFactory-7728-thread-2) [    ] o.a.s.c.CreateCollectionCmd Create collection collection1
   [junit4]   2> 1815371 WARN  (OverseerThreadFactory-7728-thread-2) [    ] o.a.s.c.CreateCollectionCmd It is unusual to create a collection (collection1) without cores.
   [junit4]   2> 1815574 INFO  (qtp31663374-26063) [    ] o.a.s.h.a.CollectionsHandler Wait for new collection to be active for at most 30 seconds. Check all shard replicas
   [junit4]   2> 1815574 INFO  (qtp31663374-26063) [    ] o.a.s.s.HttpSolrCall [admin] webapp=null path=/admin/collections params={replicationFactor=1&collection.configName=conf1&name=collection1&nrtReplicas=1&action=CREATE&numShards=2&createNodeSet=&stateFormat=1&wt=javabin&version=2} status=0 QTime=204
   [junit4]   2> 1815659 INFO  (TEST-TestSQLHandler.doTest-seed#[7D76B8CCEE1A22AE]) [    ] o.a.s.c.AbstractFullDistribZkTestBase create jetty 1 in directory /home/jenkins/workspace/Lucene-Solr-master-Linux/solr/build/solr-core/test/J0/temp/solr.handler.TestSQLHandler_7D76B8CCEE1A22AE-001/shard-1-001 of type NRT
   [junit4]   2> 1815659 INFO  (TEST-TestSQLHandler.doTest-seed#[7D76B8CCEE1A22AE]) [    ] o.e.j.s.Server jetty-9.3.14.v20161028
   [junit4]   2> 1815660 INFO  (TEST-TestSQLHandler.doTest-seed#[7D76B8CCEE1A22AE]) [    ] o.e.j.s.h.ContextHandler Started o.e.j.s.ServletContextHandler@cfea1d{/e/i,null,AVAILABLE}
   [junit4]   2> 1815660 INFO  (TEST-TestSQLHandler.doTest-seed#[7D76B8CCEE1A22AE]) [    ] o.e.j.s.AbstractConnector Started ServerConnector@6eace2{HTTP/1.1,[http/1.1]}{127.0.0.1:46799}
   [junit4]   2> 1815661 INFO  (TEST-TestSQLHandler.doTest-seed#[7D76B8CCEE1A22AE]) [    ] o.e.j.s.Server Started @1831978ms
   [junit4]   2> 1815661 INFO  (TEST-TestSQLHandler.doTest-seed#[7D76B8CCEE1A22AE]) [    ] o.a.s.c.s.e.JettySolrRunner Jetty properties: {hostContext=/e/i, solrconfig=solrconfig.xml, solr.data.dir=/home/jenkins/workspace/Lucene-Solr-master-Linux/solr/build/solr-core/test/J0/temp/solr.handler.TestSQLHandler_7D76B8CCEE1A22AE-001/tempDir-001/jetty1, hostPort=46799, coreRootDirectory=/home/jenkins/workspace/Lucene-Solr-master-Linux/solr/build/solr-core/test/J0/../../../../../../../../../home/jenkins/workspace/Lucene-Solr-master-Linux/solr/build/solr-core/test/J0/temp/solr.handler.TestSQLHandler_7D76B8CCEE1A22AE-001/shard-1-001/cores}
   [junit4]   2> 1815661 ERROR (TEST-TestSQLHandler.doTest-seed#[7D76B8CCEE1A22AE]) [    ] o.a.s.s.StartupLoggingUtils Missing Java Option solr.log.dir. Logging may be missing or incomplete.
   [junit4]   2> 1815661 INFO  (TEST-TestSQLHandler.doTest-seed#[7D76B8CCEE1A22AE]) [    ] o.a.s.s.SolrDispatchFilter  ___      _       Welcome to Apache Solr™ version 8.0.0
   [junit4]   2> 1815661 INFO  (TEST-TestSQLHandler.doTest-seed#[7D76B8CCEE1A22AE]) [    ] o.a.s.s.SolrDispatchFilter / __| ___| |_ _   Starting in cloud mode on port null
   [junit4]   2> 1815661 INFO  (TEST-TestSQLHandler.doTest-seed#[7D76B8CCEE1A22AE]) [    ] o.a.s.s.SolrDispatchFilter \__ \/ _ \ | '_|  Install dir: null, Default config dir: null
   [junit4]   2> 1815661 INFO  (TEST-TestSQLHandler.doTest-seed#[7D76B8CCEE1A22AE]) [    ] o.a.s.s.SolrDispatchFilter |___/\___/_|_|    Start time: 2017-07-20T00:24:25.508562Z
   [junit4]   2> 1815663 INFO  (TEST-TestSQLHandler.doTest-seed#[7D76B8CCEE1A22AE]) [    ] o.a.s.s.SolrDispatchFilter Loading solr.xml from SolrHome (not found in ZooKeeper)
   [junit4]   2> 1815663 INFO  (TEST-TestSQLHandler.doTest-seed#[7D76B8CCEE1A22AE]) [    ] o.a.s.c.SolrXmlConfig Loading container configuration from /home/jenkins/workspace/Lucene-Solr-master-Linux/solr/build/solr-core/test/J0/temp/solr.handler.TestSQLHandler_7D76B8CCEE1A22AE-001/shard-1-001/solr.xml
   [junit4]   2> 1815678 INFO  (TEST-TestSQLHandler.doTest-seed#[7D76B8CCEE1A22AE]) [    ] o.a.s.c.SolrXmlConfig MBean server found: com.sun.jmx.mbeanserver.JmxMBeanServer@c0d0d3, but no JMX reporters were configured - adding default JMX reporter.
   [junit4]   2> 1815679 INFO  (TEST-TestSQLHandler.doTest-seed#[7D76B8CCEE1A22AE]) [    ] o.a.s.c.ZkContainer Zookeeper client=127.0.0.1:45519/solr
   [junit4]   2> 1815681 WARN  (NIOServerCxn.Factory:0.0.0.0/0.0.0.0:0) [    ] o.a.z.s.NIOServerCnxn caught end of stream exception
   [junit4]   2> EndOfStreamException: Unable to read additional data from client sessionid 0x15d5d6194b00008, likely client has closed socket
   [junit4]   2> 	at org.apache.zookeeper.server.NIOServerCnxn.doIO(NIOServerCnxn.java:239)
   [junit4]   2> 	at org.apache.zookeeper.server.NIOServerCnxnFactory.run(NIOServerCnxnFactory.java:203)
   [junit4]   2> 	at java.base/java.lang.Thread.run(Thread.java:844)
   [junit4]   2> 1815683 INFO  (TEST-TestSQLHandler.doTest-seed#[7D76B8CCEE1A22AE]) [    ] o.a.s.c.c.ZkStateReader Updated live nodes from ZooKeeper... (0) -> (1)
   [junit4]   2> 1815684 INFO  (TEST-TestSQLHandler.doTest-seed#[7D76B8CCEE1A22AE]) [    ] o.a.s.c.Overseer Overseer (id=null) closing
   [junit4]   2> 1815684 INFO  (TEST-TestSQLHandler.doTest-seed#[7D76B8CCEE1A22AE]) [    ] o.a.s.c.ZkController Register node as live in ZooKeeper:/live_nodes/127.0.0.1:46799_e%2Fi
   [junit4]   2> 1815685 INFO  (zkCallback-5293-thread-1) [    ] o.a.s.c.c.ZkStateReader Updated live nodes from ZooKeeper... (1) -> (2)
   [junit4]   2> 1815685 INFO  (zkCallback-5300-thread-1) [    ] o.a.s.c.c.ZkStateReader Updated live nodes from ZooKeeper... (1) -> (2)
   [junit4]   2> 1815685 INFO  (zkCallback-5305-thread-1) [    ] o.a.s.c.c.ZkStateReader Updated live nodes from ZooKeeper... (1) -> (2)
   [junit4]   2> 1815728 INFO  (TEST-TestSQLHandler.doTest-seed#[7D76B8CCEE1A22AE]) [    ] o.a.s.m.r.SolrJmxReporter JMX monitoring for 'solr.node' (registry 'solr.node') enabled at server: com.sun.jmx.mbeanserver.JmxMBeanServer@c0d0d3
   [junit4]   2> 1815731 INFO  (TEST-TestSQLHandler.doTest-seed#[7D76B8CCEE1A22AE]) [    ] o.a.s.m.r.SolrJmxReporter JMX monitoring for 'solr.jvm' (registry 'solr.jvm') enabled at server: com.sun.jmx.mbeanserver.JmxMBeanServer@c0d0d3
   [junit4]   2> 1815731 INFO  (TEST-TestSQLHandler.doTest-seed#[7D76B8CCEE1A22AE]) [    ] o.a.s.m.r.SolrJmxReporter JMX monitoring for 'solr.jetty' (registry 'solr.jetty') enabled at server: com.sun.jmx.mbeanserver.JmxMBeanServer@c0d0d3
   [junit4]   2> 1815732 INFO  (TEST-TestSQLHandler.doTest-seed#[7D76B8CCEE1A22AE]) [    ] o.a.s.c.CorePropertiesLocator Found 0 core definitions underneath /home/jenkins/workspace/Lucene-Solr-master-Linux/solr/build/solr-core/test/J0/../../../../../../../../../home/jenkins/workspace/Lucene-Solr-master-Linux/solr/build/solr-core/test/J0/temp/solr.handler.TestSQLHandler_7D76B8CCEE1A22AE-001/shard-1-001/cores
   [junit4]   2> 1815743 INFO  (qtp29093895-26104) [    ] o.a.s.h.a.CollectionsHandler Invoked Collection Action :addreplica with params node=127.0.0.1:46799_e%252Fi&action=ADDREPLICA&collection=collection1&shard=shard2&type=NRT&wt=javabin&version=2 and sendToOCPQueue=true
   [junit4]   2> 1815744 INFO  (OverseerCollectionConfigSetProcessor-98337440559792132-127.0.0.1:40981_e%2Fi-n_0000000000) [    ] o.a.s.c.OverseerTaskQueue Response ZK path: /overseer/collection-queue-work/qnr-0000000002 doesn't exist.  Requestor may have disconnected from ZooKeeper
   [junit4]   2> 1815744 INFO  (OverseerThreadFactory-7728-thread-3) [    ] o.a.s.c.AddReplicaCmd Node Identified 127.0.0.1:46799_e%2Fi for creating new replica
   [junit4]   2> 1815744 INFO  (qtp29093895-26106) [    ] o.a.s.h.a.CoreAdminOperation core create command qt=/admin/cores&collection.configName=conf1&name=collection1_shard2_replica_n0&action=CREATE&collection=collection1&shard=shard2&wt=javabin&version=2&replicaType=NRT
   [junit4]   2> 1815744 INFO  (qtp29093895-26106) [    ] o.a.s.c.TransientSolrCoreCacheDefault Allocating transient cache for 4 transient cores
   [junit4]   2> 1816751 INFO  (qtp29093895-26106) [    ] o.a.s.c.SolrConfig Using Lucene MatchVersion: 8.0.0
   [junit4]   2> 1816761 INFO  (qtp29093895-26106) [    ] o.a.s.s.IndexSchema [collection1_shard2_replica_n0] Schema name=test
   [junit4]   2> 1816825 WARN  (qtp29093895-26106) [    ] o.a.s.s.IndexSchema Field lowerfilt1and2 is not multivalued and destination for multiple copyFields (2)
   [junit4]   2> 1816826 WARN  (qtp29093895-26106) [    ] o.a.s.s.IndexSchema Field text is not multivalued and destination for multiple copyFields (3)
   [junit4]   2> 1816826 INFO  (qtp29093895-26106) [    ] o.a.s.s.IndexSchema Loaded schema test/1.6 with uniqueid field id
   [junit4]   2> 1816826 INFO  (qtp29093895-26106) [    ] o.a.s.c.CoreContainer Creating SolrCore 'collection1_shard2_replica_n0' using configuration from collection collection1, trusted=true
   [junit4]   2> 1816826 INFO  (qtp29093895-26106) [    ] o.a.s.m.r.SolrJmxReporter JMX monitoring for 'solr.core.collection1.shard2.replica_n0' (registry 'solr.core.collection1.shard2.replica_n0') enabled at server: com.sun.jmx.mbeanserver.JmxMBeanServer@c0d0d3
   [junit4]   2> 1816826 INFO  (qtp29093895-26106) [    ] o.a.s.c.SolrCore solr.RecoveryStrategy.Builder
   [junit4]   2> 1816827 INFO  (qtp29093895-26106) [    ] o.a.s.c.SolrCore [[collection1_shard2_replica_n0] ] Opening new SolrCore at [/home/jenkins/workspace/Lucene-Solr-master-Linux/solr/build/solr-core/test/J0/temp/solr.handler.TestSQLHandler_7D76B8CCEE1A22AE-001/shard-1-001/cores/collection1_shard2_replica_n0], dataDir=[/home/jenkins/workspace/Lucene-Solr-master-Linux/solr/build/solr-core/test/J0/../../../../../../../../../home/jenkins/workspace/Lucene-Solr-master-Linux/solr/build/solr-core/test/J0/temp/solr.handler.TestSQLHandler_7D76B8CCEE1A22AE-001/shard-1-001/cores/collection1_shard2_replica_n0/data/]
   [junit4]   2> 1816854 INFO  (qtp29093895-26106) [    ] o.a.s.u.UpdateHandler Using UpdateLog implementation: org.apache.solr.update.UpdateLog
   [junit4]   2> 1816854 INFO  (qtp29093895-26106) [    ] o.a.s.u.UpdateLog Initializing UpdateLog: dataDir= defaultSyncLevel=FLUSH numRecordsToKeep=100 maxNumLogsToKeep=10 numVersionBuckets=65536
   [junit4]   2> 1816855 INFO  (qtp29093895-26106) [    ] o.a.s.u.CommitTracker Hard AutoCommit: disabled
   [junit4]   2> 1816855 INFO  (qtp29093895-26106) [    ] o.a.s.u.CommitTracker Soft AutoCommit: disabled
   [junit4]   2> 1816856 INFO  (qtp29093895-26106) [    ] o.a.s.s.SolrIndexSearcher Opening [Searcher@959650[collection1_shard2_replica_n0] main]
   [junit4]   2> 1816857 INFO  (qtp29093895-26106) [    ] o.a.s.r.ManagedResourceStorage Configured ZooKeeperStorageIO with znodeBase: /configs/conf1
   [junit4]   2> 1816857 INFO  (qtp29093895-26106) [    ] o.a.s.r.ManagedResourceStorage Loaded null at path _rest_managed.json using ZooKeeperStorageIO:path=/configs/conf1
   [junit4]   2> 1816858 INFO  (searcherExecutor-7741-thread-1) [    ] o.a.s.c.SolrCore [collection1_shard2_replica_n0] Registered new searcher Searcher@959650[collection1_shard2_replica_n0] main{ExitableDirectoryReader(UninvertingDirectoryReader())}
   [junit4]   2> 1816858 INFO  (qtp29093895-26106) [    ] o.a.s.u.UpdateLog Could not find max version in index or recent updates, using new clock 1573399053420462080
   [junit4]   2> 1816860 INFO  (qtp29093895-26106) [    ] o.a.s.c.ShardLeaderElectionContext Enough replicas found to continue.
   [junit4]   2> 1816861 INFO  (qtp29093895-26106) [    ] o.a.s.c.ShardLeaderElectionContext I may be the new leader - try and sync
   [junit4]   2> 1816861 INFO  (qtp29093895-26106) [    ] o.a.s.c.SyncStrategy Sync replicas to http://127.0.0.1:46799/e/i/collection1_shard2_replica_n0/
   [junit4]   2> 1816861 INFO  (qtp29093895-26106) [    ] o.a.s.c.SyncStrategy Sync Success - now sync replicas to me
   [junit4]   2> 1816861 INFO  (qtp29093895-26106) [    ] o.a.s.c.SyncStrategy http://127.0.0.1:46799/e/i/collection1_shard2_replica_n0/ has no replicas
   [junit4]   2> 1816861 INFO  (qtp29093895-26106) [    ] o.a.s.c.ShardLeaderElectionContext Found all replicas participating in election, clear LIR
   [junit4]   2> 1816861 INFO  (qtp29093895-26106) [    ] o.a.s.c.ShardLeaderElectionContext I am the new leader: http://127.0.0.1:46799/e/i/collection1_shard2_replica_n0/ shard2
   [junit4]   2> 1817012 INFO  (qtp29093895-26106) [    ] o.a.s.c.ZkController I am the leader, no recovery necessary
   [junit4]   2> 1817014 INFO  (qtp29093895-26106) [    ] o.a.s.s.HttpSolrCall [admin] webapp=null path=/admin/cores params={qt=/admin/cores&collection.configName=conf1&name=collection1_shard2_replica_n0&action=CREATE&collection=collection1&shard=shard2&wt=javabin&version=2&replicaType=NRT} status=0 QTime=1269
   [junit4]   2> 1817015 INFO  (qtp29093895-26104) [    ] o.a.s.s.HttpSolrCall [admin] webapp=null path=/admin/collections params={node=127.0.0.1:46799_e%252Fi&action=ADDREPLICA&collection=collection1&shard=shard2&type=NRT&wt=javabin&version=2} status=0 QTime=1272
   [junit4]   2> 1817128 INFO  (TEST-TestSQLHandler.doTest-seed#[7D76B8CCEE1A22AE]) [    ] o.a.s.c.AbstractFullDistribZkTestBase create jetty 2 in directory /home/jenkins/workspace/Lucene-Solr-master-Linux/solr/build/solr-core/test/J0/temp/solr.handler.TestSQLHandler_7D76B8CCEE1A22AE-001/shard-2-001 of type NRT
   [junit4]   2> 1817128 INFO  (TEST-TestSQLHandler.doTest-seed#[7D76B8CCEE1A22AE]) [    ] o.e.j.s.Server jetty-9.3.14.v20161028
   [junit4]   2> 1817129 INFO  (TEST-TestSQLHandler.doTest-seed#[7D76B8CCEE1A22AE]) [    ] o.e.j.s.h.ContextHandler Started o.e.j.s.ServletContextHandler@b0b557{/e/i,null,AVAILABLE}
   [junit4]   2> 1817129 INFO  (TEST-TestSQLHandler.doTest-seed#[7D76B8CCEE1A22AE]) [    ] o.e.j.s.AbstractConnector Started ServerConnector@1de8d55{HTTP/1.1,[http/1.1]}{127.0.0.1:33915}
   [junit4]   2> 1817129 INFO  (TEST-TestSQLHandler.doTest-seed#[7D76B8CCEE1A22AE]) [    ] o.e.j.s.Server Started @1833446ms
   [junit4]   2> 1817129 INFO  (TEST-TestSQLHandler.doTest-seed#[7D76B8CCEE1A22AE]) [    ] o.a.s.c.s.e.JettySolrRunner Jetty properties: {hostContext=/e/i, solrconfig=solrconfig.xml, solr.data.dir=/home/jenkins/workspace/Lucene-Solr-master-Linux/solr/build/solr-core/test/J0/temp/solr.handler.TestSQLHandler_7D76B8CCEE1A22AE-001/tempDir-001/jetty2, hostPort=33915, coreRootDirectory=/home/jenkins/workspace/Lucene-Solr-master-Linux/solr/build/solr-core/test/J0/temp/solr.handler.TestSQLHandler_7D76B8CCEE1A22AE-001/shard-2-001/cores, replicaType=NRT}
   [junit4]   2> 1817129 ERROR (TEST-TestSQLHandler.doTest-seed#[7D76B8CCEE1A22AE]) [    ] o.a.s.s.StartupLoggingUtils Missing Java Option solr.log.dir. Logging may be missing or incomplete.
   [junit4]   2> 1817129 INFO  (TEST-TestSQLHandler.doTest-seed#[7D76B8CCEE1A22AE]) [    ] o.a.s.s.SolrDispatchFilter  ___      _       Welcome to Apache Solr™ version 8.0.0
   [junit4]   2> 1817129 INFO  (TEST-TestSQLHandler.doTest-seed#[7D76B8CCEE1A22AE]) [    ] o.a.s.s.SolrDispatchFilter / __| ___| |_ _   Starting in cloud mode on port null
   [junit4]   2> 1817129 INFO  (TEST-TestSQLHandler.doTest-seed#[7D76B8CCEE1A22AE]) [    ] o.a.s.s.SolrDispatchFilter \__ \/ _ \ | '_|  Install dir: null, Default config dir: null
   [junit4]   2> 1817129 INFO  (TEST-TestSQLHandler.doTest-seed#[7D76B8CCEE1A22AE]) [    ] o.a.s.s.SolrDispatchFilter |___/\___/_|_|    Start time: 2017-07-20T00:24:26.976881Z
   [junit4]   2> 1817131 INFO  (TEST-TestSQLHandler.doTest-seed#[7D76B8CCEE1A22AE]) [    ] o.a.s.s.SolrDispatchFilter Loading solr.xml from SolrHome (not found in ZooKeeper)
   [junit4]   2> 1817131 INFO  (TEST-TestSQLHandler.doTest-seed#[7D76B8CCEE1A22AE]) [    ] o.a.s.c.SolrXmlConfig Loading container configuration from /home/jenkins/workspace/Lucene-Solr-master-Linux/solr/build/solr-core/test/J0/temp/solr.handler.TestSQLHandler_7D76B8CCEE1A22AE-001/shard-2-001/solr.xml
   [junit4]   2> 1817133 INFO  (TEST-TestSQLHandler.doTest-seed#[7D76B8CCEE1A22AE]) [    ] o.a.s.c.SolrXmlConfig MBean server found: com.sun.jmx.mbeanserver.JmxMBeanServer@c0d0d3, but no JMX reporters were configured - adding default JMX reporter.
   [junit4]   2> 1817134 INFO  (TEST-TestSQLHandler.doTest-seed#[7D76B8CCEE1A22AE]) [    ] o.a.s.c.ZkContainer Zookeeper client=127.0.0.1:45519/solr
   [junit4]   2> 1817138 INFO  (TEST-TestSQLHandler.doTest-seed#[7D76B8CCEE1A22AE]) [    ] o.a.s.c.c.ZkStateReader Updated live nodes from ZooKeeper... (0) -> (2)
   [junit4]   2> 1817138 INFO  (TEST-TestSQLHandler.doTest-seed#[7D76B8CCEE1A22AE]) [    ] o.a.s.c.Overseer Overseer (id=null) closing
   [junit4]   2> 1817139 INFO  (TEST-TestSQLHandler.doTest-seed#[7D76B8CCEE1A22AE]) [    ] o.a.s.c.ZkController Register node as live in ZooKeeper:/live_nodes/127.0.0.1:33915_e%2Fi
   [junit4]   2> 1817139 INFO  (zkCallback-5300-thread-1) [    ] o.a.s.c.c.ZkStateReader Updated live nodes from ZooKeeper... (2) -> (3)
   [junit4]   2> 1817139 INFO  (zkCallback-5293-thread-1) [    ] o.a.s.c.c.ZkStateReader Updated live nodes from ZooKeeper... (2) -> (3)
   [junit4]   2> 1817139 INFO  (zkCallback-5311-thread-1) [    ] o.a.s.c.c.ZkStateReader Updated live nodes from ZooKeeper... (2) -> (3)
   [junit4]   2> 1817139 INFO  (zkCallback-5305-thread-1) [    ] o.a.s.c.c.ZkStateReader Updated live nodes from ZooKeeper... (2) -> (3)
   [junit4]   2> 1817215 INFO  (TEST-TestSQLHandler.doTest-seed#[7D76B8CCEE1A22AE]) [    ] o.a.s.m.r.SolrJmxReporter JMX monitoring for 'solr.node' (registry 'solr.node') enabled at server: com.sun.jmx.mbeanserver.JmxMBeanServer@c0d0d3
   [junit4]   2> 1817218 INFO  (TEST-TestSQLHandler.doTest-seed#[7D76B8CCEE1A22AE]) [    ] o.a.s.m.r.SolrJmxReporter JMX monitoring for 'solr.jvm' (registry 'solr.jvm') enabled at server: com.sun.jmx.mbeanserver.JmxMBeanServer@c0d0d3
   [junit4]   2> 1817218 INFO  (TEST-TestSQLHandler.doTest-seed#[7D76B8CCEE1A22AE]) [    ] o.a.s.m.r.SolrJmxReporter JMX monitoring for 'solr.jetty' (registry 'solr.jetty') enabled at server: com.sun.jmx.mbeanserver.JmxMBeanServer@c0d0d3
   [junit4]   2> 1817219 INFO  (TEST-TestSQLHandler.doTest-seed#[7D76B8CCEE1A22AE]) [    ] o.a.s.c.CorePropertiesLocator Found 0 core definitions underneath /home/jenkins/workspace/Lucene-Solr-master-Linux/solr/build/solr-core/test/J0/temp/solr.handler.TestSQLHandler_7D76B8CCEE1A22AE-001/shard-2-001/cores
   [junit4]   2> 1817234 INFO  (qtp29093895-26105) [    ] o.a.s.h.a.CollectionsHandler Invoked Collection Action :addreplica with params node=127.0.0.1:33915_e%252Fi&action=ADDREPLICA&collection=collection1&shard=shard1&type=NRT&wt=javabin&version=2 and sendToOCPQueue=true
   [junit4]   2> 1817235 INFO  (OverseerCollectionConfigSetProcessor-98337440559792132-127.0.0.1:40981_e%2Fi-n_0000000000) [    ] o.a.s.c.OverseerTaskQueue Response ZK path: /overseer/collection-queue-work/qnr-0000000004 doesn't exist.  Requestor may have disconnected from ZooKeeper
   [junit4]   2> 1817235 INFO  (OverseerThreadFactory-7728-thread-4) [    ] o.a.s.c.AddReplicaCmd Node Identified 127.0.0.1:33915_e%2Fi for creating new replica
   [junit4]   2> 1817235 INFO  (qtp32057164-26133) [    ] o.a.s.h.a.CoreAdminOperation core create command qt=/admin/cores&collection.configName=conf1&name=collection1_shard1_replica_n0&action=CREATE&collection=collection1&shard=shard1&wt=javabin&version=2&replicaType=NRT
   [junit4]   2> 1817235 INFO  (qtp32057164-26133) [    ] o.a.s.c.TransientSolrCoreCacheDefault Allocating transient cache for 4 transient cores
   [junit4]   2> 1818240 INFO  (qtp32057164-26133) [    ] o.a.s.c.SolrConfig Using Lucene MatchVersion: 8.0.0
   [junit4]   2> 1818259 INFO  (qtp32057164-26133) [    ] o.a.s.s.IndexSchema [collection1_shard1_replica_n0] Schema name=test
   [junit4]   2> 1818305 WARN  (qtp32057164-26133) [    ] o.a.s.s.IndexSchema Field lowerfilt1and2 is not multivalued and destination for multiple copyFields (2)
   [junit4]   2> 1818305 WARN  (qtp32057164-26133) [    ] o.a.s.s.IndexSchema Field text is not multivalued and destination for multiple copyFields (3)
   [junit4]   2> 1818305 INFO  (qtp32057164-26133) [    ] o.a.s.s.IndexSchema Loaded schema test/1.6 with uniqueid field id
   [junit4]   2> 1818305 INFO  (qtp32057164-26133) [    ] o.a.s.c.CoreContainer Creating SolrCore 'collection1_shard1_replica_n0' using configuration from collection collection1, trusted=true
   [junit4]   2> 1818305 INFO  (qtp32057164-26133) [    ] o.a.s.m.r.SolrJmxReporter JMX monitoring for 'solr.core.collection1.shard1.replica_n0' (registry 'solr.core.collection1.shard1.replica_n0') enabled at server: com.sun.jmx.mbeanserver.JmxMBeanServer@c0d0d3
   [junit4]   2> 1818305 INFO  (qtp32057164-26133) [    ] o.a.s.c.SolrCore solr.RecoveryStrategy.Builder
   [junit4]   2> 1818305 INFO  (qtp32057164-26133) [    ] o.a.s.c.SolrCore [[collection1_shard1_replica_n0] ] Opening new SolrCore at [/home/jenkins/workspace/Lucene-Solr-master-Linux/solr/build/solr-core/test/J0/temp/solr.handler.TestSQLHandler_7D76B8CCEE1A22AE-001/shard-2-001/cores/collection1_shard1_replica_n0], dataDir=[/home/jenkins/workspace/Lucene-Solr-master-Linux/solr/build/solr-core/test/J0/temp/solr.handler.TestSQLHandler_7D76B8CCEE1A22AE-001/shard-2-001/cores/collection1_shard1_replica_n0/data/]
   [junit4]   2> 1818344 INFO  (qtp32057164-26133) [    ] o.a.s.u.UpdateHandler Using UpdateLog implementation: org.apache.solr.update.UpdateLog
   [junit4]   2> 1818344 INFO  (qtp32057164-26133) [    ] o.a.s.u.UpdateLog Initializing UpdateLog: dataDir= defaultSyncLevel=FLUSH numRecordsToKeep=100 maxNumLogsToKeep=10 numVersionBuckets=65536
   [junit4]   2> 1818344 INFO  (qtp32057164-26133) [    ] o.a.s.u.CommitTracker Hard AutoCommit: disabled
   [junit4]   2> 1818344 INFO  (qtp32057164-26133) [    ] o.a.s.u.CommitTracker Soft AutoCommit: disabled
   [junit4]   2> 1818345 INFO  (qtp32057164-26133) [    ] o.a.s.s.SolrIndexSearcher Opening [Searcher@4ba034[collection1_shard1_replica_n0] main]
   [junit4]   2> 1818346 INFO  (qtp32057164-26133) [    ] o.a.s.r.ManagedResourceStorage Configured ZooKeeperStorageIO with znodeBase: /configs/conf1
   [junit4]   2> 1818346 INFO  (qtp32057164-26133) [    ] o.a.s.r.ManagedResourceStorage Loaded null at path _rest_managed.json using ZooKeeperStorageIO:path=/configs/conf1
   [junit4]   2> 1818347 INFO  (searcherExecutor-7751-thread-1) [    ] o.a.s.c.SolrCore [collection1_shard1_replica_n0] Registered new searcher Searcher@4ba034[collection1_shard1_replica_n0] main{ExitableDirectoryReader(UninvertingDirectoryReader())}
   [junit4]   2> 1818347 INFO  (qtp32057164-26133) [    ] o.a.s.u.UpdateLog Could not find max version in index or recent updates, using new clock 1573399054981791744
   [junit4]   2> 1818351 INFO  (qtp32057164-26133) [    ] o.a.s.c.ShardLeaderElectionContext Enough replicas found to continue.
   [junit4]   2> 1818351 INFO  (qtp32057164-26133) [    ] o.a.s.c.ShardLeaderElectionContext I may be the new leader - try and sync
   [junit4]   2> 1818351 INFO  (qtp32057164-26133) [    ] o.a.s.c.SyncStrategy Sync replicas to http://127.0.0.1:33915/e/i/collection1_shard1_replica_n0/
   [junit4]   2> 1818351 INFO  (qtp32057164-26133) [    ] o.a.s.c.SyncStrategy Sync Success - now sync replicas to me
   [junit4]   2> 1818351 INFO  (qtp32057164-26133) [    ] o.a.s.c.SyncStrategy http://127.0.0.1:33915/e/i/collection1_shard1_replica_n0/ has no replicas
   [junit4]   2> 1818351 INFO  (qtp32057164-26133) [    ] o.a.s.c.ShardLeaderElectionContext Found all replicas participating in election, clear LIR
   [junit4]   2> 1818352 INFO  (qtp32057164-26133) [    ] o.a.s.c.ShardLeaderElectionContext I am the new leader: http://127.0.0.1:33915/e/i/collection1_shard1_replica_n0/ shard1
   [junit4]   2> 1818502 INFO  (qtp32057164-26133) [    ] o.a.s.c.ZkController I am the leader, no recovery necessary
   [junit4]   2> 1818503 INFO  (qtp32057164-26133) [    ] o.a.s.s.HttpSolrCall [admin] webapp=null path=/admin/cores params={qt=/admin/cores&collection.configName=conf1&name=collection1_shard1_replica_n0&action=CREATE&collection=collection1&shard=shard1&wt=javabin&version=2&replicaType=NRT} status=0 QTime=1267
   [junit4]   2> 1818504 INFO  (qtp29093895-26105) [    ] o.a.s.s.HttpSolrCall [admin] webapp=null path=/admin/collections params={node=127.0.0.1:33915_e%252Fi&action=ADDREPLICA&collection=collection1&shard=shard1&type=NRT&wt=javabin&version=2} status=0 QTime=1270
   [junit4]   2> 1818605 INFO  (TEST-TestSQLHandler.doTest-seed#[7D76B8CCEE1A22AE]) [    ] o.a.s.c.AbstractFullDistribZkTestBase create jetty 3 in directory /home/jenkins/workspace/Lucene-Solr-master-Linux/solr/build/solr-core/test/J0/temp/solr.handler.TestSQLHandler_7D76B8CCEE1A22AE-001/shard-3-001 of type NRT
   [junit4]   2> 1818605 INFO  (TEST-TestSQLHandler.doTest-seed#[7D76B8CCEE1A22AE]) [    ] o.e.j.s.Server jetty-9.3.14.v20161028
   [junit4]   2> 1818607 INFO  (TEST-TestSQLHandler.doTest-seed#[7D76B8CCEE1A22AE]) [    ] o.e.j.s.h.ContextHandler Started o.e.j.s.ServletContextHandler@b71816{/e/i,null,AVAILABLE}
   [junit4]   2> 1818607 INFO  (TEST-TestSQLHandler.doTest-seed#[7D76B8CCEE1A22AE]) [    ] o.e.j.s.AbstractConnector Started ServerConnector@11c7494{HTTP/1.1,[http/1.1]}{127.0.0.1:43951}
   [junit4]   2> 1818607 INFO  (TEST-TestSQLHandler.doTest-seed#[7D76B8CCEE1A22AE]) [    ] o.e.j.s.Server Started @1834925ms
   [junit4]   2> 1818607 INFO  (TEST-TestSQLHandler.doTest-seed#[7D76B8CCEE1A22AE]) [    ] o.a.s.c.s.e.JettySolrRunner Jetty properties: {hostContext=/e/i, solrconfig=solrconfig.xml, solr.data.dir=/home/jenkins/workspace/Lucene-Solr-master-Linux/solr/build/solr-core/test/J0/temp/solr.handler.TestSQLHandler_7D76B8CCEE1A22AE-001/tempDir-001/jetty3, hostPort=43951, coreRootDirectory=/home/jenkins/workspace/Lucene-Solr-master-Linux/solr/build/solr-core/test/J0/../../../../../../../../../home/jenkins/workspace/Lucene-Solr-master-Linux/solr/build/solr-core/test/J0/temp/solr.handler.TestSQLHandler_7D76B8CCEE1A22AE-001/shard-3-001/cores}
   [junit4]   2> 1818607 ERROR (TEST-TestSQLHandler.doTest-seed#[7D76B8CCEE1A22AE]) [    ] o.a.s.s.StartupLoggingUtils Missing Java Option solr.log.dir. Logging may be missing or incomplete.
   [junit4]   2> 1818607 INFO  (TEST-TestSQLHandler.doTest-seed#[7D76B8CCEE1A22AE]) [    ] o.a.s.s.SolrDispatchFilter  ___      _       Welcome to Apache Solr™ version 8.0.0
   [junit4]   2> 1818607 INFO  (TEST-TestSQLHandler.doTest-seed#[7D76B8CCEE1A22AE]) [    ] o.a.s.s.SolrDispatchFilter / __| ___| |_ _   Starting in cloud mode on port null
   [junit4]   2> 1818608 INFO  (TEST-TestSQLHandler.doTest-seed#[7D76B8CCEE1A22AE]) [    ] o.a.s.s.SolrDispatchFilter \__ \/ _ \ | '_|  Install dir: null, Default config dir: null
   [junit4]   2> 1818608 INFO  (TEST-TestSQLHandler.doTest-seed#[7D76B8CCEE1A22AE]) [    ] o.a.s.s.SolrDispatchFilter |___/\___/_|_|    Start time: 2017-07-20T00:24:28.455032Z
   [junit4]   2> 1818612 INFO  (TEST-TestSQLHandler.doTest-seed#[7D76B8CCEE1A22AE]) [    ] o.a.s.s.SolrDispatchFilter Loading solr.xml from SolrHome (not found in ZooKeeper)
   [junit4]   2> 1818612 INFO  (TEST-TestSQLHandler.doTest-seed#[7D76B8CCEE1A22AE]) [    ] o.a.s.c.SolrXmlConfig Loading container configuration from /home/jenkins/workspace/Lucene-Solr-master-Linux/solr/build/solr-core/test/J0/temp/solr.handler.TestSQLHandler_7D76B8CCEE1A22AE-001/shard-3-001/solr.xml
   [junit4]   2> 1818614 INFO  (TEST-TestSQLHandler.doTest-seed#[7D76B8CCEE1A22AE]) [    ] o.a.s.c.SolrXmlConfig MBean server found: com.sun.jmx.mbeanserver.JmxMBeanServer@c0d0d3, but no JMX reporters were configured - adding default JMX reporter.
   [junit4]   2> 1818629 INFO  (TEST-TestSQLHandler.doTest-seed#[7D76B8CCEE1A22AE]) [    ] o.a.s.c.ZkContainer Zookeeper client=127.0.0.1:45519/solr
   [junit4]   2> 1818633 INFO  (TEST-TestSQLHandler.doTest-seed#[7D76B8CCEE1A22AE]) [    ] o.a.s.c.c.ZkStateReader Updated live nodes from ZooKeeper... (0) -> (3)
   [junit4]   2> 1818633 INFO  (TEST-TestSQLHandler.doTest-seed#[7D76B8CCEE1A22AE]) [    ] o.a.s.c.Overseer Overseer (id=null) closing
   [junit4]   2> 1818634 INFO  (TEST-TestSQLHandler.doTest-seed#[7D76B8CCEE1A22AE]) [    ] o.a.s.c.ZkController Register node as live in ZooKeeper:/live_nodes/127.0.0.1:43951_e%2Fi
   [junit4]   2> 1818634 INFO  (zkCallback-5293-thread-1) [    ] o.a.s.c.c.ZkStateReader Updated live nodes from ZooKeeper... (3) -> (4)
   [junit4]   2> 1818634 INFO  (zkCallback-5317-thread-1) [    ] o.a.s.c.c.ZkStateReader Updated live nodes from ZooKeeper... (3) -> (4)
   [junit4]   2> 1818634 INFO  (zkCallback-5300-thread-1) [    ] o.a.s.c.c.ZkStateReader Updated live nodes from ZooKeeper... (3) -> (4)
   [junit4]   2> 1818634 INFO  (zkCallback-5305-thread-1) [    ] o.a.s.c.c.ZkStateReader Updated live nodes from ZooKeeper... (3) -> (4)
   [junit4]   2> 1818634 INFO  (zkCallback-5311-thread-1) [    ] o.a.s.c.c.ZkStateReader Updated live nodes from ZooKeeper... (3) -> (4)
   [junit4]   2> 1818686 INFO  (TEST-TestSQLHandler.doTest-seed#[7D76B8CCEE1A22AE]) [    ] o.a.s.m.r.SolrJmxReporter JMX monitoring for 'solr.node' (registry 'solr.node') enabled at server: com.sun.jmx.mbeanserver.JmxMBeanServer@c0d0d3
   [junit4]   2> 1818690 INFO  (TEST-TestSQLHandler.doTest-seed#[7D76B8CCEE1A22AE]) [    ] o.a.s.m.r.SolrJmxReporter JMX monitoring for 'solr.jvm' (registry 'solr.jvm') enabled at server: com.sun.jmx.mbeanserver.JmxMBeanServer@c0d0d3
   [junit4]   2> 1818690 INFO  (TEST-TestSQLHandler.doTest-seed#[7D76B8CCEE1A22AE]) [    ] o.a.s.m.r.SolrJmxReporter JMX monitoring for 'solr.jetty' (registry 'solr.jetty') enabled at server: com.sun.jmx.mbeanserver.JmxMBeanServer@c0d0d3
   [junit4]   2> 1818691 INFO  (TEST-TestSQLHandler.doTest-seed#[7D76B8CCEE1A22AE]) [    ] o.a.s.c.CorePropertiesLocator Found 0 core definitions underneath /home/jenkins/workspace/Lucene-Solr-master-Linux/solr/build/solr-core/test/J0/../../../../../../../../../home/jenkins/workspace/Lucene-Solr-master-Linux/solr/build/solr-core/test/J0/temp/solr.handler.TestSQLHandler_7D76B8CCEE1A22AE-001/shard-3-001/cores
   [junit4]   2> 1818711 INFO  (qtp29093895-26100) [    ] o.a.s.h.a.CollectionsHandler Invoked Collection Action :addreplica with params node=127.0.0.1:43951_e%252Fi&action=ADDREPLICA&collection=collection1&shard=shard2&type=NRT&wt=javabin&version=2 and sendToOCPQueue=true
   [junit4]   2> 1818712 INFO  (OverseerThreadFactory-7728-thread-5) [    ] o.a.s.c.AddReplicaCmd Node Identified 127.0.0.1:43951_e%2Fi for creating new replica
   [junit4]   2> 1818712 INFO  (OverseerCollectionConfigSetProcessor-98337440559792132-127.0.0.1:40981_e%2Fi-n_0000000000) [    ] o.a.s.c.OverseerTaskQueue Response ZK path: /overseer/collection-queue-work/qnr-0000000006 doesn't exist.  Requestor may have disconnected from ZooKeeper
   [junit4]   2> 1818713 INFO  (qtp19154034-26162) [    ] o.a.s.h.a.CoreAdminOperation core create command qt=/admin/cores&collection.configName=conf1&name=collection1_shard2_replica_n1&action=CREATE&collection=collection1&shard=shard2&wt=javabin&version=2&replicaType=NRT
   [junit4]   2> 1818713 INFO  (qtp19154034-26162) [    ] o.a.s.c.TransientSolrCoreCacheDefault Allocating transient cache for 4 transient cores
   [junit4]   2> 1819717 INFO  (qtp19154034-26162) [    ] o.a.s.c.SolrConfig Using Lucene MatchVersion: 8.0.0
   [junit4]   2> 1819722 INFO  (qtp19154034-26162) [    ] o.a.s.s.IndexSchema [collection1_shard2_replica_n1] Schema name=test
   [junit4]   2> 1819763 WARN  (qtp19154034-26162) [    ] o.a.s.s.IndexSchema Field lowerfilt1and2 is not multivalued and destination for multiple copyFields (2)
   [junit4]   2> 1819763 WARN  (qtp19154034-26162) [    ] o.a.s.s.IndexSchema Field text is not multivalued and destination for multiple copyFields (3)
   [junit4]   2> 1819764 INFO  (qtp19154034-26162) [    ] o.a.s.s.IndexSchema Loaded schema test/1.6 with uniqueid field id
   [junit4]   2> 1819764 INFO  (qtp19154034-26162) [    ] o.a.s.c.CoreContainer Creating SolrCore 'collection1_shard2_replica_n1' using configuration from collection collection1, trusted=true
   [junit4]   2> 1819764 INFO  (qtp19154034-26162) [    ] o.a.s.m.r.SolrJmxReporter JMX monitoring for 'solr.core.collection1.shard2.replica_n1' (registry 'solr.core.collection1.shard2.replica_n1') enabled at server: com.sun.jmx.mbeanserver.JmxMBeanServer@c0d0d3
   [junit4]   2> 1819764 INFO  (qtp19154034-26162) [    ] o.a.s.c.SolrCore solr.RecoveryStrategy.Builder
   [junit4]   2> 1819764 INFO  (qtp19154034-26162) [    ] o.a.s.c.SolrCore [[collection1_shard2_replica_n1] ] Opening new SolrCore at [/home/jenkins/workspace/Lucene-Solr-master-Linux/solr/build/solr-core/test/J0/temp/solr.handler.TestSQLHandler_7D76B8CCEE1A22AE-001/shard-3-001/cores/collection1_shard2_replica_n1], dataDir=[/home/jenkins/workspace/Lucene-Solr-master-Linux/solr/build/solr-core/test/J0/../../../../../../../../../home/jenkins/workspace/Lucene-Solr-master-Linux/solr/build/solr-core/test/J0/temp/solr.handler.TestSQLHandler_7D76B8CCEE1A22AE-001/shard-3-001/cores/collection1_shard2_replica_n1/data/]
   [junit4]   2> 1819791 INFO  (qtp19154034-26162) [    ] o.a.s.u.UpdateHandler Using UpdateLog implementation: org.apache.solr.update.UpdateLog
   [junit4]   2> 1819791 INFO  (qtp19154034-26162) [    ] o.a.s.u.UpdateLog Initializing UpdateLog: dataDir= defaultSyncLevel=FLUSH numRecordsToKeep=100 maxNumLogsToKeep=10 numVersionBuckets=65536
   [junit4]   2> 1819792 INFO  (qtp19154034-26162) [    ] o.a.s.u.CommitTracker Hard AutoCommit: disabled
   [junit4]   2> 1819792 INFO  (qtp19154034-26162) [    ] o.a.s.u.CommitTracker Soft AutoCommit: disabled
   [junit4]   2> 1819792 INFO  (qtp19154034-26162) [    ] o.a.s.s.SolrIndexSearcher Opening [Searcher@c52f7[collection1_shard2_replica_n1] main]
   [junit4]   2> 1819793 INFO  (qtp19154034-26162) [    ] o.a.s.r.ManagedResourceStorage Configured ZooKeeperStorageIO with znodeBase: /configs/conf1
   [junit4]   2> 1819793 INFO  (qtp19154034-26162) [    ] o.a.s.r.ManagedResourceStorage Loaded null at path _rest_managed.json using ZooKeeperStorageIO:path=/configs/conf1
   [junit4]   2> 1819794 INFO  (searcherExecutor-7761-thread-1) [    ] o.a.s.c.SolrCore [collection1_shard2_replica_n1] Registered new searcher Searcher@c52f7[collection1_shard2_replica_n1] main{ExitableDirectoryReader(UninvertingDirectoryReader())}
   [junit4]   2> 1819794 INFO  (qtp19154034-26162) [    ] o.a.s.u.UpdateLog Could not find max version in index or recent updates, using new clock 1573399056499081216
   [junit4]   2> 1819797 INFO  (qtp19154034-26162) [    ] o.a.s.c.ZkController Core needs to recover:collection1_shard2_replica_n1
   [junit4]   2> 1819797 INFO  (updateExecutor-5314-thread-1) [    ] o.a.s.u.DefaultSolrCoreState Running recovery
   [junit4]   2> 1819797 INFO  (recoveryExecutor-5315-thread-1) [    ] o.a.s.c.RecoveryStrategy Starting recovery process. recoveringAfterStartup=true
   [junit4]   2> 1819798 INFO  (recoveryExecutor-5315-thread-1) [    ] o.a.s.c.RecoveryStrategy ###### startupVersions=[[]]
   [junit4]   2> 1819798 INFO  (recoveryExecutor-5315-thread-1) [    ] o.a.s.c.RecoveryStrategy Begin buffering updates. core=[collection1_shard2_replica_n1]
   [junit4]   2> 1819798 INFO  (recoveryExecutor-5315-thread-1) [    ] o.a.s.u.UpdateLog Starting to buffer updates. FSUpdateLog{state=ACTIVE, tlog=null}
   [junit4]   2> 1819798 INFO  (recoveryExecutor-5315-thread-1) [    ] o.a.s.c.RecoveryStrategy Publishing state of core [collection1_shard2_replica_n1] as recovering, leader is [http://127.0.0.1:46799/e/i/collection1_shard2_replica_n0/] and I am [http://127.0.0.1:43951/e/i/collection1_shard2_replica_n1/]
   [junit4]   2> 1819798 INFO  (qtp19154034-26162) [    ] o.a.s.s.HttpSolrCall [admin] webapp=null path=/admin/cores params={qt=/admin/cores&collection.configName=conf1&name=collection1_shard2_replica_n1&action=CREATE&collection=collection1&shard=shard2&wt=javabin&version=2&replicaType=NRT} status=0 QTime=1084
   [junit4]   2> 1819799 INFO  (qtp29093895-26100) [    ] o.a.s.s.HttpSolrCall [admin] webapp=null path=/admin/collections params={node=127.0.0.1:43951_e%252Fi&action=ADDREPLICA&collection=collection1&shard=shard2&type=NRT&wt=javabin&version=2} status=0 QTime=1087
   [junit4]   2> 1819799 INFO  (recoveryExecutor-5315-thread-1) [    ] o.a.s.c.RecoveryStrategy Sending prep recovery command to [http://127.0.0.1:46799/e/i]; [WaitForState: action=PREPRECOVERY&core=collection1_shard2_replica_n0&nodeName=127.0.0.1:43951_e%252Fi&coreNodeName=core_node3&state=recovering&checkLive=true&onlyIfLeader=true&onlyIfLeaderActive=true]
   [junit4]   2> 1819800 INFO  (qtp29093895-26101) [    ] o.a.s.h.a.PrepRecoveryOp Going to wait for coreNodeName: core_node3, state: recovering, checkLive: true, onlyIfLeader: true, onlyIfLeaderActive: true, maxTime: 183 s
   [junit4]   2> 1819800 INFO  (qtp29093895-26101) [    ] o.a.s.h.a.PrepRecoveryOp In WaitForState(recovering): collection=collection1, shard=shard2, thisCore=collection1_shard2_replica_n0, leaderDoesNotNeedRecovery=false, isLeader? true, live=true, checkLive=true, currentState=down, localState=active, nodeName=127.0.0.1:43951_e%2Fi, coreNodeName=core_node3, onlyIfActiveCheckResult=false, nodeProps: core_node3:{"core":"collection1_shard2_replica_n1","base_url":"http://127.0.0.1:43951/e/i","node_name":"127.0.0.1:43951_e%2Fi","state":"down","type":"NRT"}
   [junit4]   2> 1819882 INFO  (TEST-TestSQLHandler.doTest-seed#[7D76B8CCEE1A22AE]) [    ] o.a.s.c.AbstractFullDistribZkTestBase create jetty 4 in directory /home/jenkins/workspace/Lucene-Solr-master-Linux/solr/build/solr-core/test/J0/temp/solr.handler.TestSQLHandler_7D76B8CCEE1A22AE-001/shard-4-001 of type NRT
   [junit4]   2> 1819882 INFO  (TEST-TestSQLHandler.doTest-seed#[7D76B8CCEE1A22AE]) [    ] o.e.j.s.Server jetty-9.3.14.v20161028
   [junit4]   2> 1819882 INFO  (TEST-TestSQLHandler.doTest-seed#[7D76B8CCEE1A22AE]) [    ] o.e.j.s.h.ContextHandler Started o.e.j.s.ServletContextHandler@1bc2f64{/e/i,null,AVAILABLE}
   [junit4]   2> 1819882 INFO  (TEST-TestSQLHandler.doTest-seed#[7D76B8CCEE1A22AE]) [    ] o.e.j.s.AbstractConnector Started ServerConnector@1d52539{HTTP/1.1,[http/1.1]}{127.0.0.1:36697}
   [junit4]   2> 1819882 INFO  (TEST-TestSQLHandler.doTest-seed#[7D76B8CCEE1A22AE]) [    ] o.e.j.s.Server Started @1836200ms
   [junit4]   2> 1819882 INFO  (TEST-TestSQLHandler.doTest-seed#[7D76B8CCEE1A22AE]) [    ] o.a.s.c.s.e.JettySolrRunner Jetty properties: {hostContext=/e/i, solrconfig=solrconfig.xml, solr.data.dir=/home/jenkins/workspace/Lucene-Solr-master-Linux/solr/build/solr-core/test/J0/temp/solr.handler.TestSQLHandler_7D76B8CCEE1A22AE-001/tempDir-001/jetty4, hostPort=36697, coreRootDirectory=/home/jenkins/workspace/Lucene-Solr-master-Linux/solr/build/solr-core/test/J0/temp/solr.handler.TestSQLHandler_7D76B8CCEE1A22AE-001/shard-4-001/cores, replicaType=NRT}
   [junit4]   2> 1819883 ERROR (TEST-TestSQLHandler.doTest-seed#[7D76B8CCEE1A22AE]) [    ] o.a.s.s.StartupLoggingUtils Missing Java Option solr.log.dir. Logging may be missing or incomplete.
   [junit4]   2> 1819883 INFO  (TEST-TestSQLHandler.doTest-seed#[7D76B8CCEE1A22AE]) [    ] o.a.s.s.SolrDispatchFilter  ___      _       Welcome to Apache Solr™ version 8.0.0
   [junit4]   2> 1819883 INFO  (TEST-TestSQLHandler.doTest-seed#[7D76B8CCEE1A22AE]) [    ] o.a.s.s.SolrDispatchFilter / __| ___| |_ _   Starting in cloud mode on port null
   [junit4]   2> 1819883 INFO  (TEST-TestSQLHandler.doTest-seed#[7D76B8CCEE1A22AE]) [    ] o.a.s.s.SolrDispatchFilter \__ \/ _ \ | '_|  Install dir: null, Default config dir: null
   [junit4]   2> 1819883 INFO  (TEST-TestSQLHandler.doTest-seed#[7D76B8CCEE1A22AE]) [    ] o.a.s.s.SolrDispatchFilter |___/\___/_|_|    Start time: 2017-07-20T00:24:29.730341Z
   [junit4]   2> 1819884 INFO  (TEST-TestSQLHandler.doTest-seed#[7D76B8CCEE1A22AE]) [    ] o.a.s.s.SolrDispatchFilter Loading solr.xml from SolrHome (not found in ZooKeeper)
   [junit4]   2> 1819884 INFO  (TEST-TestSQLHandler.doTest-seed#[7D76B8CCEE1A22AE]) [    ] o.a.s.c.SolrXmlConfig Loading container configuration from /home/jenkins/workspace/Lucene-Solr-master-Linux/solr/build/solr-core/test/J0/temp/solr.handler.TestSQLHandler_7D76B8CCEE1A22AE-001/shard-4-001/solr.xml
   [junit4]   2> 1819886 INFO  (TEST-TestSQLHandler.doTest-seed#[7D76B8CCEE1A22AE]) [    ] o.a.s.c.SolrXmlConfig MBean server found: com.sun.jmx.mbeanserver.JmxMBeanServer@c0d0d3, but no JMX reporters were configured - adding default JMX reporter.
   [junit4]   2> 1819888 INFO  (TEST-TestSQLHandler.doTest-seed#[7D76B8CCEE1A22AE]) [    ] o.a.s.c.ZkContainer Zookeeper client=127.0.0.1:45519/solr
   [junit4]   2> 1819891 INFO  (TEST-TestSQLHandler.doTest-seed#[7D76B8CCEE1A22AE]) [    ] o.a.s.c.c.ZkStateReader Updated live nodes from ZooKeeper... (0) -> (4)
   [junit4]   2> 1819892 INFO  (TEST-TestSQLHandler.doTest-seed#[7D76B8CCEE1A22AE]) [    ] o.a.s.c.Overseer Overseer (id=null) closing
   [junit4]   2> 1819893 INFO  (TEST-TestSQLHandler.doTest-seed#[7D76B8CCEE1A22AE]) [    ] o.a.s.c.ZkController Register node as live in ZooKeeper:/live_nodes/127.0.0.1:36697_e%2Fi
   [junit4]   2> 1819893 INFO  (zkCallback-5305-thread-1) [    ] o.a.s.c.c.ZkStateReader Updated live nodes from ZooKeeper... (4) -> (5)
   [junit4]   2> 1819893 INFO  (zkCallback-5317-thread-1) [    ] o.a.s.c.c.ZkStateReader Updated live nodes from ZooKeeper... (4) -> (5)
   [junit4]   2> 1819893 INFO  (zkCallback-5300-thread-1) [    ] o.a.s.c.c.ZkStateReader Updated live nodes from ZooKeeper... (4) -> (5)
   [junit4]   2> 1819893 INFO  (zkCallback-5293-thread-1) [    ] o.a.s.c.c.ZkStateReader Updated live nodes from ZooKeeper... (4) -> (5)
   [junit4]   2> 1819893 INFO  (zkCallback-5311-thread-1) [    ] o.a.s.c.c.ZkStateReader Updated live nodes from ZooKeeper... (4) -> (5)
   [junit4]   2> 1819900 INFO  (zkCallback-5324-thread-1) [    ] o.a.s.c.c.ZkStateReader Updated live nodes from ZooKeeper... (4) -> (5)
   [junit4]   2> 1819996 INFO  (TEST-TestSQLHandler.doTest-seed#[7D76B8CCEE1A22AE]) [    ] o.a.s.m.r.SolrJmxReporter JMX monitoring for 'solr.node' (registry 'solr.node') enabled at server: com.sun.jmx.mbeanserver.JmxMBeanServer@c0d0d3
   [junit4]   2> 1820000 INFO  (TEST-TestSQLHandler.doTest-seed#[7D76B8CCEE1A22AE]) [    ] o.a.s.m.r.SolrJmxReporter JMX monitoring for 'solr.jvm' (registry 'solr.jvm') enabled at server: com.sun.jmx.mbeanserver.JmxMBeanServer@c0d0d3
   [junit4]   2> 1820000 INFO  (TEST-TestSQLHandler.doTest-seed#[7D76B8CCEE1A22AE]) [    ] o.a.s.m.r.SolrJmxReporter JMX monitoring for 'solr.jetty' (registry 'solr.jetty') enabled at server: com.sun.jmx.mbeanserver.JmxMBeanServer@c0d0d3
   [junit4]   2> 1820000 INFO  (TEST-TestSQLHandler.doTest-seed#[7D76B8CCEE1A22AE]) [    ] o.a.s.c.CorePropertiesLocator Found 0 core definitions underneath /home/jenkins/workspace/Lucene-Solr-master-Linux/solr/build/solr-core/test/J0/temp/solr.handler.TestSQLHandler_7D76B8CCEE1A22AE-001/shard-4-001/cores
   [junit4]   2> 1820025 INFO  (qtp29093895-26106) [    ] o.a.s.h.a.CollectionsHandler Invoked Collection Action :addreplica with params node=127.0.0.1:36697_e%252Fi&action=ADDREPLICA&collection=collection1&shard=shard1&type=NRT&wt=javabin&version=2 and sendToOCPQueue=true
   [junit4]   2> 1820026 INFO  (OverseerThreadFactory-7728-thread-5) [    ] o.a.s.c.AddReplicaCmd Node Identified 127.0.0.1:36697_e%2Fi for creating new replica
   [junit4]   2> 1820026 INFO  (OverseerCollectionConfigSetProcessor-98337440559792132-127.0.0.1:40981_e%2Fi-n_0000000000) [    ] o.a.s.c.OverseerTaskQueue Response ZK path: /overseer/collection-queue-work/qnr-0000000008 doesn't exist.  Requestor may have disconnected from ZooKeeper
   [junit4]   2> 1820027 INFO  (qtp13097943-26195) [    ] o.a.s.h.a.CoreAdminOperation core create command qt=/admin/cores&collection.configName=conf1&name=collection1_shard1_replica_n1&action=CREATE&collection=collection1&shard=shard1&wt=javabin&version=2&replicaType=NRT
   [junit4]   2> 1820027 INFO  (qtp13097943-26195) [    ] o.a.s.c.TransientSolrCoreCacheDefault Allocating transient cache for 4 transient cores
   [junit4]   2> 1820800 INFO  (qtp29093895-26101) [    ] o.a.s.h.a.PrepRecoveryOp In WaitForState(recovering): collection=collection1, shard=shard2, thisCore=collection1_shard2_replica_n0, leaderDoesNotNeedRecovery=false, isLeader? true, live=true, checkLive=true, currentState=recovering, localState=active, nodeName=127.0.0.1:43951_e%2Fi, coreNodeName=core_node3, onlyIfActiveCheckResult=false, nodeProps: core_node3:{"core":"collection1_shard2_replica_n1","base_url":"http://127.0.0.1:43951/e/i","node_name":"127.0.0.1:43951_e%2Fi","state":"recovering","type":"NRT"}
   [junit4]   2> 1820800 INFO  (qtp29093895-26101) [    ] o.a.s.h.a.PrepRecoveryOp Waited coreNodeName: core_node3, state: recovering, checkLive: true, onlyIfLeader: true for: 1 seconds.
   [junit4]   2> 1820800 INFO  (qtp29093895-26101) [    ] o.a.s.s.HttpSolrCall [admin] webapp=null path=/admin/cores params={nodeName=127.0.0.1:43951_e%252Fi&onlyIfLeaderActive=true&core=collection1_shard2_replica_n0&coreNodeName=core_node3&action=PREPRECOVERY&checkLive=true&state=recovering&onlyIfLeader=true&wt=javabin&version=2} status=0 QTime=1000
   [junit4]   2> 1821036 INFO  (qtp13097943-26195) [    ] o.a.s.c.SolrConfig Using Lucene MatchVersion: 8.0.0
   [junit4]   2> 1821065 INFO  (qtp13097943-26195) [    ] o.a.s.s.IndexSchema [collection1_shard1_replica_n1] Schema name=test
   [junit4]   2> 1821115 WARN  (qtp13097943-26195) [    ] o.a.s.s.IndexSchema Field lowerfilt1and2 is not multivalued and destination for multiple copyFields (2)
   [junit4]   2> 1821115 WARN  (qtp13097943-26195) [    ] o.a.s.s.IndexSchema Field text is not multivalued and destination for multiple copyFields (3)
   [junit4]   2> 1821115 INFO  (qtp13097943-26195) [    ] o.a.s.s.IndexSchema Loaded schema test/1.6 with uniqueid field id
   [junit4]   2> 1821115 INFO  (qtp13097943-26195) [    ] o.a.s.c.CoreContainer Creating SolrCore 'collection1_shard1_replica_n1' using configuration from collection collection1, trusted=true
   [junit4]   2> 1821116 INFO  (qtp13097943-26195) [    ] o.a.s.m.r.SolrJmxReporter JMX monitoring for 'solr.core.collection1.shard1.replica_n1' (registry 'solr.core.collection1.shard1.replica_n1') enabled at server: com.sun.jmx.mbeanserver.JmxMBeanServer@c0d0d3
   [junit4]   2> 1821116 INFO  (qtp13097943-26195) [    ] o.a.s.c.SolrCore solr.RecoveryStrategy.Builder
   [junit4]   2> 1821116 INFO  (qtp13097943-26195) [    ] o.a.s.c.SolrCore [[collection1_shard1_replica_n1] ] Opening new SolrCore at [/home/jenkins/workspace/Lucene-Solr-master-Linux/solr/build/solr-core/test/J0/temp/solr.handler.TestSQLHandler_7D76B8CCEE1A22AE-001/shard-4-001/cores/collection1_shard1_replica_n1], dataDir=[/home/jenkins/workspace/Lucene-Solr-master-Linux/solr/build/solr-core/test/J0/temp/solr.handler.TestSQLHandler_7D76B8CCEE1A22AE-001/shard-4-001/cores/collection1_shard1_replica_n1/data/]
   [junit4]   2> 1821143 INFO  (qtp13097943-26195) [    ] o.a.s.u.UpdateHandler Using UpdateLog implementation: org.apache.solr.update.UpdateLog
   [junit4]   2> 1821143 INFO  (qtp13097943-26195) [    ] o.a.s.u.UpdateLog Initializing UpdateLog: dataDir= defaultSyncLevel=FLUSH numRecordsToKeep=100 maxNumLogsToKeep=10 numVersionBuckets=65536
   [junit4]   2> 1821144 INFO  (qtp13097943-26195) [    ] o.a.s.u.CommitTracker Hard AutoCommit: disabled
   [junit4]   2> 1821144 INFO  (qtp13097943-26195) [    ] o.a.s.u.CommitTracker Soft AutoCommit: disabled
   [junit4]   2> 1821145 INFO  (qtp13097943-26195) [    ] o.a.s.s.SolrIndexSearcher Opening [Searcher@cdd567[collection1_shard1_replica_n1] main]
   [junit4]   2> 1821145 INFO  (qtp13097943-26195) [    ] o.a.s.r.ManagedResourceStorage Configured ZooKeeperStorageIO with znodeBase: /configs/conf1
   [junit4]   2> 1821146 INFO  (qtp13097943-26195) [    ] o.a.s.r.ManagedResourceStorage Loaded null at path _rest_managed.json using ZooKeeperStorageIO:path=/configs/conf1
   [junit4]   2> 1821146 INFO  (searcherExecutor-7771-thread-1) [    ] o.a.s.c.SolrCore [collection1_shard1_replica_n1] Registered new searcher Searcher@cdd567[collection1_shard1_replica_n1] main{ExitableDirectoryReader(UninvertingDirectoryReader())}
   [junit4]   2> 1821146 INFO  (qtp13097943-26195) [    ] o.a.s.u.UpdateLog Could not find max version in index or recent updates, using new clock 1573399057916755968
   [junit4]   2> 1821149 INFO  (qtp13097943-26195) [    ] o.a.s.c.ZkController Core needs to recover:collection1_shard1_replica_n1
   [junit4]   2> 1821149 INFO  (updateExecutor-5321-thread-1) [    ] o.a.s.u.DefaultSolrCoreState Running recovery
   [junit4]   2> 1821150 INFO  (recoveryExecutor-5322-thread-1) [    ] o.a.s.c.RecoveryStrategy Starting recovery process. recoveringAfterStartup=true
   [junit4]   2> 1821150 INFO  (recoveryExecutor-5322-thread-1) [    ] o.a.s.c.RecoveryStrategy ###### startupVersions=[[]]
   [junit4]   2> 1821150 INFO  (recoveryExecutor-5322-thread-1) [    ] o.a.s.c.RecoveryStrategy Begin buffering updates. core=[collection1_shard1_replica_n1]
   [junit4]   2> 1821150 INFO  (recoveryExecutor-5322-thread-1) [    ] o.a.s.u.UpdateLog Starting to buffer updates. FSUpdateLog{state=ACTIVE, tlog=null}
   [junit4]   2> 1821150 INFO  (recoveryExecutor-5322-thread-1) [    ] o.a.s.c.RecoveryStrategy Publishing state of core [collection1_shard1_replica_n1] as recovering, leader is [http://127.0.0.1:33915/e/i/collection1_shard1_replica_n0/] and I am [http://127.0.0.1:36697/e/i/collection1_shard1_replica_n1/]
   [junit4]   2> 1821150 INFO  (qtp13097943-26195) [    ] o.a.s.s.HttpSolrCall [admin] webapp=null path=/admin/cores params={qt=/admin/cores&collection.configName=conf1&name=collection1_shard1_replica_n1&action=CREATE&collection=collection1&shard=shard1&wt=javabin&version=2&replicaType=NRT} status=0 QTime=1123
   [junit4]   2> 1821151 INFO  (qtp29093895-26106) [    ] o.a.s.s.HttpSolrCall [admin] webapp=null path=/admin/collections params={node=127.0.0.1:36697_e%252Fi&action=ADDREPLICA&collection=collection1&shard=shard1&type=NRT&wt=javabin&version=2} status=0 QTime=1125
   [junit4]   2> 1821151 INFO  (recoveryExecutor-5322-thread-1) [    ] o.a.s.c.RecoveryStrategy Sending prep recovery command to [http://127.0.0.1:33915/e/i]; [WaitForState: action=PREPRECOVERY&core=collection1_shard1_replica_n0&nodeName=127.0.0.1:36697_e%252Fi&coreNodeName=core_node4&state=recovering&checkLive=true&onlyIfLeader=true&onlyIfLeaderActive=true]
   [junit4]   2> 1821152 INFO  (qtp32057164-26135) [    ] o.a.s.h.a.PrepRecoveryOp Going to wait for coreNodeName: core_node4, state: recovering, checkLive: true, onlyIfLeader: true, onlyIfLeaderActive: true, maxTime: 183 s
   [junit4]   2> 1821152 INFO  (qtp32057164-26135) [    ] o.a.s.h.a.PrepRecoveryOp In WaitForState(recovering): collection=collection1, shard=shard1, thisCore=collection1_shard1_replica_n0, leaderDoesNotNeedRecovery=false, isLeader? true, live=true, checkLive=true, currentState=down, localState=active, nodeName=127.0.0.1:36697_e%2Fi, coreNodeName=core_node4, onlyIfActiveCheckResult=false, nodeProps: core_node4:{"core":"collection1_shard1_replica_n1","base_url":"http://127.0.0.1:36697/e/i","node_name":"127.0.0.1:36697_e%2Fi","state":"down","type":"NRT"}
   [junit4]   2> 1821152 INFO  (TEST-TestSQLHandler.doTest-seed#[7D76B8CCEE1A22AE]) [    ] o.a.s.SolrTestCaseJ4 ###Starting doTest
   [junit4]   2> 1821153 INFO  (TEST-TestSQLHandler.doTest-seed#[7D76B8CCEE1A22AE]) [    ] o.a.s.c.AbstractDistribZkTestBase Wait for recoveries to finish - collection: collection1 failOnTimeout:true timeout (sec):330
   [junit4]   2> 1821301 INFO  (recoveryExecutor-5315-thread-1) [    ] o.a.s.c.RecoveryStrategy Attempting to PeerSync from [http://127.0.0.1:46799/e/i/collection1_shard2_replica_n0/] - recoveringAfterStartup=[true]
   [junit4]   2> 1821301 INFO  (recoveryExecutor-5315-thread-1) [    ] o.a.s.u.PeerSync PeerSync: core=collection1_shard2_replica_n1 url=http://127.0.0.1:43951/e/i START replicas=[http://127.0.0.1:46799/e/i/collection1_shard2_replica_n0/] nUpdates=100
   [junit4]   2> 1821302 INFO  (qtp29093895-26101) [    ] o.a.s.u.IndexFingerprint IndexFingerprint millis:0.0 result:{maxVersionSpecified=9223372036854775807, maxVersionEncountered=0, maxInHash=0, versionsHash=0, numVersions=0, numDocs=0, maxDoc=0}
   [junit4]   2> 1821302 INFO  (qtp29093895-26101) [    ] o.a.s.c.S.Request [collection1_shard2_replica_n0]  webapp=/e/i path=/get params={distrib=false&qt=/get&getFingerprint=9223372036854775807&wt=javabin&version=2} status=0 QTime=0
   [junit4]   2> 1821302 INFO  (recoveryExecutor-5315-thread-1) [    ] o.a.s.u.IndexFingerprint IndexFingerprint millis:0.0 result:{maxVersionSpecified=9223372036854775807, maxVersionEncountered=0, maxInHash=0, versionsHash=0, numVersions=0, numDocs=0, maxDoc=0}
   [junit4]   2> 1821302 INFO  (recoveryExecutor-5315-thread-1) [    ] o.a.s.u.PeerSync We are already in sync. No need to do a PeerSync 
   [junit4]   2> 1821302 INFO  (recoveryExecutor-5315-thread-1) [    ] o.a.s.u.DirectUpdateHandler2 start commit{,optimize=false,openSearcher=true,waitSearcher=true,expungeDeletes=false,softCommit=false,prepareCommit=false}
   [junit4]   2> 1821302 INFO  (recoveryExecutor-5315-thread-1) [    ] o.a.s.u.DirectUpdateHandler2 No uncommitted changes. Skipping IW.commit.
   [junit4]   2> 1821303 INFO  (recoveryExecutor-5315-thread-1) [    ] o.a.s.u.DirectUpdateHandler2 end_commit_flush
   [junit4]   2> 1821303 INFO  (recoveryExecutor-5315-thread-1) [    ] o.a.s.c.RecoveryStrategy PeerSync stage of recovery was successful.
   [junit4]   2> 1821303 INFO  (recoveryExecutor-5315-thread-1) [    ] o.a.s.c.RecoveryStrategy Replaying updates buffered during PeerSync.
   [junit4]   2> 1821303 INFO  (recoveryExecutor-5315-thread-1) [    ] o.a.s.c.RecoveryStrategy No replay needed.
   [junit4]   2> 1821303 INFO  (recoveryExecutor-5315-thread-1) [    ] o.a.s.c.RecoveryStrategy Registering as Active after recovery.
   [junit4]   2> 1822027 INFO  (OverseerCollectionConfigSetProcessor-98337440559792132-127.0.0.1:40981_e%2Fi-n_0000000000) [    ] o.a.s.c.OverseerTaskQueue Response ZK path: /overseer/collection-queue-work/qnr-0000000010 doesn't exist.  Requestor may have disconnected from ZooKeeper
   [junit4]   2> 1822152 INFO  (qtp32057164-26135) [    ] o.a.s.h.a.PrepRecoveryOp In WaitForState(recovering): collection=collection1, shard=shard1, thisCore=collection1_shard1_replica_n0, leaderDoesNotNeedRecovery=false, isLeader? true, live=true, checkLive=true, currentState=recovering, localState=active, nodeName=127.0.0.1:36697_e%2Fi, coreNodeName=core_node4, onlyIfActiveCheckResult=false, nodeProps: core_node4:{"core":"collection1_shard1_replica_n1","base_url":"http://127.0.0.1:36697/e/i","node_name":"127.0.0.1:36697_e%2Fi","state":"recovering","type":"NRT"}
   [junit4]   2> 1822152 INFO  (qtp32057164-26135) [    ] o.a.s.h.a.PrepRecoveryOp Waited coreNodeName: core_node4, state: recovering, checkLive: true, onlyIfLeader: true for: 1 seconds.
   [junit4]   2> 1822152 INFO  (qtp32057164-26135) [    ] o.a.s.s.HttpSolrCall [admin] webapp=null path=/admin/cores params={nodeName=127.0.0.1:36697_e%252Fi&onlyIfLeaderActive=true&core=collection1_shard1_replica_n0&coreNodeName=core_node4&action=PREPRECOVERY&checkLive=true&state=recovering&onlyIfLeader=true&wt=javabin&version=2} status=0 QTime=1000
   [junit4]   2> 1822652 INFO  (recoveryExecutor-5322-thread-1) [    ] o.a.s.c.RecoveryStrategy Attempting to PeerSync from [http://127.0.0.1:33915/e/i/collection1_shard1_replica_n0/] - recoveringAfterStartup=[true]
   [junit4]   2> 1822653 INFO  (recoveryExecutor-5322-thread-1) [    ] o.a.s.u.PeerSync PeerSync: core=collection1_shard1_replica_n1 url=http://127.0.0.1:36697/e/i START replicas=[http://127.0.0.1:33915/e/i/collection1_shard1_replica_n0/] nUpdates=100
   [junit4]   2> 1822654 INFO  (qtp32057164-26130) [    ] o.a.s.u.IndexFingerprint IndexFingerprint millis:0.0 result:{maxVersionSpecified=9223372036854775807, maxVersionEncountered=0, maxInHash=0, versionsHash=0, numVersions=0, numDocs=0, maxDoc=0}
   [junit4]   2> 1822654 INFO  (qtp32057164-26130) [    ] o.a.s.c.S.Request [collection1_shard1_replica_n0]  webapp=/e/i path=/get params={distrib=false&qt=/get&getFingerprint=9223372036854775807&wt=javabin&version=2} status=0 QTime=0
   [junit4]   2> 1822654 INFO  (recoveryExecutor-5322-thread-1) [    ] o.a.s.u.IndexFingerprint IndexFingerprint millis:0.0 result:{maxVersionSpecified=9223372036854775807, maxVersionEncountered=0, maxInHash=0, versionsHash=0, numVersions=0, numDocs=0, maxDoc=0}
   [junit4]   2> 1822654 INFO  (recoveryExecutor-5322-thread-1) [    ] o.a.s.u.PeerSync We are already in sync. No need to do a PeerSync 
   [junit4]   2> 1822654 INFO  (recoveryExecutor-5322-thread-1) [    ] o.a.s.u.DirectUpdateHandler2 start commit{,optimize=false,openSearcher=true,waitSearcher=true,expungeDeletes=false,softCommit=false,prepareCommit=false}
   [junit4]   2> 1822654 INFO  (recoveryExecutor-5322-thread-1) [    ] o.a.s.u.DirectUpdateHandler2 No uncommitted changes. Skipping IW.commit.
   [junit4]   2> 1822654 INFO  (recoveryExecutor-5322-thread-1) [    ] o.a.s.u.DirectUpdateHandler2 end_commit_flush
   [junit4]   2> 1822654 INFO  (recoveryExecutor-5322-thread-1) [    ] o.a.s.c.RecoveryStrategy PeerSync stage of recovery was successful.
   [junit4]   2> 1822654 INFO  (recoveryExecutor-5322-thread-1) [    ] o.a.s.c.RecoveryStrategy Replaying updates buffered during PeerSync.
   [junit4]   2> 1822654 INFO  (recoveryExecutor-5322-thread-1) [    ] o.a.s.c.RecoveryStrategy No replay needed.
   [junit4]   2> 1822654 INFO  (recoveryExecutor-5322-thread-1) [    ] o.a.s.c.RecoveryStrategy Registering as Active after recovery.
   [junit4]   2> 1823153 INFO  (TEST-TestSQLHandler.doTest-seed#[7D76B8CCEE1A22AE]) [    ] o.a.s.c.AbstractDistribZkTestBase Recoveries finished - collection: collection1
   [junit4]   2> 1823154 INFO  (qtp31663374-26065) [    ] o.a.s.u.p.LogUpdateProcessorFactory [control_collection_shard1_replica_n1]  webapp=/e/i path=/update params={wt=javabin&version=2}{deleteByQuery=*:* (-1573399060022296576)} 0 0
   [junit4]   2> 1823158 INFO  (qtp13097943-26197) [    ] o.a.s.u.p.LogUpdateProcessorFactory [collection1_shard1_replica_n1]  webapp=/e/i path=/update params={update.distrib=FROMLEADER&_version_=-1573399060023345152&distrib.from=http://127.0.0.1:33915/e/i/collection1_shard1_replica_n0/&wt=javabin&version=2}{deleteByQuery=*:* (-1573399060023345152)} 0 0
   [junit4]   2> 1823158 INFO  (qtp32057164-26131) [    ] o.a.s.u.p.LogUpdateProcessorFactory [collection1_shard1_replica_n0]  webapp=/e/i path=/update params={update.distrib=TOLEADER&distrib.from=http://127.0.0.1:46799/e/i/collection1_shard2_replica_n0/&wt=javabin&version=2}{deleteByQuery=*:* (-1573399060023345152)} 0 2
   [junit4]   2> 1823158 INFO  (qtp19154034-26158) [    ] o.a.s.u.p.LogUpdateProcessorFactory [collection1_shard2_replica_n1]  webapp=/e/i path=/update params={update.distrib=FROMLEADER&_version_=-1573399060023345152&distrib.from=http://127.0.0.1:46799/e/i/collection1_shard2_replica_n0/&wt=javabin&version=2}{deleteByQuery=*:* (-1573399060023345152)} 0 1
   [junit4]   2> 1823158 INFO  (qtp29093895-26105) [    ] o.a.s.u.p.LogUpdateProcessorFactory [collection1_shard2_replica_n0]  webapp=/e/i path=/update params={wt=javabin&version=2}{deleteByQuery=*:* (-1573399060023345152)} 0 3
   [junit4]   2> 1823158 INFO  (qtp31663374-26060) [    ] o.a.s.u.DirectUpdateHandler2 start commit{_version_=1573399060026490880,optimize=false,openSearcher=true,waitSearcher=true,expungeDeletes=false,softCommit=false,prepareCommit=false}
   [junit4]   2> 1823159 INFO  (qtp31663374-26060) [    ] o.a.s.u.DirectUpdateHandler2 No uncommitted changes. Skipping IW.commit.
   [junit4]   2> 1823159 INFO  (qtp31663374-26060) [    ] o.a.s.u.DirectUpdateHandler2 end_commit_flush
   [junit4]   2> 1823159 INFO  (qtp31663374-26060) [    ] o.a.s.u.p.LogUpdateProcessorFactory [control_collection_shard1_replica_n1]  webapp=/e/i path=/update params={waitSearcher=true&commit=true&softCommit=false&wt=javabin&version=2}{commit=} 0 0
   [junit4]   2> 1823159 INFO  (qtp32057164-26133) [    ] o.a.s.u.DirectUpdateHandler2 start commit{_version_=1573399060027539456,optimize=false,openSearcher=true,waitSearcher=true,expungeDeletes=false,softCommit=false,prepareCommit=false}
   [junit4]   2> 1823159 INFO  (qtp32057164-26133) [    ] o.a.s.u.DirectUpdateHandler2 No uncommitted changes. Skipping IW.commit.
   [junit4]   2> 1823159 INFO  (qtp19154034-26164) [    ] o.a.s.u.DirectUpdateHandler2 start commit{_version_=1573399060027539456,optimize=false,openSearcher=true,waitSearcher=true,expungeDeletes=false,softCommit=false,prepareCommit=false}
   [junit4]   2> 1823159 INFO  (qtp32057164-26133) [    ] o.a.s.u.DirectUpdateHandler2 end_commit_flush
   [junit4]   2> 1823159 INFO  (qtp19154034-26164) [    ] o.a.s.u.DirectUpdateHandler2 No uncommitted changes. Skipping IW.commit.
   [junit4]   2> 1823159 INFO  (qtp13097943-26192) [    ] o.a.s.u.DirectUpdateHandler2 start commit{_version_=1573399060027539456,optimize=false,openSearcher=true,waitSearcher=true,expungeDeletes=false,softCommit=false,prepareCommit=false}
   [junit4]   2> 1823159 INFO  (qtp13097943-26192) [    ] o.a.s.u.DirectUpdateHandler2 No uncommitted changes. Skipping IW.commit.
   [junit4]   2> 1823159 INFO  (qtp32057164-26133) [    ] o.a.s.u.p.LogUpdateProcessorFactory [collection1_shard1_replica_n0]  webapp=/e/i path=/update params={update.distrib=FROMLEADER&waitSearcher=true&openSearcher=true&commit=true&softCommit=false&distrib.from=http://127.0.0.1:46799/e/i/collection1_shard2_replica_n0/&commit_end_point=true&wt=javabin&version=2&expungeDeletes=false}{commit=} 0 0
   [junit4]   2> 1823160 INFO  (qtp13097943-26192) [    ] o.a.s.u.DirectUpdateHandler2 end_commit_flush
   [junit4]   2> 1823160 INFO  (qtp13097943-26192) [    ] o.a.s.u.p.LogUpdateProcessorFactory [collection1_shard1_replica_n1]  webapp=/e/i path=/update params={update.distrib=FROMLEADER&waitSearcher=true&openSearcher=true&commit=true&softCommit=false&distrib.from=http://127.0.0.1:46799/e/i/collection1_shard2_replica_n0/&commit_end_point=true&wt=javabin&version=2&expungeDeletes=false}{commit=} 0 0
   [junit4]   2> 1823160 INFO  (qtp19154034-26164) [    ] o.a.s.u.DirectUpdateHandler2 end_commit_flush
   [junit4]   2> 1823160 INFO  (qtp19154034-26164) [    ] o.a.s.u.p.LogUpdateProcessorFactory [collection1_shard2_replica_n1]  webapp=/e/i path=/update params={update.distrib=FROMLEADER&waitSearcher=true&openSearcher=true&commit=true&softCommit=false&distrib.from=http://127.0.0.1:46799/e/i/collection1_shard2_replica_n0/&commit_end_point=true&wt=javabin&version=2&expungeDeletes=false}{commit=} 0 0
   [junit4]   2> 1823160 INFO  (qtp29093895-26101) [    ] o.a.s.u.DirectUpdateHandler2 start commit{_version_=1573399060028588032,optimize=false,openSearcher=true,waitSearcher=true,expungeDeletes=false,softCommit=false,prepareCommit=false}
   [junit4]   2> 1823160 INFO  (qtp29093895-26101) [    ] o.a.s.u.DirectUpdateHandler2 No uncommitted changes. Skipping IW.commit.
   [junit4]   2> 1823160 INFO  (qtp29093895-26101) [    ] o.a.s.u.DirectUpdateHandler2 end_commit_flush
   [junit4]   2> 1823160 INFO  (qtp29093895-26101) [    ] o.a.s.u.p.LogUpdateProcessorFactory [collection1_shard2_replica_n0]  webapp=/e/i path=/update params={update.distrib=FROMLEADER&waitSearcher=true&openSearcher=true&commit=true&softCommit=false&distrib.from=http://127.0.0.1:46799/e/i/collection1_shard2_replica_n0/&commit_end_point=true&wt=javabin&version=2&expungeDeletes=false}{commit=} 0 0
   [junit4]   2> 1823160 INFO  (qtp29093895-26106) [    ] o.a.s.u.p.LogUpdateProcessorFactory [collection1_shard2_replica_n0]  webapp=/e/i path=/update params={waitSearcher=true&commit=true&softCommit=false&wt=javabin&version=2}{commit=} 0 1
   [junit4]   2> 1823161 INFO  (qtp31663374-26063) [    ] o.a.s.u.p.LogUpdateProcessorFactory [control_collection_shard1_replica_n1]  webapp=/e/i path=/update params={wt=javabin&version=2&CONTROL=TRUE}{add=[1 (1573399060029636608)]} 0 0
   [junit4]   2> 1823163 INFO  (qtp13097943-26190) [    ] o.a.s.u.p.LogUpdateProcessorFactory [collection1_shard1_replica_n1]  webapp=/e/i path=/update params={update.distrib=FROMLEADER&distrib.from=http://127.0.0.1:33915/e/i/collection1_shard1_replica_n0/&wt=javabin&version=2}{add=[1 (1573399060030685184)]} 0 0
   [junit4]   2> 1823163 INFO  (qtp32057164-26135) [    ] o.a.s.u.p.LogUpdateProcessorFactory [collection1_shard1_replica_n0]  webapp=/e/i path=/update params={wt=javabin&version=2}{add=[1 (1573399060030685184)]} 0 1
   [junit4]   2> 1823164 INFO  (qtp31663374-26061) [    ] o.a.s.u.p.LogUpdateProcessorFactory [control_collection_shard1_replica_n1]  webapp=/e/i path=/update params={wt=javabin&version=2&CONTROL=TRUE}{add=[2 (1573399060032782336)]} 0 0
   [junit4]   2> 1823165 INFO  (qtp19154034-26157) [    ] o.a.s.u.p.LogUpdateProcessorFactory [collection1_shard2_replica_n1]  webapp=/e/i path=/update params={update.distrib=FROMLEADER&distrib.from=http://127.0.0.1:46799/e/i/collection1_shard2_replica_n0/&wt=javabin&version=2}{add=[2 (1573399060032782336)]} 0 0
   [junit4]   2> 1823166 INFO  (qtp29093895-26102) [    ] o.a.s.u.p.LogUpdateProcessorFactory [collection1_shard2_replica_n0]  webapp=/e/i path=/update params={wt=javabin&version=2}{add=[2 (1573399060032782336)]} 0 1
   [junit4]   2> 1823166 INFO  (qtp31663374-26061) [    ] o.a.s.u.p.LogUpdateProcessorFactory [control_collection_shard1_replica_n1]  webapp=/e/i path=/update params={wt=javabin&version=2&CONTROL=TRUE}{add=[3 (1573399060034879488)]} 0 0
   [junit4]   2> 1823166 INFO  (qtp19154034-26162) [    ] o.a.s.u.p.LogUpdateProcessorFactory [collection1_shard2_replica_n1]  webapp=/e/i path=/update params={update.distrib=FROMLEADER&distrib.from=http://127.0.0.1:46799/e/i/collection1_shard2_replica_n0/&wt=javabin&version=2}{add=[3 (1573399060034879488)]} 0 0
   [junit4]   2> 1823167 INFO  (qtp29093895-26099) [    ] o.a.s.u.p.LogUpdateProcessorFactory [collection1_shard2_replica_n0]  webapp=/e/i path=/update params={wt=javabin&version=2}{add=[3 (1573399060034879488)]} 0 0
   [junit4]   2> 1823167 INFO  (qtp31663374-26061) [    ] o.a.s.u.p.LogUpdateProcessorFactory [control_collection_shard1_replica_n1]  webapp=/e/i path=/update params={wt=javabin&version=2&CONTROL=TRUE}{add=[4 (1573399060035928064)]} 0 0
   [junit4]   2> 1823167 INFO  (qtp13097943-26190) [    ] o.a.s.u.p.LogUpdateProcessorFactory [collection1_shard1_replica_n1]  webapp=/e/i path=/update params={update.distrib=FROMLEADER&distrib.from=http://127.0.0.1:33915/e/i/collection1_shard1_replica_n0/&wt=javabin&version=2}{add=[4 (1573399060035928064)]} 0 0
   [junit4]   2> 1823167 INFO  (qtp32057164-26131) [    ] o.a.s.u.p.LogUpdateProcessorFactory [collection1_shard1_replica_n0]  webapp=/e/i path=/update params={wt=javabin&version=2}{add=[4 (1573399060035928064)]} 0 0
   [junit4]   2> 1823168 INFO  (qtp31663374-26063) [    ] o.a.s.u.p.LogUpdateProcessorFactory [control_collection_shard1_replica_n1]  webapp=/e/i path=/update params={wt=javabin&version=2&CONTROL=TRUE}{add=[5 (1573399060036976640)]} 0 0
   [junit4]   2> 1823168 INFO  (qtp19154034-26158) [    ] o.a.s.u.p.LogUp

[...truncated too long message...]

odes]
   [junit4]   2> 1830115 INFO  (TEST-TestSQLHandler.doTest-seed#[7D76B8CCEE1A22AE]) [    ] o.e.j.s.AbstractConnector Stopped ServerConnector@1d52539{HTTP/1.1,[http/1.1]}{127.0.0.1:0}
   [junit4]   2> 1830115 INFO  (TEST-TestSQLHandler.doTest-seed#[7D76B8CCEE1A22AE]) [    ] o.e.j.s.h.ContextHandler Stopped o.e.j.s.ServletContextHandler@1bc2f64{/e/i,null,UNAVAILABLE}
   [junit4]   2> 1830115 ERROR (TEST-TestSQLHandler.doTest-seed#[7D76B8CCEE1A22AE]) [    ] o.a.z.s.ZooKeeperServer ZKShutdownHandler is not registered, so ZooKeeper server won't take any action on ERROR or SHUTDOWN server state changes
   [junit4]   2> 1830116 INFO  (TEST-TestSQLHandler.doTest-seed#[7D76B8CCEE1A22AE]) [    ] o.a.s.c.ZkTestServer connecting to 127.0.0.1:45519 45519
   [junit4]   2> 1830152 INFO  (Thread-4567) [    ] o.a.s.c.ZkTestServer connecting to 127.0.0.1:45519 45519
   [junit4]   2> 1830152 WARN  (Thread-4567) [    ] o.a.s.c.ZkTestServer Watch limit violations: 
   [junit4]   2> Maximum concurrent create/delete watches above limit:
   [junit4]   2> 
   [junit4]   2> 	17	/solr/aliases.json
   [junit4]   2> 	5	/solr/security.json
   [junit4]   2> 	5	/solr/configs/conf1
   [junit4]   2> 	4	/solr/collections/collection1/state.json
   [junit4]   2> 
   [junit4]   2> Maximum concurrent data watches above limit:
   [junit4]   2> 
   [junit4]   2> 	17	/solr/clusterstate.json
   [junit4]   2> 	17	/solr/clusterprops.json
   [junit4]   2> 
   [junit4]   2> Maximum concurrent children watches above limit:
   [junit4]   2> 
   [junit4]   2> 	17	/solr/live_nodes
   [junit4]   2> 	17	/solr/collections
   [junit4]   2> 	3	/solr/overseer/queue
   [junit4]   2> 	3	/solr/overseer/collection-queue-work
   [junit4]   2> 
   [junit4]   2> NOTE: reproduce with: ant test  -Dtestcase=TestSQLHandler -Dtests.method=doTest -Dtests.seed=7D76B8CCEE1A22AE -Dtests.multiplier=3 -Dtests.slow=true -Dtests.locale=so -Dtests.timezone=CNT -Dtests.asserts=true -Dtests.file.encoding=UTF-8
   [junit4] FAILURE 17.6s J0 | TestSQLHandler.doTest <<<
   [junit4]    > Throwable #1: java.lang.AssertionError
   [junit4]    > 	at __randomizedtesting.SeedInfo.seed([7D76B8CCEE1A22AE:DA32006883A13117]:0)
   [junit4]    > 	at org.apache.solr.handler.TestSQLHandler.testBasicSelect(TestSQLHandler.java:186)
   [junit4]    > 	at org.apache.solr.handler.TestSQLHandler.doTest(TestSQLHandler.java:87)
   [junit4]    > 	at java.base/jdk.internal.reflect.NativeMethodAccessorImpl.invoke0(Native Method)
   [junit4]    > 	at java.base/jdk.internal.reflect.NativeMethodAccessorImpl.invoke(NativeMethodAccessorImpl.java:62)
   [junit4]    > 	at java.base/jdk.internal.reflect.DelegatingMethodAccessorImpl.invoke(DelegatingMethodAccessorImpl.java:43)
   [junit4]    > 	at java.base/java.lang.reflect.Method.invoke(Method.java:564)
   [junit4]    > 	at org.apache.solr.BaseDistributedSearchTestCase$ShardsRepeatRule$ShardsFixedStatement.callStatement(BaseDistributedSearchTestCase.java:985)
   [junit4]    > 	at org.apache.solr.BaseDistributedSearchTestCase$ShardsRepeatRule$ShardsStatement.evaluate(BaseDistributedSearchTestCase.java:960)
   [junit4]    > 	at java.base/java.lang.Thread.run(Thread.java:844)
   [junit4]   2> NOTE: leaving temporary files on disk at: /home/jenkins/workspace/Lucene-Solr-master-Linux/solr/build/solr-core/test/J0/temp/solr.handler.TestSQLHandler_7D76B8CCEE1A22AE-001
   [junit4]   2> NOTE: test params are: codec=Asserting(Lucene70): {_version_=PostingsFormat(name=Memory), multiDefault=TestBloomFilteredLucenePostings(BloomFilteringPostingsFormat(Lucene50(blocksize=128))), intDefault=PostingsFormat(name=Memory), id=BlockTreeOrds(blocksize=128), text=PostingsFormat(name=LuceneVarGapDocFreqInterval), field_i=TestBloomFilteredLucenePostings(BloomFilteringPostingsFormat(Lucene50(blocksize=128))), str_s=PostingsFormat(name=LuceneVarGapDocFreqInterval), timestamp=TestBloomFilteredLucenePostings(BloomFilteringPostingsFormat(Lucene50(blocksize=128)))}, docValues:{_version_=DocValuesFormat(name=Direct), multiDefault=DocValuesFormat(name=Lucene70), intDefault=DocValuesFormat(name=Direct), id=DocValuesFormat(name=Lucene70), field_i=DocValuesFormat(name=Lucene70), str_s=DocValuesFormat(name=Asserting)}, maxPointsInLeafNode=575, maxMBSortInHeap=6.6293426220079334, sim=RandomSimilarity(queryNorm=true): {}, locale=so, timezone=CNT
   [junit4]   2> NOTE: Linux 4.10.0-26-generic i386/Oracle Corporation 9 (32-bit)/cpus=8,threads=1,free=99858624,total=365662208
   [junit4]   2> NOTE: All tests run in this JVM: [TestManagedSchemaAPI, TestMinMaxOnMultiValuedField, TestEmbeddedSolrServerConstructors, TestCustomStream, HighlighterConfigTest, TestBulkSchemaAPI, TestSolrQueryParser, SyncSliceTest, BlockJoinFacetSimpleTest, TestAnalyzeInfixSuggestions, TestDistributedSearch, TestCollapseQParserPlugin, TestLeaderElectionWithEmptyReplica, ConfigureRecoveryStrategyTest, TestConfig, ReplicationFactorTest, TestBackupRepositoryFactory, TestAuthenticationFramework, TestReplicationHandlerBackup, TestJsonRequest, TestLuceneMatchVersion, TestCrossCoreJoin, MigrateRouteKeyTest, OverseerCollectionConfigSetProcessorTest, PluginInfoTest, SharedFSAutoReplicaFailoverTest, TestCSVLoader, TestRealTimeGet, TestCollationFieldDocValues, HdfsLockFactoryTest, MBeansHandlerTest, DistributedFacetPivotLongTailTest, TestSimpleQParserPlugin, TestRuleBasedAuthorizationPlugin, TestBinaryField, ExitableDirectoryReaderTest, TestMaxTokenLenTokenizer, TestSchemaNameResource, VersionInfoTest, TestRawTransformer, MoveReplicaHDFSUlogDirTest, CloudExitableDirectoryReaderTest, OpenExchangeRatesOrgProviderTest, TestConfigSetProperties, TestDistribIDF, TestIBSimilarityFactory, DebugComponentTest, TestImpersonationWithHadoopAuth, TestTolerantUpdateProcessorRandomCloud, RAMDirectoryFactoryTest, CreateCollectionCleanupTest, TestMultiWordSynonyms, TestJavabinTupleStreamParser, TestXmlQParserPlugin, IndexBasedSpellCheckerTest, TestLMDirichletSimilarityFactory, CdcrBootstrapTest, DistributedFacetPivotWhiteBoxTest, ChaosMonkeySafeLeaderWithPullReplicasTest, TestUseDocValuesAsStored2, WrapperMergePolicyFactoryTest, SpellCheckCollatorTest, EchoParamsTest, TestStressLiveNodes, TestNumericTerms32, ResponseHeaderTest, HLLSerializationTest, TestPerFieldSimilarityWithDefaultOverride, TestRandomFaceting, TestCloudManagedSchema, TestSolrConfigHandlerConcurrent, DistributedQueryElevationComponentTest, BasicZkTest, RecoveryAfterSoftCommitTest, SpellingQueryConverterTest, HdfsSyncSliceTest, DistribDocExpirationUpdateProcessorTest, TestConfigSetsAPI, TestWriterPerf, AtomicUpdatesTest, TestPhraseSuggestions, TestCryptoKeys, NodeMutatorTest, OverseerStatusTest, BJQParserTest, TestDocumentBuilder, TestLegacyFieldReuse, CollectionTooManyReplicasTest, TestCloudJSONFacetJoinDomain, TestStressLucene, TestSolrCLIRunExample, DeleteShardTest, DistributedVersionInfoTest, DistributedExpandComponentTest, BadCopyFieldTest, DistributedSuggestComponentTest, TestFieldResource, V2StandaloneTest, PropertiesRequestHandlerTest, TestFaceting, TestLRUStatsCache, UUIDFieldTest, SolrMetricReporterTest, TestQuerySenderNoQuery, TestJoin, TestComponentsName, TestSizeLimitedDistributedMap, TestFieldCacheReopen, SolrCLIZkUtilsTest, BlobRepositoryCloudTest, TestMultiValuedNumericRangeQuery, LeaderElectionIntegrationTest, TestExpandComponent, TestInfoStreamLogging, TestMacroExpander, TestRandomFlRTGCloud, BlockDirectoryTest, TestMergePolicyConfig, OpenCloseCoreStressTest, OverseerTest, TestReplicationHandler, ZkCLITest, AutoCommitTest, TermVectorComponentDistributedTest, HardAutoCommitTest, TestRangeQuery, ShowFileRequestHandlerTest, SolrIndexSplitterTest, SimplePostToolTest, AnalysisAfterCoreReloadTest, TestExtendedDismaxParser, SuggesterFSTTest, SolrRequestParserTest, SuggesterTest, TestTrie, SuggesterWFSTTest, WordBreakSolrSpellCheckerTest, SchemaVersionSpecificBehaviorTest, SolrCoreCheckLockOnStartupTest, TestPseudoReturnFields, TestUpdate, FieldMutatingUpdateProcessorTest, TestAtomicUpdateErrorCases, TestWordDelimiterFilterFactory, QueryEqualityTest, DefaultValueUpdateProcessorTest, StatelessScriptUpdateProcessorFactoryTest, TestRemoteStreaming, DistanceFunctionTest, TestSolrDeletionPolicy1, SolrInfoBeanTest, LukeRequestHandlerTest, DocumentAnalysisRequestHandlerTest, TestQueryTypes, TestOmitPositions, TermsComponentTest, XmlUpdateRequestHandlerTest, RequestHandlersTest, TestValueSourceCache, PathHierarchyTokenizerFactoryTest, TestIndexingPerformance, MoreLikeThisHandlerTest, FieldAnalysisRequestHandlerTest, FastVectorHighlighterTest, IndexSchemaRuntimeFieldTest, LoggingHandlerTest, SolrPluginUtilsTest, IndexSchemaTest, TestCollationField, UpdateRequestProcessorFactoryTest, TestCSVResponseWriter, QueryParsingTest, UniqFieldsUpdateProcessorFactoryTest, JsonLoaderTest, TestPartialUpdateDeduplication, PingRequestHandlerTest, SOLR749Test, TestSolrIndexConfig, ResponseLogComponentTest, TestStressRecovery, PreAnalyzedFieldTest, PrimUtilsTest, DOMUtilTest, ZkNodePropsTest, FileUtilsTest, TestRTGBase, CursorPagingTest, SolrTestCaseJ4Test, TestCursorMarkWithoutUniqueKey, TestDistributedMissingSort, TestHighlightDedupGrouping, TestJettySolrRunner, ConnectionReuseTest, AliasIntegrationTest, CleanupOldIndexTest, ConcurrentDeleteAndCreateCollectionTest, ConnectionManagerTest, DeleteLastCustomShardedReplicaTest, DeleteNodeTest, DistribCursorPagingTest, HttpPartitionTest, OutOfBoxZkACLAndCredentialsProvidersTest, PeerSyncReplicationTest, ReplaceNodeTest, SSLMigrationTest, SharedFSAutoReplicaFailoverUtilsTest, TestCloudInspectUtil, TestCloudPseudoReturnFields, TestCloudRecovery, TestLockTree, TestMiniSolrCloudCluster, TestRebalanceLeaders, TestReplicaProperties, TestSolrCloudWithSecureImpersonation, TestStressCloudBlindAtomicUpdates, VMParamsZkACLAndCredentialsProvidersTest, AutoScalingHandlerTest, TestPolicyCloud, HdfsThreadLeakTest, QueryResultKeyTest, TestDynamicLoading, TestSQLHandler]
   [junit4] Completed [596/728 (1!)] on J0 in 17.57s, 1 test, 1 failure <<< FAILURES!

[...truncated 36921 lines...]

Mime
View raw message