lucene-dev mailing list archives

Site index · List index
Message view « Date » · « Thread »
Top « Date » · « Thread »
From Policeman Jenkins Server <jenk...@thetaphi.de>
Subject [JENKINS-EA] Lucene-Solr-master-Windows (64bit/jdk-9-ea+173) - Build # 6700 - Still Unstable!
Date Mon, 03 Jul 2017 04:18:15 GMT
Build: https://jenkins.thetaphi.de/job/Lucene-Solr-master-Windows/6700/
Java: 64bit/jdk-9-ea+173 -XX:+UseCompressedOops -XX:+UseConcMarkSweepGC

5 tests failed.
FAILED:  junit.framework.TestSuite.org.apache.solr.ltr.TestLTRScoringQuery

Error Message:
The test or suite printed 9310 bytes to stdout and stderr, even though the limit was set to 8192 bytes. Increase the limit with @Limit, ignore it completely with @SuppressSysoutChecks or run with -Dtests.verbose=true

Stack Trace:
java.lang.AssertionError: The test or suite printed 9310 bytes to stdout and stderr, even though the limit was set to 8192 bytes. Increase the limit with @Limit, ignore it completely with @SuppressSysoutChecks or run with -Dtests.verbose=true
	at __randomizedtesting.SeedInfo.seed([468401C541EBFAB1]:0)
	at org.apache.lucene.util.TestRuleLimitSysouts.afterIfSuccessful(TestRuleLimitSysouts.java:211)
	at com.carrotsearch.randomizedtesting.rules.TestRuleAdapter$1.afterIfSuccessful(TestRuleAdapter.java:36)
	at com.carrotsearch.randomizedtesting.rules.StatementAdapter.evaluate(StatementAdapter.java:37)
	at org.apache.lucene.util.TestRuleAssertionsRequired$1.evaluate(TestRuleAssertionsRequired.java:53)
	at org.apache.lucene.util.TestRuleMarkFailure$1.evaluate(TestRuleMarkFailure.java:47)
	at org.apache.lucene.util.TestRuleIgnoreAfterMaxFailures$1.evaluate(TestRuleIgnoreAfterMaxFailures.java:64)
	at org.apache.lucene.util.TestRuleIgnoreTestSuites$1.evaluate(TestRuleIgnoreTestSuites.java:54)
	at com.carrotsearch.randomizedtesting.rules.StatementAdapter.evaluate(StatementAdapter.java:36)
	at com.carrotsearch.randomizedtesting.ThreadLeakControl$StatementRunner.run(ThreadLeakControl.java:368)
	at java.base/java.lang.Thread.run(Thread.java:844)


FAILED:  org.apache.solr.cloud.MissingSegmentRecoveryTest.testLeaderRecovery

Error Message:
Expected a collection with one shard and two replicas null Live Nodes: [127.0.0.1:59560_solr, 127.0.0.1:59559_solr] Last available state: DocCollection(MissingSegmentRecoveryTest//collections/MissingSegmentRecoveryTest/state.json/7)={   "pullReplicas":"0",   "replicationFactor":"2",   "shards":{"shard1":{       "range":"80000000-7fffffff",       "state":"active",       "replicas":{         "core_node1":{           "core":"MissingSegmentRecoveryTest_shard1_replica_n1",           "base_url":"https://127.0.0.1:59559/solr",           "node_name":"127.0.0.1:59559_solr",           "state":"down",           "type":"NRT"},         "core_node2":{           "core":"MissingSegmentRecoveryTest_shard1_replica_n2",           "base_url":"https://127.0.0.1:59560/solr",           "node_name":"127.0.0.1:59560_solr",           "state":"active",           "type":"NRT",           "leader":"true"}}}},   "router":{"name":"compositeId"},   "maxShardsPerNode":"1",   "autoAddReplicas":"false",   "nrtReplicas":"2",   "tlogReplicas":"0"}

Stack Trace:
java.lang.AssertionError: Expected a collection with one shard and two replicas
null
Live Nodes: [127.0.0.1:59560_solr, 127.0.0.1:59559_solr]
Last available state: DocCollection(MissingSegmentRecoveryTest//collections/MissingSegmentRecoveryTest/state.json/7)={
  "pullReplicas":"0",
  "replicationFactor":"2",
  "shards":{"shard1":{
      "range":"80000000-7fffffff",
      "state":"active",
      "replicas":{
        "core_node1":{
          "core":"MissingSegmentRecoveryTest_shard1_replica_n1",
          "base_url":"https://127.0.0.1:59559/solr",
          "node_name":"127.0.0.1:59559_solr",
          "state":"down",
          "type":"NRT"},
        "core_node2":{
          "core":"MissingSegmentRecoveryTest_shard1_replica_n2",
          "base_url":"https://127.0.0.1:59560/solr",
          "node_name":"127.0.0.1:59560_solr",
          "state":"active",
          "type":"NRT",
          "leader":"true"}}}},
  "router":{"name":"compositeId"},
  "maxShardsPerNode":"1",
  "autoAddReplicas":"false",
  "nrtReplicas":"2",
  "tlogReplicas":"0"}
	at __randomizedtesting.SeedInfo.seed([60DA4A257FA4DE38:308FD22626856825]:0)
	at org.junit.Assert.fail(Assert.java:93)
	at org.apache.solr.cloud.SolrCloudTestCase.waitForState(SolrCloudTestCase.java:269)
	at org.apache.solr.cloud.MissingSegmentRecoveryTest.testLeaderRecovery(MissingSegmentRecoveryTest.java:105)
	at java.base/jdk.internal.reflect.NativeMethodAccessorImpl.invoke0(Native Method)
	at java.base/jdk.internal.reflect.NativeMethodAccessorImpl.invoke(NativeMethodAccessorImpl.java:62)
	at java.base/jdk.internal.reflect.DelegatingMethodAccessorImpl.invoke(DelegatingMethodAccessorImpl.java:43)
	at java.base/java.lang.reflect.Method.invoke(Method.java:564)
	at com.carrotsearch.randomizedtesting.RandomizedRunner.invoke(RandomizedRunner.java:1713)
	at com.carrotsearch.randomizedtesting.RandomizedRunner$8.evaluate(RandomizedRunner.java:907)
	at com.carrotsearch.randomizedtesting.RandomizedRunner$9.evaluate(RandomizedRunner.java:943)
	at com.carrotsearch.randomizedtesting.RandomizedRunner$10.evaluate(RandomizedRunner.java:957)
	at com.carrotsearch.randomizedtesting.rules.SystemPropertiesRestoreRule$1.evaluate(SystemPropertiesRestoreRule.java:57)
	at org.apache.lucene.util.TestRuleSetupTeardownChained$1.evaluate(TestRuleSetupTeardownChained.java:49)
	at org.apache.lucene.util.AbstractBeforeAfterRule$1.evaluate(AbstractBeforeAfterRule.java:45)
	at org.apache.lucene.util.TestRuleThreadAndTestName$1.evaluate(TestRuleThreadAndTestName.java:48)
	at org.apache.lucene.util.TestRuleIgnoreAfterMaxFailures$1.evaluate(TestRuleIgnoreAfterMaxFailures.java:64)
	at org.apache.lucene.util.TestRuleMarkFailure$1.evaluate(TestRuleMarkFailure.java:47)
	at com.carrotsearch.randomizedtesting.rules.StatementAdapter.evaluate(StatementAdapter.java:36)
	at com.carrotsearch.randomizedtesting.ThreadLeakControl$StatementRunner.run(ThreadLeakControl.java:368)
	at com.carrotsearch.randomizedtesting.ThreadLeakControl.forkTimeoutingTask(ThreadLeakControl.java:817)
	at com.carrotsearch.randomizedtesting.ThreadLeakControl$3.evaluate(ThreadLeakControl.java:468)
	at com.carrotsearch.randomizedtesting.RandomizedRunner.runSingleTest(RandomizedRunner.java:916)
	at com.carrotsearch.randomizedtesting.RandomizedRunner$5.evaluate(RandomizedRunner.java:802)
	at com.carrotsearch.randomizedtesting.RandomizedRunner$6.evaluate(RandomizedRunner.java:852)
	at com.carrotsearch.randomizedtesting.RandomizedRunner$7.evaluate(RandomizedRunner.java:863)
	at com.carrotsearch.randomizedtesting.rules.StatementAdapter.evaluate(StatementAdapter.java:36)
	at com.carrotsearch.randomizedtesting.rules.SystemPropertiesRestoreRule$1.evaluate(SystemPropertiesRestoreRule.java:57)
	at org.apache.lucene.util.AbstractBeforeAfterRule$1.evaluate(AbstractBeforeAfterRule.java:45)
	at com.carrotsearch.randomizedtesting.rules.StatementAdapter.evaluate(StatementAdapter.java:36)
	at org.apache.lucene.util.TestRuleStoreClassName$1.evaluate(TestRuleStoreClassName.java:41)
	at com.carrotsearch.randomizedtesting.rules.NoShadowingOrOverridesOnMethodsRule$1.evaluate(NoShadowingOrOverridesOnMethodsRule.java:40)
	at com.carrotsearch.randomizedtesting.rules.NoShadowingOrOverridesOnMethodsRule$1.evaluate(NoShadowingOrOverridesOnMethodsRule.java:40)
	at com.carrotsearch.randomizedtesting.rules.StatementAdapter.evaluate(StatementAdapter.java:36)
	at com.carrotsearch.randomizedtesting.rules.StatementAdapter.evaluate(StatementAdapter.java:36)
	at org.apache.lucene.util.TestRuleAssertionsRequired$1.evaluate(TestRuleAssertionsRequired.java:53)
	at org.apache.lucene.util.TestRuleMarkFailure$1.evaluate(TestRuleMarkFailure.java:47)
	at org.apache.lucene.util.TestRuleIgnoreAfterMaxFailures$1.evaluate(TestRuleIgnoreAfterMaxFailures.java:64)
	at org.apache.lucene.util.TestRuleIgnoreTestSuites$1.evaluate(TestRuleIgnoreTestSuites.java:54)
	at com.carrotsearch.randomizedtesting.rules.StatementAdapter.evaluate(StatementAdapter.java:36)
	at com.carrotsearch.randomizedtesting.ThreadLeakControl$StatementRunner.run(ThreadLeakControl.java:368)
	at java.base/java.lang.Thread.run(Thread.java:844)


FAILED:  org.apache.solr.handler.admin.MetricsHandlerTest.testPropertyFilter

Error Message:


Stack Trace:
java.lang.AssertionError
	at __randomizedtesting.SeedInfo.seed([60DA4A257FA4DE38:2B7B464B02ABE06]:0)
	at org.junit.Assert.fail(Assert.java:92)
	at org.junit.Assert.assertTrue(Assert.java:43)
	at org.junit.Assert.assertNotNull(Assert.java:526)
	at org.junit.Assert.assertNotNull(Assert.java:537)
	at org.apache.solr.handler.admin.MetricsHandlerTest.testPropertyFilter(MetricsHandlerTest.java:201)
	at java.base/jdk.internal.reflect.NativeMethodAccessorImpl.invoke0(Native Method)
	at java.base/jdk.internal.reflect.NativeMethodAccessorImpl.invoke(NativeMethodAccessorImpl.java:62)
	at java.base/jdk.internal.reflect.DelegatingMethodAccessorImpl.invoke(DelegatingMethodAccessorImpl.java:43)
	at java.base/java.lang.reflect.Method.invoke(Method.java:564)
	at com.carrotsearch.randomizedtesting.RandomizedRunner.invoke(RandomizedRunner.java:1713)
	at com.carrotsearch.randomizedtesting.RandomizedRunner$8.evaluate(RandomizedRunner.java:907)
	at com.carrotsearch.randomizedtesting.RandomizedRunner$9.evaluate(RandomizedRunner.java:943)
	at com.carrotsearch.randomizedtesting.RandomizedRunner$10.evaluate(RandomizedRunner.java:957)
	at com.carrotsearch.randomizedtesting.rules.SystemPropertiesRestoreRule$1.evaluate(SystemPropertiesRestoreRule.java:57)
	at org.apache.lucene.util.TestRuleSetupTeardownChained$1.evaluate(TestRuleSetupTeardownChained.java:49)
	at org.apache.lucene.util.AbstractBeforeAfterRule$1.evaluate(AbstractBeforeAfterRule.java:45)
	at org.apache.lucene.util.TestRuleThreadAndTestName$1.evaluate(TestRuleThreadAndTestName.java:48)
	at org.apache.lucene.util.TestRuleIgnoreAfterMaxFailures$1.evaluate(TestRuleIgnoreAfterMaxFailures.java:64)
	at org.apache.lucene.util.TestRuleMarkFailure$1.evaluate(TestRuleMarkFailure.java:47)
	at com.carrotsearch.randomizedtesting.rules.StatementAdapter.evaluate(StatementAdapter.java:36)
	at com.carrotsearch.randomizedtesting.ThreadLeakControl$StatementRunner.run(ThreadLeakControl.java:368)
	at com.carrotsearch.randomizedtesting.ThreadLeakControl.forkTimeoutingTask(ThreadLeakControl.java:817)
	at com.carrotsearch.randomizedtesting.ThreadLeakControl$3.evaluate(ThreadLeakControl.java:468)
	at com.carrotsearch.randomizedtesting.RandomizedRunner.runSingleTest(RandomizedRunner.java:916)
	at com.carrotsearch.randomizedtesting.RandomizedRunner$5.evaluate(RandomizedRunner.java:802)
	at com.carrotsearch.randomizedtesting.RandomizedRunner$6.evaluate(RandomizedRunner.java:852)
	at com.carrotsearch.randomizedtesting.RandomizedRunner$7.evaluate(RandomizedRunner.java:863)
	at com.carrotsearch.randomizedtesting.rules.StatementAdapter.evaluate(StatementAdapter.java:36)
	at com.carrotsearch.randomizedtesting.rules.SystemPropertiesRestoreRule$1.evaluate(SystemPropertiesRestoreRule.java:57)
	at org.apache.lucene.util.AbstractBeforeAfterRule$1.evaluate(AbstractBeforeAfterRule.java:45)
	at com.carrotsearch.randomizedtesting.rules.StatementAdapter.evaluate(StatementAdapter.java:36)
	at org.apache.lucene.util.TestRuleStoreClassName$1.evaluate(TestRuleStoreClassName.java:41)
	at com.carrotsearch.randomizedtesting.rules.NoShadowingOrOverridesOnMethodsRule$1.evaluate(NoShadowingOrOverridesOnMethodsRule.java:40)
	at com.carrotsearch.randomizedtesting.rules.NoShadowingOrOverridesOnMethodsRule$1.evaluate(NoShadowingOrOverridesOnMethodsRule.java:40)
	at com.carrotsearch.randomizedtesting.rules.StatementAdapter.evaluate(StatementAdapter.java:36)
	at com.carrotsearch.randomizedtesting.rules.StatementAdapter.evaluate(StatementAdapter.java:36)
	at org.apache.lucene.util.TestRuleAssertionsRequired$1.evaluate(TestRuleAssertionsRequired.java:53)
	at org.apache.lucene.util.TestRuleMarkFailure$1.evaluate(TestRuleMarkFailure.java:47)
	at org.apache.lucene.util.TestRuleIgnoreAfterMaxFailures$1.evaluate(TestRuleIgnoreAfterMaxFailures.java:64)
	at org.apache.lucene.util.TestRuleIgnoreTestSuites$1.evaluate(TestRuleIgnoreTestSuites.java:54)
	at com.carrotsearch.randomizedtesting.rules.StatementAdapter.evaluate(StatementAdapter.java:36)
	at com.carrotsearch.randomizedtesting.ThreadLeakControl$StatementRunner.run(ThreadLeakControl.java:368)
	at java.base/java.lang.Thread.run(Thread.java:844)


FAILED:  org.apache.solr.handler.component.InfixSuggestersTest.testReloadDuringBuild

Error Message:
junit.framework.AssertionFailedError: Expected outer exception RuntimeException

Stack Trace:
java.util.concurrent.ExecutionException: junit.framework.AssertionFailedError: Expected outer exception RuntimeException
	at __randomizedtesting.SeedInfo.seed([60DA4A257FA4DE38:896262536A8D5339]:0)
	at java.base/java.util.concurrent.FutureTask.report(FutureTask.java:122)
	at java.base/java.util.concurrent.FutureTask.get(FutureTask.java:191)
	at org.apache.solr.handler.component.InfixSuggestersTest.testReloadDuringBuild(InfixSuggestersTest.java:109)
	at java.base/jdk.internal.reflect.NativeMethodAccessorImpl.invoke0(Native Method)
	at java.base/jdk.internal.reflect.NativeMethodAccessorImpl.invoke(NativeMethodAccessorImpl.java:62)
	at java.base/jdk.internal.reflect.DelegatingMethodAccessorImpl.invoke(DelegatingMethodAccessorImpl.java:43)
	at java.base/java.lang.reflect.Method.invoke(Method.java:564)
	at com.carrotsearch.randomizedtesting.RandomizedRunner.invoke(RandomizedRunner.java:1713)
	at com.carrotsearch.randomizedtesting.RandomizedRunner$8.evaluate(RandomizedRunner.java:907)
	at com.carrotsearch.randomizedtesting.RandomizedRunner$9.evaluate(RandomizedRunner.java:943)
	at com.carrotsearch.randomizedtesting.RandomizedRunner$10.evaluate(RandomizedRunner.java:957)
	at com.carrotsearch.randomizedtesting.rules.SystemPropertiesRestoreRule$1.evaluate(SystemPropertiesRestoreRule.java:57)
	at org.apache.lucene.util.TestRuleSetupTeardownChained$1.evaluate(TestRuleSetupTeardownChained.java:49)
	at org.apache.lucene.util.AbstractBeforeAfterRule$1.evaluate(AbstractBeforeAfterRule.java:45)
	at org.apache.lucene.util.TestRuleThreadAndTestName$1.evaluate(TestRuleThreadAndTestName.java:48)
	at org.apache.lucene.util.TestRuleIgnoreAfterMaxFailures$1.evaluate(TestRuleIgnoreAfterMaxFailures.java:64)
	at org.apache.lucene.util.TestRuleMarkFailure$1.evaluate(TestRuleMarkFailure.java:47)
	at com.carrotsearch.randomizedtesting.rules.StatementAdapter.evaluate(StatementAdapter.java:36)
	at com.carrotsearch.randomizedtesting.ThreadLeakControl$StatementRunner.run(ThreadLeakControl.java:368)
	at com.carrotsearch.randomizedtesting.ThreadLeakControl.forkTimeoutingTask(ThreadLeakControl.java:817)
	at com.carrotsearch.randomizedtesting.ThreadLeakControl$3.evaluate(ThreadLeakControl.java:468)
	at com.carrotsearch.randomizedtesting.RandomizedRunner.runSingleTest(RandomizedRunner.java:916)
	at com.carrotsearch.randomizedtesting.RandomizedRunner$5.evaluate(RandomizedRunner.java:802)
	at com.carrotsearch.randomizedtesting.RandomizedRunner$6.evaluate(RandomizedRunner.java:852)
	at com.carrotsearch.randomizedtesting.RandomizedRunner$7.evaluate(RandomizedRunner.java:863)
	at com.carrotsearch.randomizedtesting.rules.StatementAdapter.evaluate(StatementAdapter.java:36)
	at com.carrotsearch.randomizedtesting.rules.SystemPropertiesRestoreRule$1.evaluate(SystemPropertiesRestoreRule.java:57)
	at org.apache.lucene.util.AbstractBeforeAfterRule$1.evaluate(AbstractBeforeAfterRule.java:45)
	at com.carrotsearch.randomizedtesting.rules.StatementAdapter.evaluate(StatementAdapter.java:36)
	at org.apache.lucene.util.TestRuleStoreClassName$1.evaluate(TestRuleStoreClassName.java:41)
	at com.carrotsearch.randomizedtesting.rules.NoShadowingOrOverridesOnMethodsRule$1.evaluate(NoShadowingOrOverridesOnMethodsRule.java:40)
	at com.carrotsearch.randomizedtesting.rules.NoShadowingOrOverridesOnMethodsRule$1.evaluate(NoShadowingOrOverridesOnMethodsRule.java:40)
	at com.carrotsearch.randomizedtesting.rules.StatementAdapter.evaluate(StatementAdapter.java:36)
	at com.carrotsearch.randomizedtesting.rules.StatementAdapter.evaluate(StatementAdapter.java:36)
	at org.apache.lucene.util.TestRuleAssertionsRequired$1.evaluate(TestRuleAssertionsRequired.java:53)
	at org.apache.lucene.util.TestRuleMarkFailure$1.evaluate(TestRuleMarkFailure.java:47)
	at org.apache.lucene.util.TestRuleIgnoreAfterMaxFailures$1.evaluate(TestRuleIgnoreAfterMaxFailures.java:64)
	at org.apache.lucene.util.TestRuleIgnoreTestSuites$1.evaluate(TestRuleIgnoreTestSuites.java:54)
	at com.carrotsearch.randomizedtesting.rules.StatementAdapter.evaluate(StatementAdapter.java:36)
	at com.carrotsearch.randomizedtesting.ThreadLeakControl$StatementRunner.run(ThreadLeakControl.java:368)
	at java.base/java.lang.Thread.run(Thread.java:844)
Caused by: junit.framework.AssertionFailedError: Expected outer exception RuntimeException
	at org.apache.lucene.util.LuceneTestCase.expectThrows(LuceneTestCase.java:2700)
	at org.apache.solr.handler.component.InfixSuggestersTest.lambda$testReloadDuringBuild$1(InfixSuggestersTest.java:101)
	at java.base/java.util.concurrent.FutureTask.run(FutureTask.java:264)
	at org.apache.solr.common.util.ExecutorUtil$MDCAwareThreadPoolExecutor.lambda$execute$0(ExecutorUtil.java:188)
	at java.base/java.util.concurrent.ThreadPoolExecutor.runWorker(ThreadPoolExecutor.java:1161)
	at java.base/java.util.concurrent.ThreadPoolExecutor$Worker.run(ThreadPoolExecutor.java:635)
	... 1 more


FAILED:  org.apache.solr.handler.V2ApiIntegrationTest.testCollectionsApi

Error Message:
Error from server at http://127.0.0.1:55295/solr: java.nio.file.InvalidPathException: Illegal char <�> at index 53: C:UsersjenkinsworkspaceLucene-Solr-master-Windowssolr�uildsolr-core estJ1 empsolr.handler.V2ApiIntegrationTest_60DA4A257FA4DE38-001 empDir-002

Stack Trace:
org.apache.solr.client.solrj.impl.HttpSolrClient$RemoteExecutionException: Error from server at http://127.0.0.1:55295/solr: java.nio.file.InvalidPathException: Illegal char <�> at index 53: C:UsersjenkinsworkspaceLucene-Solr-master-Windowssolr�uildsolr-core	estJ1	empsolr.handler.V2ApiIntegrationTest_60DA4A257FA4DE38-001	empDir-002
	at __randomizedtesting.SeedInfo.seed([60DA4A257FA4DE38:BC44ADA4C7BDBA86]:0)
	at org.apache.solr.client.solrj.impl.HttpSolrClient$RemoteExecutionException.create(HttpSolrClient.java:805)
	at org.apache.solr.client.solrj.impl.HttpSolrClient.executeMethod(HttpSolrClient.java:600)
	at org.apache.solr.client.solrj.impl.HttpSolrClient.request(HttpSolrClient.java:250)
	at org.apache.solr.client.solrj.impl.HttpSolrClient.request(HttpSolrClient.java:239)
	at org.apache.solr.client.solrj.impl.LBHttpSolrClient.doRequest(LBHttpSolrClient.java:470)
	at org.apache.solr.client.solrj.impl.LBHttpSolrClient.request(LBHttpSolrClient.java:400)
	at org.apache.solr.client.solrj.impl.CloudSolrClient.sendRequest(CloudSolrClient.java:1102)
	at org.apache.solr.client.solrj.impl.CloudSolrClient.requestWithRetryOnStaleState(CloudSolrClient.java:843)
	at org.apache.solr.client.solrj.impl.CloudSolrClient.request(CloudSolrClient.java:774)
	at org.apache.solr.client.solrj.SolrClient.request(SolrClient.java:1219)
	at org.apache.solr.handler.V2ApiIntegrationTest.testCollectionsApi(V2ApiIntegrationTest.java:141)
	at java.base/jdk.internal.reflect.NativeMethodAccessorImpl.invoke0(Native Method)
	at java.base/jdk.internal.reflect.NativeMethodAccessorImpl.invoke(NativeMethodAccessorImpl.java:62)
	at java.base/jdk.internal.reflect.DelegatingMethodAccessorImpl.invoke(DelegatingMethodAccessorImpl.java:43)
	at java.base/java.lang.reflect.Method.invoke(Method.java:564)
	at com.carrotsearch.randomizedtesting.RandomizedRunner.invoke(RandomizedRunner.java:1713)
	at com.carrotsearch.randomizedtesting.RandomizedRunner$8.evaluate(RandomizedRunner.java:907)
	at com.carrotsearch.randomizedtesting.RandomizedRunner$9.evaluate(RandomizedRunner.java:943)
	at com.carrotsearch.randomizedtesting.RandomizedRunner$10.evaluate(RandomizedRunner.java:957)
	at com.carrotsearch.randomizedtesting.rules.SystemPropertiesRestoreRule$1.evaluate(SystemPropertiesRestoreRule.java:57)
	at org.apache.lucene.util.TestRuleSetupTeardownChained$1.evaluate(TestRuleSetupTeardownChained.java:49)
	at org.apache.lucene.util.AbstractBeforeAfterRule$1.evaluate(AbstractBeforeAfterRule.java:45)
	at org.apache.lucene.util.TestRuleThreadAndTestName$1.evaluate(TestRuleThreadAndTestName.java:48)
	at org.apache.lucene.util.TestRuleIgnoreAfterMaxFailures$1.evaluate(TestRuleIgnoreAfterMaxFailures.java:64)
	at org.apache.lucene.util.TestRuleMarkFailure$1.evaluate(TestRuleMarkFailure.java:47)
	at com.carrotsearch.randomizedtesting.rules.StatementAdapter.evaluate(StatementAdapter.java:36)
	at com.carrotsearch.randomizedtesting.ThreadLeakControl$StatementRunner.run(ThreadLeakControl.java:368)
	at com.carrotsearch.randomizedtesting.ThreadLeakControl.forkTimeoutingTask(ThreadLeakControl.java:817)
	at com.carrotsearch.randomizedtesting.ThreadLeakControl$3.evaluate(ThreadLeakControl.java:468)
	at com.carrotsearch.randomizedtesting.RandomizedRunner.runSingleTest(RandomizedRunner.java:916)
	at com.carrotsearch.randomizedtesting.RandomizedRunner$5.evaluate(RandomizedRunner.java:802)
	at com.carrotsearch.randomizedtesting.RandomizedRunner$6.evaluate(RandomizedRunner.java:852)
	at com.carrotsearch.randomizedtesting.RandomizedRunner$7.evaluate(RandomizedRunner.java:863)
	at com.carrotsearch.randomizedtesting.rules.StatementAdapter.evaluate(StatementAdapter.java:36)
	at com.carrotsearch.randomizedtesting.rules.SystemPropertiesRestoreRule$1.evaluate(SystemPropertiesRestoreRule.java:57)
	at org.apache.lucene.util.AbstractBeforeAfterRule$1.evaluate(AbstractBeforeAfterRule.java:45)
	at com.carrotsearch.randomizedtesting.rules.StatementAdapter.evaluate(StatementAdapter.java:36)
	at org.apache.lucene.util.TestRuleStoreClassName$1.evaluate(TestRuleStoreClassName.java:41)
	at com.carrotsearch.randomizedtesting.rules.NoShadowingOrOverridesOnMethodsRule$1.evaluate(NoShadowingOrOverridesOnMethodsRule.java:40)
	at com.carrotsearch.randomizedtesting.rules.NoShadowingOrOverridesOnMethodsRule$1.evaluate(NoShadowingOrOverridesOnMethodsRule.java:40)
	at com.carrotsearch.randomizedtesting.rules.StatementAdapter.evaluate(StatementAdapter.java:36)
	at com.carrotsearch.randomizedtesting.rules.StatementAdapter.evaluate(StatementAdapter.java:36)
	at org.apache.lucene.util.TestRuleAssertionsRequired$1.evaluate(TestRuleAssertionsRequired.java:53)
	at org.apache.lucene.util.TestRuleMarkFailure$1.evaluate(TestRuleMarkFailure.java:47)
	at org.apache.lucene.util.TestRuleIgnoreAfterMaxFailures$1.evaluate(TestRuleIgnoreAfterMaxFailures.java:64)
	at org.apache.lucene.util.TestRuleIgnoreTestSuites$1.evaluate(TestRuleIgnoreTestSuites.java:54)
	at com.carrotsearch.randomizedtesting.rules.StatementAdapter.evaluate(StatementAdapter.java:36)
	at com.carrotsearch.randomizedtesting.ThreadLeakControl$StatementRunner.run(ThreadLeakControl.java:368)
	at java.base/java.lang.Thread.run(Thread.java:844)




Build Log:
[...truncated 11 lines...]
ERROR: Error fetching remote repo 'origin'
hudson.plugins.git.GitException: Failed to fetch from git://git.apache.org/lucene-solr.git
	at hudson.plugins.git.GitSCM.fetchFrom(GitSCM.java:809)
	at hudson.plugins.git.GitSCM.retrieveChanges(GitSCM.java:1076)
	at hudson.plugins.git.GitSCM.checkout(GitSCM.java:1107)
	at hudson.scm.SCM.checkout(SCM.java:495)
	at hudson.model.AbstractProject.checkout(AbstractProject.java:1212)
	at hudson.model.AbstractBuild$AbstractBuildExecution.defaultCheckout(AbstractBuild.java:560)
	at jenkins.scm.SCMCheckoutStrategy.checkout(SCMCheckoutStrategy.java:86)
	at hudson.model.AbstractBuild$AbstractBuildExecution.run(AbstractBuild.java:485)
	at hudson.model.Run.execute(Run.java:1735)
	at hudson.model.FreeStyleBuild.run(FreeStyleBuild.java:43)
	at hudson.model.ResourceController.execute(ResourceController.java:97)
	at hudson.model.Executor.run(Executor.java:415)
Caused by: hudson.plugins.git.GitException: org.eclipse.jgit.api.errors.TransportException: git://git.apache.org/lucene-solr.git: Connection refused: connect
	at org.jenkinsci.plugins.gitclient.JGitAPIImpl$2.execute(JGitAPIImpl.java:619)
	at org.jenkinsci.plugins.gitclient.RemoteGitImpl$CommandInvocationHandler$1.call(RemoteGitImpl.java:153)
	at org.jenkinsci.plugins.gitclient.RemoteGitImpl$CommandInvocationHandler$1.call(RemoteGitImpl.java:146)
	at hudson.remoting.UserRequest.perform(UserRequest.java:153)
	at hudson.remoting.UserRequest.perform(UserRequest.java:50)
	at hudson.remoting.Request$2.run(Request.java:336)
	at hudson.remoting.InterceptingExecutorService$1.call(InterceptingExecutorService.java:68)
	at java.util.concurrent.FutureTask.run(Unknown Source)
	at java.util.concurrent.ThreadPoolExecutor.runWorker(Unknown Source)
	at java.util.concurrent.ThreadPoolExecutor$Worker.run(Unknown Source)
	at java.lang.Thread.run(Unknown Source)
	at ......remote call to Windows VBOX(Native Method)
	at hudson.remoting.Channel.attachCallSiteStackTrace(Channel.java:1545)
	at hudson.remoting.UserResponse.retrieve(UserRequest.java:253)
	at hudson.remoting.Channel.call(Channel.java:830)
	at org.jenkinsci.plugins.gitclient.RemoteGitImpl$CommandInvocationHandler.execute(RemoteGitImpl.java:146)
	at sun.reflect.GeneratedMethodAccessor678.invoke(Unknown Source)
	at sun.reflect.DelegatingMethodAccessorImpl.invoke(DelegatingMethodAccessorImpl.java:43)
	at java.lang.reflect.Method.invoke(Method.java:498)
	at org.jenkinsci.plugins.gitclient.RemoteGitImpl$CommandInvocationHandler.invoke(RemoteGitImpl.java:132)
	at com.sun.proxy.$Proxy74.execute(Unknown Source)
	at hudson.plugins.git.GitSCM.fetchFrom(GitSCM.java:807)
	... 11 more
Caused by: org.eclipse.jgit.api.errors.TransportException: git://git.apache.org/lucene-solr.git: Connection refused: connect
	at org.eclipse.jgit.api.FetchCommand.call(FetchCommand.java:135)
	at org.jenkinsci.plugins.gitclient.JGitAPIImpl$2.execute(JGitAPIImpl.java:617)
	at org.jenkinsci.plugins.gitclient.RemoteGitImpl$CommandInvocationHandler$1.call(RemoteGitImpl.java:153)
	at org.jenkinsci.plugins.gitclient.RemoteGitImpl$CommandInvocationHandler$1.call(RemoteGitImpl.java:146)
	at hudson.remoting.UserRequest.perform(UserRequest.java:153)
	at hudson.remoting.UserRequest.perform(UserRequest.java:50)
	at hudson.remoting.Request$2.run(Request.java:336)
	at hudson.remoting.InterceptingExecutorService$1.call(InterceptingExecutorService.java:68)
	at java.util.concurrent.FutureTask.run(Unknown Source)
	at java.util.concurrent.ThreadPoolExecutor.runWorker(Unknown Source)
	at java.util.concurrent.ThreadPoolExecutor$Worker.run(Unknown Source)
	at java.lang.Thread.run(Unknown Source)
Caused by: org.eclipse.jgit.errors.TransportException: git://git.apache.org/lucene-solr.git: Connection refused: connect
	at org.eclipse.jgit.transport.TransportGitAnon.openConnection(TransportGitAnon.java:150)
	at org.eclipse.jgit.transport.TransportGitAnon$TcpFetchConnection.<init>(TransportGitAnon.java:179)
	at org.eclipse.jgit.transport.TransportGitAnon.openFetch(TransportGitAnon.java:120)
	at org.eclipse.jgit.transport.FetchProcess.executeImp(FetchProcess.java:136)
	at org.eclipse.jgit.transport.FetchProcess.execute(FetchProcess.java:122)
	at org.eclipse.jgit.transport.Transport.fetch(Transport.java:1201)
	at org.eclipse.jgit.api.FetchCommand.call(FetchCommand.java:128)
	... 11 more
ERROR: null
Retrying after 10 seconds
Fetching changes from the remote Git repository
Cleaning workspace
Checking out Revision eaf1d45a1cad74a1037c7c4178fd2379a903f8cc (refs/remotes/origin/master)
No emails were triggered.
[description-setter] Description set: Java: 64bit/jdk-9-ea+173 -XX:+UseCompressedOops -XX:+UseConcMarkSweepGC
[Lucene-Solr-master-Windows] $ cmd.exe /C "C:\Users\jenkins\tools\hudson.tasks.Ant_AntInstallation\ANT_1.8.2\bin\ant.bat '"-Dargs=-XX:+UseCompressedOops -XX:+UseConcMarkSweepGC"' jenkins-hourly && exit %%ERRORLEVEL%%"
Buildfile: C:\Users\jenkins\workspace\Lucene-Solr-master-Windows\build.xml

jenkins-hourly:

-print-java-info:
[java-info] java version "9-ea"
[java-info] Java(TM) SE Runtime Environment (9-ea+173, Oracle Corporation)
[java-info] Java HotSpot(TM) 64-Bit Server VM (9-ea+173, Oracle Corporation)
[java-info] Test args: [-XX:+UseCompressedOops -XX:+UseConcMarkSweepGC]

clean:

clean:

clean:

ivy-availability-check:

ivy-fail:

ivy-configure:
[ivy:configure] :: Apache Ivy 2.3.0 - 20130110142753 :: http://ant.apache.org/ivy/ ::
[ivy:configure] :: loading settings :: file = C:\Users\jenkins\workspace\Lucene-Solr-master-Windows\lucene\top-level-ivy-settings.xml

resolve-groovy:
[ivy:cachepath] :: resolving dependencies :: org.codehaus.groovy#groovy-all-caller;working
[ivy:cachepath] 	confs: [default]
[ivy:cachepath] 	found org.codehaus.groovy#groovy-all;2.4.8 in public
[ivy:cachepath] :: resolution report :: resolve 113ms :: artifacts dl 2ms
	---------------------------------------------------------------------
	|                  |            modules            ||   artifacts   |
	|       conf       | number| search|dwnlded|evicted|| number|dwnlded|
	---------------------------------------------------------------------
	|      default     |   1   |   0   |   0   |   0   ||   1   |   0   |
	---------------------------------------------------------------------

-test-with-heapdumps-enabled:
     [echo] Java HotSpot(TM) 64-Bit Server VM: Enabling heap dumps on OutOfMemoryError to dir 'C:\Users\jenkins\workspace\Lucene-Solr-master-Windows\heapdumps'.
    [mkdir] Created dir: C:\Users\jenkins\workspace\Lucene-Solr-master-Windows\heapdumps

ivy-availability-check:

ivy-fail:

ivy-configure:
[ivy:configure] :: loading settings :: file = C:\Users\jenkins\workspace\Lucene-Solr-master-Windows\lucene\top-level-ivy-settings.xml

resolve-groovy:

test:

ivy-availability-check:

ivy-fail:

ivy-configure:
[ivy:configure] :: loading settings :: file = C:\Users\jenkins\workspace\Lucene-Solr-master-Windows\lucene\top-level-ivy-settings.xml

-clover.load:

resolve-groovy:

-init-totals:

test-core:

-clover.disable:

ivy-availability-check:

ivy-fail:

ivy-configure:
[ivy:configure] :: loading settings :: file = C:\Users\jenkins\workspace\Lucene-Solr-master-Windows\lucene\top-level-ivy-settings.xml

-clover.load:

-clover.classpath:

-clover.setup:

clover:

-check-git-state:

-git-cleanroot:

-copy-git-state:
     [copy] Copying 1 file to C:\Users\jenkins\workspace\Lucene-Solr-master-Windows\lucene\build

git-autoclean:

resolve:

init:

compile-core:
    [mkdir] Created dir: C:\Users\jenkins\workspace\Lucene-Solr-master-Windows\lucene\build\core\classes\java
    [javac] Compiling 822 source files to C:\Users\jenkins\workspace\Lucene-Solr-master-Windows\lucene\build\core\classes\java
    [javac] Note: Some input files use or override a deprecated API.
    [javac] Note: Recompile with -Xlint:deprecation for details.
    [javac] Creating empty C:\Users\jenkins\workspace\Lucene-Solr-master-Windows\lucene\build\core\classes\java\org\apache\lucene\util\graph\package-info.class
    [javac] Creating empty C:\Users\jenkins\workspace\Lucene-Solr-master-Windows\lucene\build\core\classes\java\org\apache\lucene\document\package-info.class
    [javac] Creating empty C:\Users\jenkins\workspace\Lucene-Solr-master-Windows\lucene\build\core\classes\java\org\apache\lucene\package-info.class
    [javac] Creating empty C:\Users\jenkins\workspace\Lucene-Solr-master-Windows\lucene\build\core\classes\java\org\apache\lucene\util\bkd\package-info.class
    [javac] Creating empty C:\Users\jenkins\workspace\Lucene-Solr-master-Windows\lucene\build\core\classes\java\org\apache\lucene\codecs\compressing\package-info.class
    [javac] Creating empty C:\Users\jenkins\workspace\Lucene-Solr-master-Windows\lucene\build\core\classes\java\org\apache\lucene\codecs\lucene60\package-info.class
    [javac] Creating empty C:\Users\jenkins\workspace\Lucene-Solr-master-Windows\lucene\build\core\classes\java\org\apache\lucene\codecs\package-info.class
    [javac] Creating empty C:\Users\jenkins\workspace\Lucene-Solr-master-Windows\lucene\build\core\classes\java\org\apache\lucene\util\package-info.class
    [javac] Creating empty C:\Users\jenkins\workspace\Lucene-Solr-master-Windows\lucene\build\core\classes\java\org\apache\lucene\index\package-info.class
    [javac] Creating empty C:\Users\jenkins\workspace\Lucene-Solr-master-Windows\lucene\build\core\classes\java\org\apache\lucene\util\fst\package-info.class
    [javac] Creating empty C:\Users\jenkins\workspace\Lucene-Solr-master-Windows\lucene\build\core\classes\java\org\apache\lucene\analysis\tokenattributes\package-info.class
    [javac] Creating empty C:\Users\jenkins\workspace\Lucene-Solr-master-Windows\lucene\build\core\classes\java\org\apache\lucene\search\package-info.class
    [javac] Creating empty C:\Users\jenkins\workspace\Lucene-Solr-master-Windows\lucene\build\core\classes\java\org\apache\lucene\codecs\lucene62\package-info.class
    [javac] Creating empty C:\Users\jenkins\workspace\Lucene-Solr-master-Windows\lucene\build\core\classes\java\org\apache\lucene\util\packed\package-info.class
    [javac] Creating empty C:\Users\jenkins\workspace\Lucene-Solr-master-Windows\lucene\build\core\classes\java\org\apache\lucene\util\mutable\package-info.class
    [javac] Creating empty C:\Users\jenkins\workspace\Lucene-Solr-master-Windows\lucene\build\core\classes\java\org\apache\lucene\codecs\lucene70\package-info.class
    [javac] Creating empty C:\Users\jenkins\workspace\Lucene-Solr-master-Windows\lucene\build\core\classes\java\org\apache\lucene\codecs\perfield\package-info.class
    [javac] Creating empty C:\Users\jenkins\workspace\Lucene-Solr-master-Windows\lucene\build\core\classes\java\org\apache\lucene\analysis\package-info.class
    [javac] Creating empty C:\Users\jenkins\workspace\Lucene-Solr-master-Windows\lucene\build\core\classes\java\org\apache\lucene\analysis\standard\package-info.class
    [javac] Creating empty C:\Users\jenkins\workspace\Lucene-Solr-master-Windows\lucene\build\core\classes\java\org\apache\lucene\store\package-info.class
    [javac] Creating empty C:\Users\jenkins\workspace\Lucene-Solr-master-Windows\lucene\build\core\classes\java\org\apache\lucene\codecs\blocktree\package-info.class
    [javac] Creating empty C:\Users\jenkins\workspace\Lucene-Solr-master-Windows\lucene\build\core\classes\java\org\apache\lucene\search\spans\package-info.class
    [javac] Creating empty C:\Users\jenkins\workspace\Lucene-Solr-master-Windows\lucene\build\core\classes\java\org\apache\lucene\search\similarities\package-info.class
    [javac] Creating empty C:\Users\jenkins\workspace\Lucene-Solr-master-Windows\lucene\build\core\classes\java\org\apache\lucene\util\automaton\package-info.class
    [javac] Creating empty C:\Users\jenkins\workspace\Lucene-Solr-master-Windows\lucene\build\core\classes\java\org\apache\lucene\codecs\lucene50\package-info.class
    [javac] Creating empty C:\Users\jenkins\workspace\Lucene-Solr-master-Windows\lucene\build\core\classes\java\org\apache\lucene\geo\package-info.class
     [copy] Copying 3 files to C:\Users\jenkins\workspace\Lucene-Solr-master-Windows\lucene\build\core\classes\java

compile-test-framework:

-check-git-state:

-git-cleanroot:

-copy-git-state:

git-autoclean:

ivy-availability-check:

ivy-fail:

ivy-configure:
[ivy:configure] :: loading settings :: file = C:\Users\jenkins\workspace\Lucene-Solr-master-Windows\lucene\top-level-ivy-settings.xml

resolve:

init:

compile-lucene-core:

-check-git-state:

-git-cleanroot:

-copy-git-state:

git-autoclean:

ivy-availability-check:

ivy-fail:

ivy-configure:
[ivy:configure] :: loading settings :: file = C:\Users\jenkins\workspace\Lucene-Solr-master-Windows\lucene\top-level-ivy-settings.xml

resolve:

init:

-clover.disable:

-clover.load:

-clover.classpath:

-clover.setup:

clover:

compile-core:

compile-codecs:

-check-git-state:

-git-cleanroot:

-copy-git-state:

git-autoclean:

ivy-availability-check:

ivy-fail:

ivy-configure:
[ivy:configure] :: loading settings :: file = C:\Users\jenkins\workspace\Lucene-Solr-master-Windows\lucene\top-level-ivy-settings.xml

resolve:

common.init:

compile-lucene-core:

init:

-clover.disable:

-clover.load:

-clover.classpath:

-clover.setup:

clover:

compile-core:
    [mkdir] Created dir: C:\Users\jenkins\workspace\Lucene-Solr-master-Windows\lucene\build\codecs\classes\java
    [javac] Compiling 67 source files to C:\Users\jenkins\workspace\Lucene-Solr-master-Windows\lucene\build\codecs\classes\java
    [javac] Note: Some input files use or override a deprecated API.
    [javac] Note: Recompile with -Xlint:deprecation for details.
    [javac] Creating empty C:\Users\jenkins\workspace\Lucene-Solr-master-Windows\lucene\build\codecs\classes\java\org\apache\lucene\codecs\bloom\package-info.class
    [javac] Creating empty C:\Users\jenkins\workspace\Lucene-Solr-master-Windows\lucene\build\codecs\classes\java\org\apache\lucene\codecs\memory\package-info.class
    [javac] Creating empty C:\Users\jenkins\workspace\Lucene-Solr-master-Windows\lucene\build\codecs\classes\java\org\apache\lucene\codecs\simpletext\package-info.class
    [javac] Creating empty C:\Users\jenkins\workspace\Lucene-Solr-master-Windows\lucene\build\codecs\classes\java\org\apache\lucene\codecs\blockterms\package-info.class
    [javac] Creating empty C:\Users\jenkins\workspace\Lucene-Solr-master-Windows\lucene\build\codecs\classes\java\org\apache\lucene\codecs\blocktreeords\package-info.class
     [copy] Copying 3 files to C:\Users\jenkins\workspace\Lucene-Solr-master-Windows\lucene\build\codecs\classes\java

-clover.disable:

-clover.load:

-clover.classpath:

-clover.setup:

clover:

common.compile-core:
    [mkdir] Created dir: C:\Users\jenkins\workspace\Lucene-Solr-master-Windows\lucene\build\test-framework\classes\java
    [javac] Compiling 188 source files to C:\Users\jenkins\workspace\Lucene-Solr-master-Windows\lucene\build\test-framework\classes\java
    [javac] Note: C:\Users\jenkins\workspace\Lucene-Solr-master-Windows\lucene\test-framework\src\java\org\apache\lucene\store\BaseDirectoryTestCase.java uses or overrides a deprecated API.
    [javac] Note: Recompile with -Xlint:deprecation for details.
    [javac] Creating empty C:\Users\jenkins\workspace\Lucene-Solr-master-Windows\lucene\build\test-framework\classes\java\org\apache\lucene\codecs\asserting\package-info.class
    [javac] Creating empty C:\Users\jenkins\workspace\Lucene-Solr-master-Windows\lucene\build\test-framework\classes\java\org\apache\lucene\codecs\ramonly\package-info.class
    [javac] Creating empty C:\Users\jenkins\workspace\Lucene-Solr-master-Windows\lucene\build\test-framework\classes\java\org\apache\lucene\mockfile\package-info.class
    [javac] Creating empty C:\Users\jenkins\workspace\Lucene-Solr-master-Windows\lucene\build\test-framework\classes\java\org\apache\lucene\codecs\cheapbastard\package-info.class
    [javac] Creating empty C:\Users\jenkins\workspace\Lucene-Solr-master-Windows\lucene\build\test-framework\classes\java\org\apache\lucene\codecs\mockrandom\package-info.class
    [javac] Creating empty C:\Users\jenkins\workspace\Lucene-Solr-master-Windows\lucene\build\test-framework\classes\java\org\apache\lucene\codecs\cranky\package-info.class
    [javac] Creating empty C:\Users\jenkins\workspace\Lucene-Solr-master-Windows\lucene\build\test-framework\classes\java\org\apache\lucene\codecs\compressing\dummy\package-info.class
     [copy] Copying 4 files to C:\Users\jenkins\workspace\Lucene-Solr-master-Windows\lucene\build\test-framework\classes\java

compile-core:

compile-test:
    [mkdir] Created dir: C:\Users\jenkins\workspace\Lucene-Solr-master-Windows\lucene\build\core\classes\test
    [javac] Compiling 461 source files to C:\Users\jenkins\workspace\Lucene-Solr-master-Windows\lucene\build\core\classes\test
    [javac] Note: Some input files use or override a deprecated API.
    [javac] Note: Recompile with -Xlint:deprecation for details.
     [copy] Copying 3 files to C:\Users\jenkins\workspace\Lucene-Solr-master-Windows\lucene\build\core\classes\test

install-junit4-taskdef:

validate:

resolve-groovy:

-init-totals:

-test:
    [mkdir] Created dir: C:\Users\jenkins\workspace\Lucene-Solr-master-Windows\lucene\build\core\test
[loadresource] Do not set property tests.explicitclass as its length is 0.
    [mkdir] Created dir: C:\Users\jenkins\workspace\Lucene-Solr-master-Windows\lucene\build\core\test\temp
    [mkdir] Created dir: C:\Users\jenkins\workspace\Lucene-Solr-master-Windows\.caches\test-stats\core
   [junit4] <JUnit4> says aloha! Master seed: F3BE3E16B0198E7D
   [junit4] Your default console's encoding may not display certain unicode glyphs: windows-1252
   [junit4] Executing 454 suites with 2 JVMs.
   [junit4] 
   [junit4] Started J1 PID(5608@localhost).
   [junit4] Started J0 PID(6860@localhost).
   [junit4] Suite: org.apache.lucene.index.TestFieldReuse
   [junit4] Completed [1/454] on J1 in 0.66s, 2 tests
   [junit4] 
   [junit4] Suite: org.apache.lucene.index.TestThreadedForceMerge
   [junit4] Completed [2/454] on J0 in 1.44s, 1 test
   [junit4] 
   [junit4] Suite: org.apache.lucene.index.TestCodecHoldsOpenFiles
   [junit4] Completed [3/454] on J0 in 0.15s, 1 test
   [junit4] 
   [junit4] Suite: org.apache.lucene.index.TestDocsAndPositions
   [junit4] Completed [4/454] on J0 in 0.46s, 6 tests
   [junit4] 
   [junit4] Suite: org.apache.lucene.index.TestIndexInput
   [junit4] Completed [5/454] on J0 in 0.36s, 2 tests
   [junit4] 
   [junit4] Suite: org.apache.lucene.index.TestParallelLeafReader
   [junit4] Completed [6/454] on J0 in 0.30s, 9 tests
   [junit4] 
   [junit4] Suite: org.apache.lucene.index.TestTerm
   [junit4] Completed [7/454] on J0 in 0.01s, 1 test
   [junit4] 
   [junit4] Suite: org.apache.lucene.index.TestBagOfPositions
   [junit4] Completed [8/454] on J0 in 1.12s, 1 test
   [junit4] 
   [junit4] Suite: org.apache.lucene.util.automaton.TestLevenshteinAutomata
   [junit4] Completed [9/454] on J0 in 1.18s, 4 tests
   [junit4] 
   [junit4] Suite: org.apache.lucene.index.TestIndexWriterMaxDocs
   [junit4] IGNOR/A 0.01s J0 | TestIndexWriterMaxDocs.testExactlyAtTrueLimit
   [junit4]    > Assumption #1: 'monster' test group is disabled (@Monster(value="takes over two hours"))
   [junit4] Completed [10/454] on J0 in 1.70s, 21 tests, 1 skipped
   [junit4] 
   [junit4] Suite: org.apache.lucene.util.TestTimSorterWorstCase
   [junit4] Completed [11/454] on J1 in 6.54s, 1 test
   [junit4] 
   [junit4] Suite: org.apache.lucene.index.Test2BDocs
   [junit4] IGNOR/A 0.00s J1 | Test2BDocs.test2BDocs
   [junit4]    > Assumption #1: 'monster' test group is disabled (@Monster(value="Takes ~30min"))
   [junit4] Completed [12/454] on J1 in 0.01s, 1 test, 1 skipped
   [junit4] 
   [junit4] Suite: org.apache.lucene.analysis.tokenattributes.TestBytesRefAttImpl
   [junit4] Completed [13/454] on J1 in 0.03s, 1 test
   [junit4] 
   [junit4] Suite: org.apache.lucene.search.TestBoolean2ScorerSupplier
   [junit4] Completed [14/454] on J1 in 0.33s, 10 tests
   [junit4] 
   [junit4] Suite: org.apache.lucene.index.Test2BSortedDocValuesFixedSorted
   [junit4] IGNOR/A 0.00s J1 | Test2BSortedDocValuesFixedSorted.testFixedSorted
   [junit4]    > Assumption #1: 'monster' test group is disabled (@Monster(value="Takes ~ 6 hours if the heap is 5gb"))
   [junit4] Completed [15/454] on J1 in 0.01s, 1 test, 1 skipped
   [junit4] 
   [junit4] Suite: org.apache.lucene.search.TestComplexExplanations
   [junit4] Completed [16/454] on J0 in 1.24s, 21 tests
   [junit4] 
   [junit4] Suite: org.apache.lucene.util.TestBytesRefHash
   [junit4] Completed [17/454] on J1 in 0.69s, 8 tests
   [junit4] 
   [junit4] Suite: org.apache.lucene.search.TestBooleanOr
   [junit4] Completed [18/454] on J0 in 1.00s, 7 tests
   [junit4] 
   [junit4] Suite: org.apache.lucene.index.TestIntBlockPool
   [junit4] Completed [19/454] on J0 in 0.15s, 2 tests
   [junit4] 
   [junit4] Suite: org.apache.lucene.index.TestByteSlices
   [junit4] Completed [20/454] on J1 in 0.86s, 1 test
   [junit4] 
   [junit4] Suite: org.apache.lucene.search.spans.TestSpanMultiTermQueryWrapper
   [junit4] Completed [21/454] on J1 in 0.36s, 9 tests
   [junit4] 
   [junit4] Suite: org.apache.lucene.search.TestSortRescorer
   [junit4] Completed [22/454] on J1 in 0.57s, 2 tests
   [junit4] 
   [junit4] Suite: org.apache.lucene.search.TestSimpleSearchEquivalence
   [junit4] Completed [23/454] on J1 in 0.49s, 17 tests
   [junit4] 
   [junit4] Suite: org.apache.lucene.search.TestSimpleExplanationsWithFillerDocs
   [junit4] IGNOR/A 0.01s J0 | TestSimpleExplanationsWithFillerDocs.testMA2
   [junit4]    > Assumption #1: got: <[test is not viable with empty filler docs, null]>, expected: each not null
   [junit4] IGNOR/A 0.00s J0 | TestSimpleExplanationsWithFillerDocs.testMA1
   [junit4]    > Assumption #1: got: <[test is not viable with empty filler docs, null]>, expected: each not null
   [junit4] Completed [24/454] on J0 in 6.56s, 70 tests, 2 skipped
   [junit4] 
   [junit4] Suite: org.apache.lucene.index.TestIndexWriterForceMerge
   [junit4] Completed [25/454] on J1 in 5.78s, 4 tests
   [junit4] 
   [junit4] Suite: org.apache.lucene.index.TestIndexWriterConfig
   [junit4] Completed [26/454] on J1 in 0.06s, 8 tests
   [junit4] 
   [junit4] Suite: org.apache.lucene.util.TestFixedLengthBytesRefArray
   [junit4] Completed [27/454] on J1 in 0.04s, 2 tests
   [junit4] 
   [junit4] Suite: org.apache.lucene.index.TestFlushByRamOrCountsPolicy
   [junit4] Completed [28/454] on J0 in 2.83s, 5 tests
   [junit4] 
   [junit4] Suite: org.apache.lucene.index.TestIndexWriterReader
   [junit4] IGNOR/A 0.00s J1 | TestIndexWriterReader.testDuringAddIndexes
   [junit4]    > Assumption #1: 'nightly' test group is disabled (@Nightly())
   [junit4] Completed [29/454] on J1 in 5.85s, 23 tests, 1 skipped
   [junit4] 
   [junit4] Suite: org.apache.lucene.document.TestDateTools
   [junit4] Completed [30/454] on J1 in 0.03s, 5 tests
   [junit4] 
   [junit4] Suite: org.apache.lucene.index.TestTransactions
   [junit4] Completed [31/454] on J1 in 0.86s, 1 test
   [junit4] 
   [junit4] Suite: org.apache.lucene.codecs.lucene70.TestLucene70NormsFormat
   [junit4] IGNOR/A 0.00s J1 | TestLucene70NormsFormat.testMergeStability
   [junit4]    > Assumption #1: The MockRandom PF randomizes content on the fly, so we can't check it
   [junit4] IGNOR/A 0.00s J1 | TestLucene70NormsFormat.testSparseNCommonBig
   [junit4]    > Assumption #1: 'nightly' test group is disabled (@Nightly())
   [junit4] IGNOR/A 0.00s J1 | TestLucene70NormsFormat.testNCommonBig
   [junit4]    > Assumption #1: 'nightly' test group is disabled (@Nightly())
   [junit4] Completed [32/454] on J1 in 7.40s, 29 tests, 3 skipped
   [junit4] 
   [junit4] Suite: org.apache.lucene.util.TestPagedBytes
   [junit4] Completed [33/454] on J1 in 0.92s, 4 tests, 1 skipped
   [junit4] 
   [junit4] Suite: org.apache.lucene.index.TestIndexSorting
   [junit4] Completed [34/454] on J0 in 13.39s, 50 tests
   [junit4] 
   [junit4] Suite: org.apache.lucene.search.TermInSetQueryTest
   [junit4] Completed [35/454] on J0 in 0.19s, 10 tests
   [junit4] 
   [junit4] Suite: org.apache.lucene.store.TestGrowableByteArrayDataOutput
   [junit4] Completed [36/454] on J1 in 2.00s, 2 tests
   [junit4] 
   [junit4] Suite: org.apache.lucene.store.TestFileSwitchDirectory
   [junit4] IGNOR/A 0.01s J1 | TestFileSwitchDirectory.testPendingDeletions
   [junit4]    > Assumption #1: we can only install VirusCheckingFS on an FSDirectory
   [junit4] IGNOR/A 0.01s J1 | TestFileSwitchDirectory.testFsyncDoesntCreateNewFiles
   [junit4]    > Assumption #1: test only works for FSDirectory subclasses
   [junit4] Completed [37/454] on J1 in 1.65s, 43 tests, 2 skipped
   [junit4] 
   [junit4] Suite: org.apache.lucene.search.TestDisjunctionMaxQuery
   [junit4] Completed [38/454] on J1 in 1.91s, 13 tests
   [junit4] 
   [junit4] Suite: org.apache.lucene.search.spans.TestBasics
   [junit4] Completed [39/454] on J1 in 1.93s, 26 tests
   [junit4] 
   [junit4] Suite: org.apache.lucene.util.TestSparseFixedBitSet
   [junit4] Completed [40/454] on J1 in 0.91s, 11 tests
   [junit4] 
   [junit4] Suite: org.apache.lucene.index.TestPrefixCodedTerms
   [junit4] Completed [41/454] on J1 in 0.04s, 3 tests
   [junit4] 
   [junit4] Suite: org.apache.lucene.util.TestCharsRef
   [junit4] Completed [42/454] on J1 in 0.03s, 5 tests
   [junit4] 
   [junit4] Suite: org.apache.lucene.search.TestPrefixInBooleanQuery
   [junit4] Completed [43/454] on J1 in 0.90s, 4 tests
   [junit4] 
   [junit4] Suite: org.apache.lucene.codecs.lucene50.TestLucene50TermVectorsFormat
   [junit4] Completed [44/454] on J0 in 9.67s, 17 tests
   [junit4] 
   [junit4] Suite: org.apache.lucene.index.TestSameTokenSamePosition
   [junit4] Completed [45/454] on J0 in 0.03s, 2 tests
   [junit4] 
   [junit4] Suite: org.apache.lucene.codecs.compressing.TestFastDecompressionMode
   [junit4] Completed [46/454] on J1 in 0.74s, 11 tests
   [junit4] 
   [junit4] Suite: org.apache.lucene.index.TestTryDelete
   [junit4] Completed [47/454] on J1 in 0.02s, 3 tests
   [junit4] 
   [junit4] Suite: org.apache.lucene.index.TestManyFields
   [junit4] Completed [48/454] on J1 in 0.69s, 3 tests
   [junit4] 
   [junit4] Suite: org.apache.lucene.index.TestIndexWriterExceptions2
   [junit4] Completed [49/454] on J0 in 3.58s, 1 test
   [junit4] 
   [junit4] Suite: org.apache.lucene.search.spans.TestSpanExplanations
   [junit4] Completed [50/454] on J0 in 0.17s, 30 tests
   [junit4] 
   [junit4] Suite: org.apache.lucene.TestSearchForDuplicates
   [junit4] Completed [51/454] on J0 in 0.04s, 1 test
   [junit4] 
   [junit4] Suite: org.apache.lucene.TestSearch
   [junit4] Completed [52/454] on J0 in 0.02s, 2 tests
   [junit4] 
   [junit4] Suite: org.apache.lucene.util.automaton.TestMinimize
   [junit4] Completed [53/454] on J0 in 0.84s, 3 tests
   [junit4] 
   [junit4] Suite: org.apache.lucene.index.TestCodecs
   [junit4] Completed [54/454] on J0 in 0.15s, 3 tests
   [junit4] 
   [junit4] Suite: org.apache.lucene.index.TestFilterLeafReader
   [junit4] Completed [55/454] on J0 in 0.02s, 3 tests
   [junit4] 
   [junit4] Suite: org.apache.lucene.search.TestBooleanQuery
   [junit4] Completed [56/454] on J0 in 0.12s, 22 tests
   [junit4] 
   [junit4] Suite: org.apache.lucene.index.TestOmitPositions
   [junit4] Completed [57/454] on J0 in 0.12s, 4 tests
   [junit4] 
   [junit4] Suite: org.apache.lucene.util.TestRecyclingByteBlockAllocator
   [junit4] Completed [58/454] on J0 in 0.03s, 3 tests
   [junit4] 
   [junit4] Suite: org.apache.lucene.index.TestForceMergeForever
   [junit4] Completed [59/454] on J0 in 0.15s, 1 test
   [junit4] 
   [junit4] Suite: org.apache.lucene.search.TestBooleanRewrites
   [junit4] Completed [60/454] on J0 in 0.08s, 10 tests
   [junit4] 
   [junit4] Suite: org.apache.lucene.util.TestFilterIterator
   [junit4] Completed [61/454] on J0 in 0.02s, 8 tests
   [junit4] 
   [junit4] Suite: org.apache.lucene.codecs.TestCodecUtil
   [junit4] Completed [62/454] on J0 in 0.02s, 16 tests
   [junit4] 
   [junit4] Suite: org.apache.lucene.analysis.TestCharacterUtils
   [junit4] Completed [63/454] on J0 in 0.03s, 4 tests
   [junit4] 
   [junit4] Suite: org.apache.lucene.index.TestDocCount
   [junit4] Completed [64/454] on J0 in 0.08s, 1 test
   [junit4] 
   [junit4] Suite: org.apache.lucene.index.TestSegmentInfos
   [junit4] Completed [65/454] on J0 in 0.02s, 4 tests
   [junit4] 
   [junit4] Suite: org.apache.lucene.util.automaton.TestRegExp
   [junit4] Completed [66/454] on J0 in 0.07s, 5 tests
   [junit4] 
   [junit4] Suite: org.apache.lucene.search.MultiCollectorTest
   [junit4] Completed [67/454] on J0 in 0.02s, 4 tests
   [junit4] 
   [junit4] Suite: org.apache.lucene.codecs.lucene50.TestLucene50StoredFieldsFormat
   [junit4] IGNOR/A 0.00s J0 | TestLucene50StoredFieldsFormat.testBigDocuments
   [junit4]    > Assumption #1: 'nightly' test group is disabled (@Nightly())
   [junit4] Completed [68/454] on J0 in 0.70s, 17 tests, 1 skipped
   [junit4] 
   [junit4] Suite: org.apache.lucene.TestAssertions
   [junit4] Completed [69/454] on J0 in 0.01s, 1 test
   [junit4] 
   [junit4] Suite: org.apache.lucene.index.TestLazyProxSkipping
   [junit4] Completed [70/454] on J0 in 0.16s, 2 tests
   [junit4] 
   [junit4] Suite: org.apache.lucene.index.TestOmitTf
   [junit4] Completed [71/454] on J0 in 0.19s, 6 tests
   [junit4] 
   [junit4] Suite: org.apache.lucene.index.TestNewestSegment
   [junit4] Completed [72/454] on J0 in 0.01s, 1 test
   [junit4] 
   [junit4] Suite: org.apache.lucene.search.TestSortedSetSortField
   [junit4] Completed [73/454] on J0 in 0.04s, 7 tests
   [junit4] 
   [junit4] Suite: org.apache.lucene.index.TestParallelCompositeReader
   [junit4] Completed [74/454] on J0 in 0.20s, 11 tests
   [junit4] 
   [junit4] Suite: org.apache.lucene.store.TestSleepingLockWrapper
   [junit4] Completed [75/454] on J1 in 11.71s, 6 tests
   [junit4] 
   [junit4] Suite: org.apache.lucene.search.spans.TestSpanBoostQuery
   [junit4] Completed [76/454] on J1 in 0.01s, 2 tests
   [junit4] 
   [junit4] Suite: org.apache.lucene.analysis.TestCharArraySet
   [junit4] Completed [77/454] on J1 in 0.03s, 15 tests
   [junit4] 
   [junit4] Suite: org.apache.lucene.index.TestIndexReaderClose
   [junit4] Completed [78/454] on J1 in 0.14s, 3 tests
   [junit4] 
   [junit4] Suite: org.apache.lucene.analysis.standard.TestStandardAnalyzer
   [junit4] Completed [79/454] on J0 in 6.61s, 36 tests
   [junit4] 
   [junit4] Suite: org.apache.lucene.geo.TestGeoEncodingUtils
   [junit4] Completed [80/454] on J0 in 0.51s, 3 tests
   [junit4] 
   [junit4] Suite: org.apache.lucene.search.spans.TestSpanSearchEquivalence
   [junit4] Completed [81/454] on J0 in 0.52s, 33 tests
   [junit4] 
   [junit4] Suite: org.apache.lucene.index.TestNoMergePolicy
   [junit4] Completed [82/454] on J0 in 0.06s, 4 tests
   [junit4] 
   [junit4] Suite: org.apache.lucene.search.TestSimilarityProvider
   [junit4] Completed [83/454] on J0 in 0.02s, 1 test
   [junit4] 
   [junit4] Suite: org.apache.lucene.search.TestDocValuesQueries
   [junit4] Completed [84/454] on J0 in 1.50s, 10 tests
   [junit4] 
   [junit4] Suite: org.apache.lucene.util.TestNotDocIdSet
   [junit4] Completed [85/454] on J0 in 1.87s, 6 tests
   [junit4] 
   [junit4] Suite: org.apache.lucene.search.TestIndexSearcher
   [junit4] Completed [86/454] on J0 in 0.11s, 5 tests
   [junit4] 
   [junit4] Suite: org.apache.lucene.search.TestTermScorer
   [junit4] Completed [87/454] on J0 in 0.07s, 4 tests
   [junit4] 
   [junit4] Suite: org.apache.lucene.analysis.TestReusableStringReader
   [junit4] Completed [88/454] on J0 in 0.01s, 1 test
   [junit4] 
   [junit4] Suite: org.apache.lucene.util.TestTimSorter
   [junit4] Completed [89/454] on J0 in 0.04s, 9 tests
   [junit4] 
   [junit4] Suite: org.apache.lucene.index.TestTieredMergePolicy
   [junit4] Completed [90/454] on J0 in 3.68s, 6 tests
   [junit4] 
   [junit4] Suite: org.apache.lucene.index.TestAddIndexes
   [junit4] Completed [91/454] on J0 in 4.58s, 25 tests
   [junit4] 
   [junit4] Suite: org.apache.lucene.index.TestMergeRateLimiter
   [junit4] Completed [92/454] on J0 in 0.01s, 1 test
   [junit4] 
   [junit4] Suite: org.apache.lucene.index.TestTwoPhaseCommitTool
   [junit4] Completed [93/454] on J0 in 0.01s, 3 tests
   [junit4] 
   [junit4] Suite: org.apache.lucene.util.TestRecyclingIntBlockAllocator
   [junit4] Completed [94/454] on J0 in 0.05s, 3 tests
   [junit4] 
   [junit4] Suite: org.apache.lucene.index.TestCustomNorms
   [junit4] Completed [95/454] on J0 in 0.48s, 1 test
   [junit4] 
   [junit4] Suite: org.apache.lucene.search.TestRegexpRandom2
   [junit4] Completed [96/454] on J0 in 0.42s, 1 test
   [junit4] 
   [junit4] Suite: org.apache.lucene.search.spans.TestFilterSpans
   [junit4] Completed [97/454] on J0 in 0.01s, 1 test
   [junit4] 
   [junit4] Suite: org.apache.lucene.codecs.perfield.TestPerFieldDocValuesFormat
   [junit4] Completed [98/454] on J1 in 15.35s, 110 tests
   [junit4] 
   [junit4] Suite: org.apache.lucene.codecs.lucene50.TestBlockPostingsFormat3
   [junit4] Completed [99/454] on J1 in 1.00s, 1 test
   [junit4] 
   [junit4] Suite: org.apache.lucene.index.TestIndexWriterDeleteByQuery
   [junit4] Completed [100/454] on J1 in 0.02s, 1 test
   [junit4] 
   [junit4] Suite: org.apache.lucene.index.TestFlex
   [junit4] Completed [101/454] on J1 in 0.77s, 2 tests
   [junit4] 
   [junit4] Suite: org.apache.lucene.search.spans.TestFieldMaskingSpanQuery
   [junit4] IGNOR/A 0.00s J1 | TestFieldMaskingSpanQuery.testSimple2
   [junit4]    > Assumption #1: Broken scoring: LUCENE-3723
   [junit4] IGNOR/A 0.00s J1 | TestFieldMaskingSpanQuery.testSpans2
   [junit4]    > Assumption #1: Broken scoring: LUCENE-3723
   [junit4] Completed [102/454] on J1 in 0.16s, 11 tests, 2 skipped
   [junit4] 
   [junit4] Suite: org.apache.lucene.util.TestSetOnce
   [junit4] Completed [103/454] on J1 in 0.02s, 4 tests
   [junit4] 
   [junit4] Suite: org.apache.lucene.util.TestMSBRadixSorter
   [junit4] Completed [104/454] on J1 in 1.47s, 8 tests
   [junit4] 
   [junit4] Suite: org.apache.lucene.index.TestNumericDocValuesUpdates
   [junit4] Completed [105/454] on J0 in 3.93s, 32 tests
   [junit4] 
   [junit4] Suite: org.apache.lucene.util.TestIntArrayDocIdSet
   [junit4] Completed [106/454] on J0 in 0.46s, 5 tests
   [junit4] 
   [junit4] Suite: org.apache.lucene.index.TestStressDeletes
   [junit4] Completed [107/454] on J0 in 0.15s, 1 test
   [junit4] 
   [junit4] Suite: org.apache.lucene.search.TestSimpleExplanationsOfNonMatches
   [junit4] Completed [108/454] on J0 in 0.06s, 70 tests
   [junit4] 
   [junit4] Suite: org.apache.lucene.search.TestFieldValueQuery
   [junit4] Completed [109/454] on J0 in 0.56s, 6 tests
   [junit4] 
   [junit4] Suite: org.apache.lucene.index.TestAllFilesHaveCodecHeader
   [junit4] Completed [110/454] on J0 in 0.19s, 1 test
   [junit4] 
   [junit4] Suite: org.apache.lucene.util.TestLongBitSet
   [junit4] IGNOR/A 0.00s J0 | TestLongBitSet.testHugeCapacity
   [junit4]    > Assumption #1: 'nightly' test group is disabled (@Nightly())
   [junit4] Completed [111/454] on J0 in 0.12s, 9 tests, 1 skipped
   [junit4] 
   [junit4] Suite: org.apache.lucene.search.TestLiveFieldValues
   [junit4] Completed [112/454] on J0 in 0.28s, 1 test
   [junit4] 
   [junit4] Suite: org.apache.lucene.index.TestDocsWithFieldSet
   [junit4] Completed [113/454] on J0 in 0.01s, 3 tests
   [junit4] 
   [junit4] Suite: org.apache.lucene.codecs.lucene50.TestBlockPostingsFormat2
   [junit4] Completed [114/454] on J0 in 1.60s, 4 tests
   [junit4] 
   [junit4] Suite: org.apache.lucene.search.TestBooleanQueryVisitSubscorers
   [junit4] Completed [115/454] on J0 in 0.05s, 7 tests
   [junit4] 
   [junit4] Suite: org.apache.lucene.util.TestCloseableThreadLocal
   [junit4] Completed [116/454] on J0 in 0.01s, 3 tests
   [junit4] 
   [junit4] Suite: org.apache.lucene.util.automaton.TestAutomaton
   [junit4] Completed [117/454] on J0 in 0.59s, 56 tests
   [junit4] 
   [junit4] Suite: org.apache.lucene.util.TestPriorityQueue
   [junit4] Completed [118/454] on J0 in 0.82s, 9 tests
   [junit4] 
   [junit4] Suite: org.apache.lucene.index.TestConcurrentMergeScheduler
   [junit4] Completed [119/454] on J1 in 7.20s, 16 tests
   [junit4] 
   [junit4] Suite: org.apache.lucene.index.TestIndexCommit
   [junit4] Completed [120/454] on J1 in 0.01s, 1 test
   [junit4] 
   [junit4] Suite: org.apache.lucene.index.Test2BPostingsBytes
   [junit4] IGNOR/A 0.00s J1 | Test2BPostingsBytes.test
   [junit4]    > Assumption #1: 'monster' test group is disabled (@Monster(value="takes ~20GB-30GB of space and 10 minutes"))
   [junit4] Completed [121/454] on J1 in 0.00s, 1 test, 1 skipped
   [junit4] 
   [junit4] Suite: org.apache.lucene.search.TestSearchWithThreads
   [junit4] Completed [122/454] on J0 in 1.97s, 1 test
   [junit4] 
   [junit4] Suite: org.apache.lucene.search.TestPositionIncrement
   [junit4] Completed [123/454] on J0 in 0.09s, 2 tests
   [junit4] 
   [junit4] Suite: org.apache.lucene.search.TestSloppyPhraseQuery2
   [junit4] Completed [124/454] on J1 in 0.37s, 9 tests
   [junit4] 
   [junit4] Suite: org.apache.lucene.document.TestFieldType
   [junit4] Completed [125/454] on J1 in 0.01s, 3 tests
   [junit4] 
   [junit4] Suite: org.apache.lucene.codecs.perfield.TestPerFieldPostingsFormat
   [junit4] IGNOR/A 0.00s J1 | TestPerFieldPostingsFormat.testPostingsEnumReuse
   [junit4]    > Assumption #1: The MockRandom PF randomizes content on the fly, so we can't check it
   [junit4] IGNOR/A 0.00s J1 | TestPerFieldPostingsFormat.testMergeStability
   [junit4]    > Assumption #1: The MockRandom PF randomizes content on the fly, so we can't check it
   [junit4] Completed [126/454] on J1 in 2.76s, 25 tests, 2 skipped
   [junit4] 
   [junit4] Suite: org.apache.lucene.search.TestAutomatonQuery
   [junit4] Completed [127/454] on J1 in 1.20s, 8 tests
   [junit4] 
   [junit4] Suite: org.apache.lucene.search.TestCachingCollector
   [junit4] Completed [128/454] on J1 in 0.01s, 4 tests
   [junit4] 
   [junit4] Suite: org.apache.lucene.search.TestApproximationSearchEquivalence
   [junit4] Completed [129/454] on J1 in 0.22s, 10 tests
   [junit4] 
   [junit4] Suite: org.apache.lucene.search.spans.TestNearSpansOrdered
   [junit4] Completed [130/454] on J1 in 0.17s, 19 tests
   [junit4] 
   [junit4] Suite: org.apache.lucene.search.TestMultiCollector
   [junit4] Completed [131/454] on J1 in 0.35s, 2 tests
   [junit4] 
   [junit4] Suite: org.apache.lucene.util.TestNumericUtils
   [junit4] Completed [132/454] on J1 in 0.33s, 24 tests
   [junit4] 
   [junit4] Suite: org.apache.lucene.store.TestBufferedChecksum
   [junit4] Completed [133/454] on J1 in 0.02s, 2 tests
   [junit4] 
   [junit4] Suite: org.apache.lucene.search.spans.TestSpanFirstQuery
   [junit4] Completed [134/454] on J1 in 0.01s, 1 test
   [junit4] 
   [junit4] Suite: org.apache.lucene.search.TestNGramPhraseQuery
   [junit4] Completed [135/454] on J1 in 0.01s, 1 test
   [junit4] 
   [junit4] Suite: org.apache.lucene.index.TestNoMergeScheduler
   [junit4] Completed [136/454] on J1 in 0.01s, 3 tests
   [junit4] 
   [junit4] Suite: org.apache.lucene.index.TestMultiFields
   [junit4] Completed [138/454] on J1 in 0.04s, 3 tests
   [junit4] 
   [junit4] Suite: org.apache.lucene.document.TestField
   [junit4] Completed [139/454] on J1 in 0.03s, 23 tests
   [junit4] 
   [junit4] Suite: org.apache.lucene.search.TestElevationComparator
   [junit4] Completed [140/454] on J1 in 0.10s, 1 test
   [junit4] 
   [junit4] Suite: org.apache.lucene.index.TestNRTReaderCleanup
   [junit4] IGNOR/A 0.00s J1 | TestNRTReaderCleanup.testClosingNRTReaderDoesNotCorruptYourIndex
   [junit4]    > Assumption #1: this test can't run on Windows
   [junit4] Completed [141/454] on J1 in 0.01s, 1 test, 1 skipped
   [junit4] 
   [junit4] Suite: org.apache.lucene.index.TestMergePolicyWrapper
   [junit4] Completed [142/454] on J1 in 0.01s, 1 test
   [junit4] 
   [junit4] Suite: org.apache.lucene.index.TestDuelingCodecsAtNight
   [junit4] IGNOR/A 0.00s J1 | TestDuelingCodecsAtNight.testEquals
   [junit4]    > Assumption #1: 'nightly' test group is disabled (@Nightly())
   [junit4] IGNOR/A 0.00s J1 | TestDuelingCodecsAtNight.testCrazyReaderEquals
   [junit4]    > Assumption #1: 'nightly' test group is disabled (@Nightly())
   [junit4] IGNOR/A 0.00s J1 | TestDuelingCodecsAtNight.testBigEquals
   [junit4]    > Assumption #1: 'nightly' test group is disabled (@Nightly())
   [junit4] Completed [143/454] on J1 in 0.00s, 3 tests, 3 skipped
   [junit4] 
   [junit4] Suite: org.apache.lucene.index.TestIndexWriter
   [junit4] IGNOR/A 0.00s J0 | TestIndexWriter.testWithPendingDeletions
   [junit4]    > Assumption #1: windows is not supported
   [junit4] Completed [144/454] on J0 in 7.18s, 72 tests, 2 skipped
   [junit4] 
   [junit4] Suite: org.apache.lucene.index.TestAllFilesDetectTruncation
   [junit4] Completed [145/454] on J0 in 0.13s, 1 test
   [junit4] 
   [junit4] Suite: org.apache.lucene.util.TestDocIdSetBuilder
   [junit4] Completed [146/454] on J1 in 1.90s, 7 tests
   [junit4] 
   [junit4] Suite: org.apache.lucene.index.TestIsCurrent
   [junit4] Completed [147/454] on J1 in 0.02s, 2 tests
   [junit4] 
   [junit4] Suite: org.apache.lucene.analysis.tokenattributes.TestPackedTokenAttributeImpl
   [junit4] Completed [148/454] on J0 in 0.03s, 4 tests
   [junit4] 
   [junit4] Suite: org.apache.lucene.util.TestCharsRefBuilder
   [junit4] Completed [149/454] on J0 in 0.01s, 2 tests
   [junit4] 
   [junit4] Suite: org.apache.lucene.search.TestDateSort
   [junit4] Completed [150/454] on J0 in 0.01s, 1 test
   [junit4] 
   [junit4] Suite: org.apache.lucene.util.TestUnicodeUtil
   [junit4] Completed [151/454] on J0 in 0.19s, 5 tests
   [junit4] 
   [junit4] Suite: org.apache.lucene.search.similarities.TestAxiomaticSimilarity
   [junit4] Completed [152/454] on J0 in 0.02s, 3 tests
   [junit4] 
   [junit4] Suite: org.apache.lucene.util.TestSPIClassIterator
   [junit4] Completed [153/454] on J0 in 0.09s, 1 test
   [junit4] 
   [junit4] Suite: org.apache.lucene.store.TestLockFactory
   [junit4] Completed [154/454] on J0 in 0.03s, 2 tests
   [junit4] 
   [junit4] Suite: org.apache.lucene.search.spans.TestSpanOrQuery
   [junit4] Completed [155/454] on J0 in 0.01s, 3 tests
   [junit4] 
   [junit4] Suite: org.apache.lucene.analysis.TestCharFilter
   [junit4] Completed [156/454] on J0 in 0.01s, 4 tests
   [junit4] 
   [junit4] Suite: org.apache.lucene.search.spans.TestSpans
   [junit4] Completed [157/454] on J0 in 0.62s, 26 tests
   [junit4] 
   [junit4] Suite: org.apache.lucene.store.TestRAMDirectory
   [junit4] IGNOR/A 0.00s J0 | TestRAMDirectory.testPendingDeletions
   [junit4]    > Assumption #1: we can only install VirusCheckingFS on an FSDirectory
   [junit4] IGNOR/A 0.00s J0 | TestRAMDirectory.testFsyncDoesntCreateNewFiles
   [junit4]    > Assumption #1: test only works for FSDirectory subclasses
   [junit4] Completed [158/454] on J0 in 0.68s, 46 tests, 2 skipped
   [junit4] 
   [junit4] Suite: org.apache.lucene.index.TestSegmentReader
   [junit4] Completed [159/454] on J0 in 0.39s, 7 tests
   [junit4] 
   [junit4] Suite: org.apache.lucene.search.TestIntRangeFieldQueries
   [junit4] IGNOR/A 0.00s J1 | TestIntRangeFieldQueries.testRandomBig
   [junit4]    > Assumption #1: 'nightly' test group is disabled (@Nightly())
   [junit4] Completed [160/454] on J1 in 3.09s, 5 tests, 1 skipped
   [junit4] 
   [junit4] Suite: org.apache.lucene.util.TestIntroSelector
   [junit4] Completed [161/454] on J1 in 0.73s, 2 tests
   [junit4] 
   [junit4] Suite: org.apache.lucene.search.TestMultiPhraseQuery
   [junit4] Completed [162/454] on J1 in 0.12s, 16 tests, 1 skipped
   [junit4] 
   [junit4] Suite: org.apache.lucene.index.TestSegmentMerger
   [junit4] Completed [163/454] on J1 in 0.58s, 3 tests
   [junit4] 
   [junit4] Suite: org.apache.lucene.index.TestReaderClosed
   [junit4] Completed [164/454] on J1 in 0.09s, 2 tests
   [junit4] 
   [junit4] Suite: org.apache.lucene.search.TestMinShouldMatch2
   [junit4] Completed [165/454] on J0 in 2.81s, 6 tests
   [junit4] 
   [junit4] Suite: org.apache.lucene.search.TestNeedsScores
   [junit4] Completed [166/454] on J0 in 0.04s, 4 tests
   [junit4] 
   [junit4] Suite: org.apache.lucene.util.bkd.TestDocIdsWriter
   [junit4] Completed [167/454] on J1 in 2.72s, 2 tests
   [junit4] 
   [junit4] Suite: org.apache.lucene.util.Test2BPagedBytes
   [junit4] IGNOR/A 0.00s J1 | Test2BPagedBytes.test
   [junit4]    > Assumption #1: 'monster' test group is disabled (@Monster(value="You must increase heap to > 2 G to run this"))
   [junit4] Completed [168/454] on J1 in 0.02s, 1 test, 1 skipped
   [junit4] 
   [junit4] Suite: org.apache.lucene.index.TestDuelingCodecs
   [junit4] Completed [169/454] on J0 in 3.45s, 2 tests
   [junit4] 
   [junit4] Suite: org.apache.lucene.search.TestFieldCacheRewriteMethod
   [junit4] Completed [170/454] on J0 in 0.37s, 2 tests
   [junit4] 
   [junit4] Suite: org.apache.lucene.index.TestFieldInvertState
   [junit4] Completed [171/454] on J0 in 0.02s, 2 tests
   [junit4] 
   [junit4] Suite: org.apache.lucene.index.TestTermVectors
   [junit4] Completed [172/454] on J0 in 0.10s, 3 tests
   [junit4] 
   [junit4] Suite: org.apache.lucene.util.TestStringMSBRadixSorter
   [junit4] Completed [173/454] on J1 in 1.37s, 7 tests
   [junit4] 
   [junit4] Suite: org.apache.lucene.search.TestEarlyTermination
   [junit4] Completed [174/454] on J1 in 0.02s, 1 test
   [junit4] 
   [junit4] Suite: org.apache.lucene.index.TestMixedCodecs
   [junit4] Completed [175/454] on J0 in 0.87s, 1 test
   [junit4] 
   [junit4] Suite: org.apache.lucene.codecs.perfield.TestPerFieldPostingsFormat2
   [junit4] Completed [176/454] on J1 in 0.75s, 6 tests
   [junit4] 
   [junit4] Suite: org.apache.lucene.util.TestMergedIterator
   [junit4] Completed [177/454] on J1 in 0.18s, 25 tests
   [junit4] 
   [junit4] Suite: org.apache.lucene.index.TestTermVectorsReader
   [junit4] Completed [178/454] on J1 in 0.32s, 13 tests
   [junit4] 
   [junit4] Suite: org.apache.lucene.index.TestCheckIndex
   [junit4] Completed [179/454] on J1 in 0.52s, 4 tests
   [junit4] 
   [junit4] Suite: org.apache.lucene.search.TestLongValuesSource
   [junit4] Completed [180/454] on J0 in 2.09s, 4 tests
   [junit4] 
   [junit4] Suite: org.apache.lucene.search.TestMultiPhraseEnum
   [junit4] Completed [181/454] on J0 in 0.02s, 2 tests
   [junit4] 
   [junit4] Suite: org.apache.lucene.search.spans.TestSpanNearQuery
   [junit4] Completed [182/454] on J0 in 0.03s, 4 tests
   [junit4] 
   [junit4] Suite: org.apache.lucene.util.bkd.TestMutablePointsReaderUtils
   [junit4] Completed [183/454] on J0 in 0.83s, 3 tests
   [junit4] 
   [junit4] Suite: org.apache.lucene.store.TestHugeRamFile
   [junit4] Completed [184/454] on J0 in 0.88s, 1 test
   [junit4] 
   [junit4] Suite: org.apache.lucene.search.TestTopDocsCollector
   [junit4] Completed [185/454] on J0 in 0.06s, 8 tests
   [junit4] 
   [junit4] Suite: org.apache.lucene.search.TestPrefixQuery
   [junit4] Completed [186/454] on J0 in 1.01s, 3 tests
   [junit4] 
   [junit4] Suite: org.apache.lucene.index.TestMaxPosition
   [junit4] Completed [187/454] on J0 in 0.02s, 2 tests
   [junit4] 
   [junit4] Suite: org.apache.lucene.index.TestTragicIndexWriterDeadlock
   [junit4] Completed [188/454] on J0 in 0.04s, 2 tests
   [junit4] 
   [junit4] Suite: org.apache.lucene.store.TestFilterDirectory
   [junit4] IGNOR/A 0.00s J0 | TestFilterDirectory.testFsyncDoesntCreateNewFiles
   [junit4]    > Assumption #1: test only works for FSDirectory subclasses
   [junit4] IGNOR/A 0.00s J0 | TestFilterDirectory.testPendingDeletions
   [junit4]    > Assumption #1: we can only install VirusCheckingFS on an FSDirectory
   [junit4] Completed [189/454] on J0 in 0.41s, 44 tests, 2 skipped
   [junit4] 
   [junit4] Suite: org.apache.lucene.search.TestScoreCachingWrappingScorer
   [junit4] Completed [190/454] on J0 in 0.01s, 1 test
   [junit4] 
   [junit4] Suite: org.apache.lucene.search.TestTermQuery
   [junit4] Completed [191/454] on J0 in 0.03s, 2 tests
   [junit4] 
   [junit4] Suite: org.apache.lucene.util.automaton.TestDeterminizeLexicon
   [junit4] Completed [192/454] on J0 in 0.39s, 1 test
   [junit4] 
   [junit4] Suite: org.apache.lucene.index.TestIndexWriterMerging
   [junit4] Completed [193/454] on J0 in 3.13s, 6 tests
   [junit4] 
   [junit4] Suite: org.apache.lucene.util.fst.TestFSTs
   [junit4] IGNOR/A 0.00s J0 | TestFSTs.testBigSet
   [junit4]    > Assumption #1: 'nightly' test group is disabled (@Nightly())
   [junit4] Completed [194/454] on J0 in 1.31s, 20 tests, 1 skipped
   [junit4] 
   [junit4] Suite: org.apache.lucene.util.fst.TestBytesStore
   [junit4] Completed [195/454] on J0 in 0.34s, 1 test
   [junit4] 
   [junit4] Suite: org.apache.lucene.index.TestTermsEnum
   [junit4] Completed [196/454] on J1 in 10.13s, 13 tests
   [junit4] 
   [junit4] Suite: org.apache.lucene.search.TestIndexOrDocValuesQuery
   [junit4] Completed [197/454] on J1 in 0.03s, 1 test
   [junit4] 
   [junit4] Suite: org.apache.lucene.index.TestPerSegmentDeletes
   [junit4] Completed [198/454] on J1 in 0.02s, 1 test
   [junit4] 
   [junit4] Suite: org.apache.lucene.index.TestTransactionRollback
   [junit4] Completed [199/454] on J1 in 0.08s, 2 tests
   [junit4] 
   [junit4] Suite: org.apache.lucene.index.TestSizeBoundedForceMerge
   [junit4] Completed [200/454] on J1 in 0.66s, 11 tests
   [junit4] 
   [junit4] Suite: org.apache.lucene.index.TestIndexWriterCommit
   [junit4] Completed [201/454] on J1 in 2.10s, 14 tests
   [junit4] 
   [junit4] Suite: org.apache.lucene.geo.TestPolygon2D
   [junit4] Completed [202/454] on J1 in 1.97s, 10 tests
   [junit4] 
   [junit4] Suite: org.apache.lucene.util.packed.TestPackedInts
   [junit4] IGNOR/A 0.00s J0 | TestPackedInts.testBlockReaderOverflow
   [junit4]    > Assumption #1: 'nightly' test group is disabled (@Nightly())
   [junit4] Completed [203/454] on J0 in 6.35s, 28 tests, 3 skipped
   [junit4] 
   [junit4] Suite: org.apache.lucene.search.TestShardSearching
   [junit4] Completed [204/454] on J1 in 3.21s, 1 test
   [junit4] 
   [junit4] Suite: org.apache.lucene.util.TestRoaringDocIdSet
   [junit4] Completed [205/454] on J1 in 0.52s, 5 tests
   [junit4] 
   [junit4] Suite: org.apache.lucene.index.TestIndexWriterWithThreads
   [junit4] IGNOR/A 0.03s J0 | TestIndexWriterWithThreads.testOpenTwoIndexWritersOnDifferentThreads
   [junit4]    > Assumption #1: aborting test: timeout obtaining lock
   [junit4] Completed [206/454] on J0 in 2.18s, 12 tests, 1 skipped
   [junit4] 
   [junit4] Suite: org.apache.lucene.index.Test2BPostings
   [junit4] IGNOR/A 0.00s J1 | Test2BPostings.test
   [junit4]    > Assumption #1: 'nightly' test group is disabled (@Nightly())
   [junit4] Completed [207/454] on J1 in 0.01s, 1 test, 1 skipped
   [junit4] 
   [junit4] Suite: org.apache.lucene.analysis.TestGraphTokenizers
   [junit4] Completed [208/454] on J0 in 1.18s, 23 tests
   [junit4] 
   [junit4] Suite: org.apache.lucene.search.TestPointQueries
   [junit4] IGNOR/A 0.00s J1 | TestPointQueries.testRandomBinaryBig
   [junit4]    > Assumption #1: 'nightly' test group is disabled (@Nightly())
   [junit4] IGNOR/A 0.00s J1 | TestPointQueries.testRandomLongsBig
   [junit4]    > Assumption #1: 'nightly' test group is disabled (@Nightly())
   [junit4] Completed [209/454] on J1 in 6.08s, 49 tests, 2 skipped
   [junit4] 
   [junit4] Suite: org.apache.lucene.search.TestBoostQuery
   [junit4] Completed [210/454] on J1 in 0.01s, 3 tests
   [junit4] 
   [junit4] Suite: org.apache.lucene.index.TestIndexWriterExceptions
   [junit4] IGNOR/A 0.00s J0 | TestIndexWriterExceptions.testTooManyTokens
   [junit4]    > Assumption #1: 'nightly' test group is disabled (@Nightly())
   [junit4] Completed [211/454] on J0 in 5.52s, 34 tests, 1 skipped
   [junit4] 
   [junit4] Suite: org.apache.lucene.geo.TestGeoUtils
   [junit4] Completed [212/454] on J1 in 3.36s, 7 tests
   [junit4] 
   [junit4] Suite: org.apache.lucene.util.TestInPlaceMergeSorter
   [junit4] Completed [213/454] on J1 in 0.05s, 9 tests
   [junit4] 
   [junit4] Suite: org.apache.lucene.store.TestMultiMMap
   [junit4] Completed [214/454] on J0 in 3.45s, 54 tests
   [junit4] 
   [junit4] Suite: org.apache.lucene.index.TestPointValues
   [junit4] Completed [215/454] on J1 in 7.04s, 32 tests
   [junit4] 
   [junit4] Suite: org.apache.lucene.search.TestSynonymQuery
   [junit4] Completed [216/454] on J1 in 0.01s, 4 tests
   [junit4] 
   [junit4] Suite: org.apache.lucene.index.TestMaxTermFrequency
   [junit4] Completed [217/454] on J1 in 0.12s, 1 test
   [junit4] 
   [junit4] Suite: org.apache.lucene.search.TestTotalHitCountCollector
   [junit4] Completed [218/454] on J1 in 0.02s, 1 test
   [junit4] 
   [junit4] Suite: org.apache.lucene.index.Test2BBinaryDocValues
   [junit4] IGNOR/A 0.00s J1 | Test2BBinaryDocValues.testVariableBinary
   [junit4]    > Assumption #1: 'monster' test group is disabled (@Monster(value="takes ~ 6 hours if the heap is 5gb"))
   [junit4] IGNOR/A 0.00s J1 | Test2BBinaryDocValues.testFixedBinary
   [junit4]    > Assumption #1: 'monster' test group is disabled (@Monster(value="takes ~ 6 hours if the heap is 5gb"))
   [junit4] Completed [219/454] on J1 in 0.00s, 2 tests, 2 skipped
   [junit4] 
   [junit4] Suite: org.apache.lucene.search.TestSearcherManager
   [junit4] Completed [220/454] on J0 in 7.07s, 11 tests
   [junit4] 
   [junit4] Suite: org.apache.lucene.index.TestNRTThreads
   [junit4] Completed [221/454] on J1 in 2.40s, 1 test
   [junit4] 
   [junit4] Suite: org.apache.lucene.TestMergeSchedulerExternal
   [junit4] Completed [222/454] on J1 in 0.35s, 2 tests
   [junit4] 
   [junit4] Suite: org.apache.lucene.search.TestSloppyPhraseQuery
   [junit4] Completed [223/454] on J0 in 1.34s, 9 tests
   [junit4] 
   [junit4] Suite: org.apache.lucene.index.TestIndexWriterDelete
   [junit4] IGNOR/A 0.00s J0 | TestIndexWriterDelete.testApplyDeletesOnFlush
   [junit4]    > Assumption #1: 'nightly' test group is disabled (@Nightly())
   [junit4] Completed [224/454] on J0 in 2.71s, 25 tests, 2 skipped
   [junit4] 
   [junit4] Suite: org.apache.lucene.index.TestDeletionPolicy
   [junit4] Completed [225/454] on J1 in 3.20s, 6 tests
   [junit4] 
   [junit4] Suite: org.apache.lucene.index.TestSwappedIndexFiles
   [junit4] Completed [226/454] on J1 in 0.04s, 1 test
   [junit4] 
   [junit4] Suite: org.apache.lucene.index.TestPayloads
   [junit4] Completed [227/454] on J1 in 0.05s, 7 tests
   [junit4] 
   [junit4] Suite: org.apache.lucene.util.TestIntsRef
   [junit4] Completed [228/454] on J1 in 0.01s, 2 tests
   [junit4] 
   [junit4] Suite: org.apache.lucene.search.FuzzyTermOnShortTermsTest
   [junit4] Completed [229/454] on J1 in 0.04s, 1 test
   [junit4] 
   [junit4] Suite: org.apache.lucene.index.TestIndexWriterNRTIsCurrent
   [junit4] Completed [230/454] on J1 in 4.07s, 1 test
   [junit4] 
   [junit4] Suite: org.apache.lucene.search.spans.TestSpanTermQuery
   [junit4] Completed [231/454] on J1 in 0.01s, 2 tests
   [junit4] 
   [junit4] Suite: org.apache.lucene.util.TestBytesRefArray
   [junit4] Completed [232/454] on J1 in 0.02s, 2 tests
   [junit4] 
   [junit4] Suite: org.apache.lucene.index.TestIndexWriterMergePolicy
   [junit4] Completed [233/454] on J0 in 4.34s, 7 tests
   [junit4] 
   [junit4] Suite: org.apache.lucene.index.TestIndexWriterThreadsToSegments
   [junit4] Completed [234/454] on J1 in 0.92s, 4 tests
   [junit4] 
   [junit4] Suite: org.apache.lucene.index.TestTerms
   [junit4] Completed [235/454] on J1 in 0.04s, 2 tests
   [junit4] 
   [junit4] Suite: org.apache.lucene.search.TestNot
   [junit4] Completed [236/454] on J1 in 0.02s, 1 test
   [junit4] 
   [junit4] Suite: org.apache.lucene.util.automaton.TestCompiledAutomaton
   [junit4] Completed [237/454] on J1 in 0.04s, 6 tests
   [junit4] 
   [junit4] Suite: org.apache.lucene.search.similarities.TestClassicSimilarity
   [junit4] Completed [238/454] on J1 in 0.06s, 12 tests
   [junit4] 
   [junit4] Suite: org.apache.lucene.search.TestComplexExplanationsOfNonMatches
   [junit4] Completed [239/454] on J1 in 0.03s, 21 tests
   [junit4] 
   [junit4] Suite: org.apache.lucene.index.TestPersistentSnapshotDeletionPolicy
   [junit4] Completed [240/454] on J1 in 1.38s, 13 tests
   [junit4] 
   [junit4] Suite: org.apache.lucene.index.TestAtomicUpdate
   [junit4] Completed [241/454] on J1 in 2.25s, 1 test
   [junit4] 
   [junit4] Suite: org.apache.lucene.index.TestStressAdvance
   [junit4] Completed [242/454] on J1 in 0.44s, 1 test
   [junit4] 
   [junit4] Suite: org.apache.lucene.search.TestBoolean2
   [junit4] Completed [243/454] on J0 in 5.35s, 10 tests
   [junit4] 
   [junit4] Suite: org.apache.lucene.index.TestNorms
   [junit4] Completed [244/454] on J1 in 0.61s, 2 tests
   [junit4] 
   [junit4] Suite: org.apache.lucene.index.TestDirectoryReaderReopen
   [junit4] Completed [245/454] on J0 in 1.42s, 14 tests
   [junit4] 
   [junit4] Suite: org.apache.lucene.search.TestSearchAfter
   [junit4] Completed [246/454] on J0 in 0.08s, 1 test
   [junit4] 
   [junit4] Suite: org.apache.lucene.codecs.compressing.TestHighCompressionMode
   [junit4] Completed [247/454] on J0 in 0.23s, 7 tests
   [junit4] 
   [junit4] Suite: org.apache.lucene.search.TestTimeLimitingCollector
   [junit4] Completed [248/454] on J1 in 1.56s, 7 tests
   [junit4] 
   [junit4] Suite: org.apache.lucene.index.TestNeverDelete
   [junit4] Completed [249/454] on J1 in 1.41s, 1 test
   [junit4] 
   [junit4] Suite: org.apache.lucene.search.TestTopDocsMerge
   [junit4] Completed [250/454] on J1 in 0.17s, 4 tests
   [junit4] 
   [junit4] Suite: org.apache.lucene.index.TestLongPostings
   [junit4] Completed [251/454] on J1 in 0.45s, 2 tests
   [junit4] 
   [junit4] Suite: org.apache.lucene.index.TestDocumentsWriterStallControl
   [junit4] Completed [252/454] on J0 in 2.57s, 3 tests
   [junit4] 
   [junit4] Suite: org.apache.lucene.index.TestRollingUpdates
   [junit4] Completed [253/454] on J0 in 0.63s, 2 tests
   [junit4] 
   [junit4] Suite: org.apache.lucene.index.TestStressIndexing
   [junit4] Completed [254/454] on J1 in 1.35s, 1 test
   [junit4] 
   [junit4] Suite: org.apache.lucene.index.TestSnapshotDeletionPolicy
   [junit4] Completed [255/454] on J0 in 1.10s, 7 tests
   [junit4] 
   [junit4] Suite: org.apache.lucene.index.TestIndexWriterUnicode
   [junit4] Completed [256/454] on J1 in 1.01s, 5 tests
   [junit4] 
   [junit4] Suite: org.apache.lucene.util.TestArrayUtil
   [junit4] Completed [257/454] on J1 in 1.00s, 14 tests
   [junit4] 
   [junit4] Suite: org.apache.lucene.store.TestBufferedIndexInput
   [junit4] Completed [258/454] on J1 in 0.37s, 4 tests
   [junit4] 
   [junit4] Suite: org.apache.lucene.index.TestNRTReaderWithThreads
   [junit4] Completed [259/454] on J0 in 1.86s, 1 test
   [junit4] 
   [junit4] Suite: org.apache.lucene.index.TestConsistentFieldNumbers
   [junit4] Completed [260/454] on J1 in 0.16s, 4 tests
   [junit4] 
   [junit4] Suite: org.apache.lucene.util.TestWeakIdentityMap
   [junit4] Completed [261/454] on J0 in 1.65s, 2 tests
   [junit4] 
   [junit4] Suite: org.apache.lucene.search.TestSimpleExplanations
   [junit4] Completed [262/454] on J1 in 1.42s, 70 tests
   [junit4] 
   [junit4] Suite: org.apache.lucene.index.TestDirectoryReader
   [junit4] Completed [263/454] on J0 in 0.71s, 24 tests
   [junit4] 
   [junit4] Suite: org.apache.lucene.search.TestPhraseQuery
   [junit4] Completed [264/454] on J1 in 0.74s, 21 tests
   [junit4] 
   [junit4] Suite: org.apache.lucene.index.TestOmitNorms
   [junit4] Completed [265/454] on J1 in 0.31s, 5 tests
   [junit4] 
   [junit4] Suite: org.apache.lucene.util.TestFixedBitSet
   [junit4] Completed [266/454] on J1 in 0.71s, 19 tests
   [junit4] 
   [junit4] Suite: org.apache.lucene.store.TestNRTCachingDirectory
   [junit4] IGNOR/A 0.00s J1 | TestNRTCachingDirectory.testFsyncDoesntCreateNewFiles
   [junit4]    > Assumption #1: test only works for FSDirectory subclasses
   [junit4] IGNOR/A 0.00s J1 | TestNRTCachingDirectory.testPendingDeletions
   [junit4]    > Assumption #1: we can only install VirusCheckingFS on an FSDirectory
   [junit4] Completed [267/454] on J1 in 0.72s, 44 tests, 2 skipped
   [junit4] 
   [junit4] Suite: org.apache.lucene.util.TestCollectionUtil
   [junit4] Completed [268/454] on J0 in 2.25s, 4 tests
   [junit4] 
   [junit4] Suite: org.apache.lucene.index.TestCrash
   [junit4] Completed [269/454] on J1 in 0.26s, 5 tests
   [junit4] 
   [junit4] Suite: org.apache.lucene.search.TestMultiThreadTermVectors
   [junit4] Completed [270/454] on J0 in 0.53s, 1 test
   [junit4] 
   [junit4] Suite: org.apache.lucene.index.TestSegmentTermDocs
   [junit4] Completed [271/454] on J1 in 0.37s, 4 tests
   [junit4] 
   [junit4] Suite: org.apache.lucene.search.TestSort
   [junit4] Completed [272/454] on J0 in 0.12s, 25 tests
   [junit4] 
   [junit4] Suite: org.apache.lucene.index.TestMultiDocValues
   [junit4] Completed [273/454] on J1 in 0.05s, 7 tests
   [junit4] 
   [junit4] Suite: org.apache.lucene.analysis.TestToken
   [junit4] Completed [274/454] on J0 in 0.01s, 5 tests
   [junit4] 
   [junit4] Suite: org.apache.lucene.index.TestFieldsReader
   [junit4] Completed [275/454] on J1 in 0.21s, 2 tests
   [junit4] 
   [junit4] Suite: org.apache.lucene.search.TestCustomSearcherSort
   [junit4] Completed [276/454] on J0 in 0.34s, 2 tests
   [junit4] 
   [junit4] Suite: org.apache.lucene.index.TestDocValuesIndexing
   [junit4] Completed [277/454] on J1 in 0.15s, 34 tests
   [junit4] 
   [junit4] Suite: org.apache.lucene.search.similarities.TestSimilarityBase
   [junit4] Completed [278/454] on J0 in 0.41s, 31 tests
   [junit4] 
   [junit4] Suite: org.apache.lucene.search.TestBooleanMinShouldMatch
   [junit4] Completed [279/454] on J1 in 0.36s, 17 tests
   [junit4] 
   [junit4] Suite: org.apache.lucene.index.TestTermsEnum2
   [junit4] Completed [280/454] on J0 in 0.22s, 4 tests
   [junit4] 
   [junit4] Suite: org.apache.lucene.index.TestPostingsOffsets
   [junit4] Completed [281/454] on J0 in 0.22s, 13 tests
   [junit4] 
   [junit4] Suite: org.apache.lucene.index.TestIndexWriterOnDiskFull
   [junit4] Completed [282/454] on J1 in 0.32s, 4 tests
   [junit4] 
   [junit4] Suite: org.apache.lucene.util.automaton.TestUTF32ToUTF8
   [junit4] Completed [283/454] on J0 in 1.10s, 6 tests
   [junit4] 
   [junit4] Suite: org.apache.lucene.index.TestStressIndexing2
   [junit4] Completed [284/454] on J0 in 0.15s, 3 tests
   [junit4] 
   [junit4] Suite: org.apache.lucene.codecs.compressing.TestFastCompressionMode
   [junit4] Completed [285/454] on J1 in 0.96s, 11 tests
   [junit4] 
   [junit4] Suite: org.apache.lucene.util.automaton.TestDeterminism
   [junit4] Completed [286/454] on J0 in 0.12s, 2 tests
   [junit4] 
   [junit4] Suite: org.apache.lucene.index.TestTermVectorsWriter
   [junit4] Completed [287/454] on J0 in 0.36s, 15 tests
   [junit4] 
   [junit4] Suite: org.apache.lucene.analysis.tokenattributes.TestCharTermAttributeImpl
   [junit4] Completed [288/454] on J0 in 0.12s, 12 tests
   [junit4] 
   [junit4] Suite: org.apache.lucene.index.TestBagOfPostings
   [junit4] Completed [289/454] on J1 in 1.10s, 1 test
   [junit4] 
   [junit4] Suite: org.apache.lucene.index.TestStressNRT
   [junit4] Completed [290/454] on J0 in 0.04s, 1 test
   [junit4] 
   [junit4] Suite: org.apache.lucene.search.TestSameScoresWithThreads
   [junit4] Completed [291/454] on J1 in 0.22s, 1 test
   [junit4] 
   [junit4] Suite: org.apache.lucene.search.TestTermRangeQuery
   [junit4] Completed [292/454] on J0 in 0.14s, 7 tests
   [junit4] 
   [junit4] Suite: org.apache.lucene.index.TestDocumentsWriterDeleteQueue
   [junit4] Completed [293/454] on J1 in 0.06s, 5 tests
   [junit4] 
   [junit4] Suite: org.apache.lucene.index.TestDocumentWriter
   [junit4] Completed [294/454] on J0 in 0.10s, 6 tests
   [junit4] 
   [junit4] Suite: org.apache.lucene.index.TestCrashCausesCorruptIndex
   [junit4] Completed [295/454] on J1 in 0.12s, 1 test
   [junit4] 
   [junit4] Suite: org.apache.lucene.search.TestMultiTermConstantScore
   [junit4] Completed [296/454] on J1 in 0.12s, 7 tests
   [junit4] 
   [junit4] Suite: org.apache.lucene.search.TestScorerPerf
   [junit4] Completed [297/454] on J0 in 0.34s, 1 test
   [junit4] 
   [junit4] Suite: org.apache.lucene.index.TestForTooMuchCloning
   [junit4] Completed [298/454] on J1 in 0.89s, 1 test
   [junit4] 
   [junit4] Suite: org.apache.lucene.search.TestFuzzyQuery
   [junit4] Completed [299/454] on J0 in 0.89s, 11 tests
   [junit4] 
   [junit4] Suite: org.apache.lucene.index.TestDoc
   [junit4] Completed [300/454] on J0 in 0.16s, 1 test
   [junit4] 
   [junit4] Suite: org.apache.lucene.search.TestWildcard
   [junit4] Completed [301/454] on J1 in 0.04s, 8 tests
   [junit4] 
   [junit4] Suite: org.apache.lucene.search.similarities.TestSimilarity2
   [junit4] Completed [302/454] on J0 in 0.09s, 8 tests
   [junit4] 
   [junit4] Suite: org.apache.lucene.TestExternalCodecs
   [junit4] Completed [303/454] on J1 in 0.11s, 1 test
   [junit4] 
   [junit4] Suite: org.apache.lucene.index.TestNoDeletionPolicy
   [junit4] Completed [304/454] on J0 in 0.06s, 4 tests
   [junit4] 
   [junit4] Suite: org.apache.lucene.search.TestRegexpQuery
   [junit4] Completed [305/454] on J1 in 0.05s, 7 tests
   [junit4] 
   [junit4] Suite: org.apache.lucene.index.TestSegmentTermEnum
   [junit4] Completed [306/454] on J0 in 0.02s, 2 tests
   [junit4] 
   [junit4] Suite: org.apache.lucene.index.TestUniqueTermCount
   [junit4] Completed [307/454] on J1 in 0.02s, 1 test
   [junit4] 
   [junit4] Suite: org.apache.lucene.search.TestSortRandom
   [junit4] Completed [308/454] on J0 in 0.09s, 2 tests
   [junit4] 
   [junit4] Suite: org.apache.lucene.index.TestParallelReaderEmptyIndex
   [junit4] Completed [309/454] on J1 in 0.06s, 2 tests
   [junit4] 
   [junit4] Suite: org.apache.

[...truncated too long message...]

gure] :: loading settings :: file = C:\Users\jenkins\workspace\Lucene-Solr-master-Windows\lucene\top-level-ivy-settings.xml

resolve:

ivy-availability-check:

ivy-fail:

ivy-configure:
[ivy:configure] :: loading settings :: file = C:\Users\jenkins\workspace\Lucene-Solr-master-Windows\lucene\top-level-ivy-settings.xml

resolve:

ivy-availability-check:

ivy-fail:

ivy-configure:
[ivy:configure] :: loading settings :: file = C:\Users\jenkins\workspace\Lucene-Solr-master-Windows\lucene\top-level-ivy-settings.xml

resolve:

ivy-availability-check:

ivy-fail:

ivy-configure:
[ivy:configure] :: loading settings :: file = C:\Users\jenkins\workspace\Lucene-Solr-master-Windows\lucene\top-level-ivy-settings.xml

resolve:

ivy-availability-check:

ivy-fail:

ivy-configure:
[ivy:configure] :: loading settings :: file = C:\Users\jenkins\workspace\Lucene-Solr-master-Windows\lucene\top-level-ivy-settings.xml

resolve:

ivy-availability-check:

ivy-fail:

ivy-configure:
[ivy:configure] :: loading settings :: file = C:\Users\jenkins\workspace\Lucene-Solr-master-Windows\lucene\top-level-ivy-settings.xml

resolve:

ivy-availability-check:

ivy-fail:

ivy-configure:
[ivy:configure] :: loading settings :: file = C:\Users\jenkins\workspace\Lucene-Solr-master-Windows\lucene\top-level-ivy-settings.xml

resolve:

ivy-availability-check:

ivy-fail:

ivy-configure:
[ivy:configure] :: loading settings :: file = C:\Users\jenkins\workspace\Lucene-Solr-master-Windows\lucene\top-level-ivy-settings.xml

resolve:

ivy-availability-check:

ivy-fail:

ivy-configure:
[ivy:configure] :: loading settings :: file = C:\Users\jenkins\workspace\Lucene-Solr-master-Windows\lucene\top-level-ivy-settings.xml

resolve:

ivy-availability-check:

ivy-fail:

ivy-configure:
[ivy:configure] :: loading settings :: file = C:\Users\jenkins\workspace\Lucene-Solr-master-Windows\lucene\top-level-ivy-settings.xml

resolve:

ivy-availability-check:

ivy-fail:

ivy-configure:
[ivy:configure] :: loading settings :: file = C:\Users\jenkins\workspace\Lucene-Solr-master-Windows\lucene\top-level-ivy-settings.xml

resolve:

ivy-availability-check:

ivy-fail:

ivy-configure:
[ivy:configure] :: loading settings :: file = C:\Users\jenkins\workspace\Lucene-Solr-master-Windows\lucene\top-level-ivy-settings.xml

resolve:

ivy-availability-check:

ivy-fail:

ivy-configure:
[ivy:configure] :: loading settings :: file = C:\Users\jenkins\workspace\Lucene-Solr-master-Windows\lucene\top-level-ivy-settings.xml

common.resolve:

resolve:

ivy-availability-check:

ivy-fail:

ivy-configure:
[ivy:configure] :: loading settings :: file = C:\Users\jenkins\workspace\Lucene-Solr-master-Windows\lucene\top-level-ivy-settings.xml

resolve:

ivy-availability-check:

ivy-fail:

ivy-configure:
[ivy:configure] :: loading settings :: file = C:\Users\jenkins\workspace\Lucene-Solr-master-Windows\lucene\top-level-ivy-settings.xml

resolve:

ivy-availability-check:

ivy-fail:

ivy-configure:
[ivy:configure] :: loading settings :: file = C:\Users\jenkins\workspace\Lucene-Solr-master-Windows\lucene\top-level-ivy-settings.xml

resolve:

ivy-availability-check:

ivy-fail:

ivy-configure:
[ivy:configure] :: loading settings :: file = C:\Users\jenkins\workspace\Lucene-Solr-master-Windows\lucene\top-level-ivy-settings.xml

resolve:

ivy-availability-check:

ivy-fail:

ivy-configure:
[ivy:configure] :: loading settings :: file = C:\Users\jenkins\workspace\Lucene-Solr-master-Windows\lucene\top-level-ivy-settings.xml

resolve:

jar-checksums:
    [mkdir] Created dir: C:\Users\jenkins\workspace\Lucene-Solr-master-Windows\lucene\null801863854
     [copy] Copying 35 files to C:\Users\jenkins\workspace\Lucene-Solr-master-Windows\lucene\null801863854
   [delete] Deleting directory C:\Users\jenkins\workspace\Lucene-Solr-master-Windows\lucene\null801863854

resolve-example:

ivy-availability-check:

ivy-fail:

ivy-configure:
[ivy:configure] :: loading settings :: file = C:\Users\jenkins\workspace\Lucene-Solr-master-Windows\lucene\top-level-ivy-settings.xml

resolve:

resolve-server:

ivy-availability-check:

ivy-fail:

ivy-fail:

ivy-configure:
[ivy:configure] :: loading settings :: file = C:\Users\jenkins\workspace\Lucene-Solr-master-Windows\lucene\top-level-ivy-settings.xml

resolve:

resolve:

ivy-availability-check:

ivy-fail:

ivy-fail:

ivy-configure:
[ivy:configure] :: loading settings :: file = C:\Users\jenkins\workspace\Lucene-Solr-master-Windows\lucene\top-level-ivy-settings.xml

resolve:

ivy-availability-check:

ivy-fail:

ivy-fail:

ivy-configure:
[ivy:configure] :: loading settings :: file = C:\Users\jenkins\workspace\Lucene-Solr-master-Windows\lucene\top-level-ivy-settings.xml

resolve:

ivy-availability-check:

ivy-fail:

ivy-configure:
[ivy:configure] :: loading settings :: file = C:\Users\jenkins\workspace\Lucene-Solr-master-Windows\lucene\top-level-ivy-settings.xml

resolve:

ivy-availability-check:

ivy-fail:

ivy-configure:
[ivy:configure] :: loading settings :: file = C:\Users\jenkins\workspace\Lucene-Solr-master-Windows\lucene\top-level-ivy-settings.xml

resolve:

ivy-availability-check:

ivy-fail:

ivy-fail:

ivy-configure:
[ivy:configure] :: loading settings :: file = C:\Users\jenkins\workspace\Lucene-Solr-master-Windows\lucene\top-level-ivy-settings.xml

resolve:

ivy-availability-check:

ivy-fail:

ivy-fail:

ivy-configure:
[ivy:configure] :: loading settings :: file = C:\Users\jenkins\workspace\Lucene-Solr-master-Windows\lucene\top-level-ivy-settings.xml

resolve:

ivy-availability-check:

ivy-fail:

ivy-fail:

ivy-configure:
[ivy:configure] :: loading settings :: file = C:\Users\jenkins\workspace\Lucene-Solr-master-Windows\lucene\top-level-ivy-settings.xml

resolve:

ivy-availability-check:

ivy-fail:

ivy-fail:

ivy-configure:
[ivy:configure] :: loading settings :: file = C:\Users\jenkins\workspace\Lucene-Solr-master-Windows\lucene\top-level-ivy-settings.xml

resolve:

ivy-availability-check:

ivy-fail:

ivy-fail:

ivy-configure:
[ivy:configure] :: loading settings :: file = C:\Users\jenkins\workspace\Lucene-Solr-master-Windows\lucene\top-level-ivy-settings.xml

resolve:

ivy-availability-check:

ivy-fail:

ivy-fail:

ivy-configure:
[ivy:configure] :: loading settings :: file = C:\Users\jenkins\workspace\Lucene-Solr-master-Windows\lucene\top-level-ivy-settings.xml

resolve:

ivy-availability-check:

ivy-fail:

ivy-fail:

ivy-configure:
[ivy:configure] :: loading settings :: file = C:\Users\jenkins\workspace\Lucene-Solr-master-Windows\lucene\top-level-ivy-settings.xml

resolve:

ivy-availability-check:

ivy-fail:

ivy-fail:

ivy-configure:
[ivy:configure] :: loading settings :: file = C:\Users\jenkins\workspace\Lucene-Solr-master-Windows\lucene\top-level-ivy-settings.xml

resolve:

ivy-availability-check:

ivy-fail:

ivy-fail:

ivy-configure:
[ivy:configure] :: loading settings :: file = C:\Users\jenkins\workspace\Lucene-Solr-master-Windows\lucene\top-level-ivy-settings.xml

resolve:

ivy-availability-check:

ivy-fail:

ivy-fail:

ivy-configure:
[ivy:configure] :: loading settings :: file = C:\Users\jenkins\workspace\Lucene-Solr-master-Windows\lucene\top-level-ivy-settings.xml

resolve:

jar-checksums:
    [mkdir] Created dir: C:\Users\jenkins\workspace\Lucene-Solr-master-Windows\solr\null1453537533
     [copy] Copying 214 files to C:\Users\jenkins\workspace\Lucene-Solr-master-Windows\solr\null1453537533
   [delete] Deleting directory C:\Users\jenkins\workspace\Lucene-Solr-master-Windows\solr\null1453537533

check-working-copy:
[ivy:cachepath] :: resolving dependencies :: org.eclipse.jgit#org.eclipse.jgit-caller;working
[ivy:cachepath] 	confs: [default]
[ivy:cachepath] 	found org.eclipse.jgit#org.eclipse.jgit;4.6.0.201612231935-r in public
[ivy:cachepath] 	found com.jcraft#jsch;0.1.53 in public
[ivy:cachepath] 	found com.googlecode.javaewah#JavaEWAH;1.1.6 in public
[ivy:cachepath] 	found org.apache.httpcomponents#httpclient;4.3.6 in public
[ivy:cachepath] 	found org.apache.httpcomponents#httpcore;4.3.3 in public
[ivy:cachepath] 	found commons-logging#commons-logging;1.1.3 in public
[ivy:cachepath] 	found commons-codec#commons-codec;1.6 in public
[ivy:cachepath] 	found org.slf4j#slf4j-api;1.7.2 in public
[ivy:cachepath] :: resolution report :: resolve 38ms :: artifacts dl 5ms
	---------------------------------------------------------------------
	|                  |            modules            ||   artifacts   |
	|       conf       | number| search|dwnlded|evicted|| number|dwnlded|
	---------------------------------------------------------------------
	|      default     |   8   |   0   |   0   |   0   ||   8   |   0   |
	---------------------------------------------------------------------
[wc-checker] Initializing working copy...
[wc-checker] SLF4J: Failed to load class "org.slf4j.impl.StaticLoggerBinder".
[wc-checker] SLF4J: Defaulting to no-operation (NOP) logger implementation
[wc-checker] SLF4J: See http://www.slf4j.org/codes.html#StaticLoggerBinder for further details.
[wc-checker] Checking working copy status...

-jenkins-base:

BUILD SUCCESSFUL
Total time: 67 minutes 40 seconds
Archiving artifacts
WARN: No artifacts found that match the file pattern "**/*.events,heapdumps/**,**/*_pid*.log". Configuration error?
WARN: java.lang.InterruptedException: no matches found within 10000
[WARNINGS] Parsing warnings in console log with parser Java Compiler (javac)
[WARNINGS] Computing warning deltas based on reference build #6699
Recording test results
Build step 'Publish JUnit test result report' changed build result to UNSTABLE
Email was triggered for: Unstable (Test Failures)
Sending email for trigger: Unstable (Test Failures)

Mime
View raw message