lucene-dev mailing list archives

Site index · List index
Message view « Date » · « Thread »
Top « Date » · « Thread »
From Policeman Jenkins Server <jenk...@thetaphi.de>
Subject [JENKINS-EA] Lucene-Solr-7.x-Windows (32bit/jdk-9-ea+173) - Build # 15 - Still Unstable!
Date Fri, 07 Jul 2017 22:13:30 GMT
Build: https://jenkins.thetaphi.de/job/Lucene-Solr-7.x-Windows/15/
Java: 32bit/jdk-9-ea+173 -client -XX:+UseSerialGC

2 tests failed.
FAILED:  org.apache.solr.handler.admin.MetricsHandlerTest.testPropertyFilter

Error Message:


Stack Trace:
java.lang.AssertionError
	at __randomizedtesting.SeedInfo.seed([8ADD837FD715799D:E8B07D3E189B19A3]:0)
	at org.junit.Assert.fail(Assert.java:92)
	at org.junit.Assert.assertTrue(Assert.java:43)
	at org.junit.Assert.assertNotNull(Assert.java:526)
	at org.junit.Assert.assertNotNull(Assert.java:537)
	at org.apache.solr.handler.admin.MetricsHandlerTest.testPropertyFilter(MetricsHandlerTest.java:201)
	at java.base/jdk.internal.reflect.NativeMethodAccessorImpl.invoke0(Native Method)
	at java.base/jdk.internal.reflect.NativeMethodAccessorImpl.invoke(NativeMethodAccessorImpl.java:62)
	at java.base/jdk.internal.reflect.DelegatingMethodAccessorImpl.invoke(DelegatingMethodAccessorImpl.java:43)
	at java.base/java.lang.reflect.Method.invoke(Method.java:564)
	at com.carrotsearch.randomizedtesting.RandomizedRunner.invoke(RandomizedRunner.java:1713)
	at com.carrotsearch.randomizedtesting.RandomizedRunner$8.evaluate(RandomizedRunner.java:907)
	at com.carrotsearch.randomizedtesting.RandomizedRunner$9.evaluate(RandomizedRunner.java:943)
	at com.carrotsearch.randomizedtesting.RandomizedRunner$10.evaluate(RandomizedRunner.java:957)
	at com.carrotsearch.randomizedtesting.rules.SystemPropertiesRestoreRule$1.evaluate(SystemPropertiesRestoreRule.java:57)
	at org.apache.lucene.util.TestRuleSetupTeardownChained$1.evaluate(TestRuleSetupTeardownChained.java:49)
	at org.apache.lucene.util.AbstractBeforeAfterRule$1.evaluate(AbstractBeforeAfterRule.java:45)
	at org.apache.lucene.util.TestRuleThreadAndTestName$1.evaluate(TestRuleThreadAndTestName.java:48)
	at org.apache.lucene.util.TestRuleIgnoreAfterMaxFailures$1.evaluate(TestRuleIgnoreAfterMaxFailures.java:64)
	at org.apache.lucene.util.TestRuleMarkFailure$1.evaluate(TestRuleMarkFailure.java:47)
	at com.carrotsearch.randomizedtesting.rules.StatementAdapter.evaluate(StatementAdapter.java:36)
	at com.carrotsearch.randomizedtesting.ThreadLeakControl$StatementRunner.run(ThreadLeakControl.java:368)
	at com.carrotsearch.randomizedtesting.ThreadLeakControl.forkTimeoutingTask(ThreadLeakControl.java:817)
	at com.carrotsearch.randomizedtesting.ThreadLeakControl$3.evaluate(ThreadLeakControl.java:468)
	at com.carrotsearch.randomizedtesting.RandomizedRunner.runSingleTest(RandomizedRunner.java:916)
	at com.carrotsearch.randomizedtesting.RandomizedRunner$5.evaluate(RandomizedRunner.java:802)
	at com.carrotsearch.randomizedtesting.RandomizedRunner$6.evaluate(RandomizedRunner.java:852)
	at com.carrotsearch.randomizedtesting.RandomizedRunner$7.evaluate(RandomizedRunner.java:863)
	at com.carrotsearch.randomizedtesting.rules.StatementAdapter.evaluate(StatementAdapter.java:36)
	at com.carrotsearch.randomizedtesting.rules.SystemPropertiesRestoreRule$1.evaluate(SystemPropertiesRestoreRule.java:57)
	at org.apache.lucene.util.AbstractBeforeAfterRule$1.evaluate(AbstractBeforeAfterRule.java:45)
	at com.carrotsearch.randomizedtesting.rules.StatementAdapter.evaluate(StatementAdapter.java:36)
	at org.apache.lucene.util.TestRuleStoreClassName$1.evaluate(TestRuleStoreClassName.java:41)
	at com.carrotsearch.randomizedtesting.rules.NoShadowingOrOverridesOnMethodsRule$1.evaluate(NoShadowingOrOverridesOnMethodsRule.java:40)
	at com.carrotsearch.randomizedtesting.rules.NoShadowingOrOverridesOnMethodsRule$1.evaluate(NoShadowingOrOverridesOnMethodsRule.java:40)
	at com.carrotsearch.randomizedtesting.rules.StatementAdapter.evaluate(StatementAdapter.java:36)
	at com.carrotsearch.randomizedtesting.rules.StatementAdapter.evaluate(StatementAdapter.java:36)
	at org.apache.lucene.util.TestRuleAssertionsRequired$1.evaluate(TestRuleAssertionsRequired.java:53)
	at org.apache.lucene.util.TestRuleMarkFailure$1.evaluate(TestRuleMarkFailure.java:47)
	at org.apache.lucene.util.TestRuleIgnoreAfterMaxFailures$1.evaluate(TestRuleIgnoreAfterMaxFailures.java:64)
	at org.apache.lucene.util.TestRuleIgnoreTestSuites$1.evaluate(TestRuleIgnoreTestSuites.java:54)
	at com.carrotsearch.randomizedtesting.rules.StatementAdapter.evaluate(StatementAdapter.java:36)
	at com.carrotsearch.randomizedtesting.ThreadLeakControl$StatementRunner.run(ThreadLeakControl.java:368)
	at java.base/java.lang.Thread.run(Thread.java:844)


FAILED:  junit.framework.TestSuite.org.apache.solr.handler.component.InfixSuggestersTest

Error Message:
Could not remove the following files (in the order of attempts):    C:\Users\jenkins\workspace\Lucene-Solr-7.x-Windows\solr\build\solr-core\test\J1\temp\solr.handler.component.InfixSuggestersTest_8ADD837FD715799D-001\init-core-data-001: java.nio.file.AccessDeniedException: C:\Users\jenkins\workspace\Lucene-Solr-7.x-Windows\solr\build\solr-core\test\J1\temp\solr.handler.component.InfixSuggestersTest_8ADD837FD715799D-001\init-core-data-001    C:\Users\jenkins\workspace\Lucene-Solr-7.x-Windows\solr\build\solr-core\test\J1\temp\solr.handler.component.InfixSuggestersTest_8ADD837FD715799D-001: java.nio.file.DirectoryNotEmptyException: C:\Users\jenkins\workspace\Lucene-Solr-7.x-Windows\solr\build\solr-core\test\J1\temp\solr.handler.component.InfixSuggestersTest_8ADD837FD715799D-001 

Stack Trace:
java.io.IOException: Could not remove the following files (in the order of attempts):
   C:\Users\jenkins\workspace\Lucene-Solr-7.x-Windows\solr\build\solr-core\test\J1\temp\solr.handler.component.InfixSuggestersTest_8ADD837FD715799D-001\init-core-data-001: java.nio.file.AccessDeniedException: C:\Users\jenkins\workspace\Lucene-Solr-7.x-Windows\solr\build\solr-core\test\J1\temp\solr.handler.component.InfixSuggestersTest_8ADD837FD715799D-001\init-core-data-001
   C:\Users\jenkins\workspace\Lucene-Solr-7.x-Windows\solr\build\solr-core\test\J1\temp\solr.handler.component.InfixSuggestersTest_8ADD837FD715799D-001: java.nio.file.DirectoryNotEmptyException: C:\Users\jenkins\workspace\Lucene-Solr-7.x-Windows\solr\build\solr-core\test\J1\temp\solr.handler.component.InfixSuggestersTest_8ADD837FD715799D-001

	at __randomizedtesting.SeedInfo.seed([8ADD837FD715799D]:0)
	at org.apache.lucene.util.IOUtils.rm(IOUtils.java:329)
	at org.apache.lucene.util.TestRuleTemporaryFilesCleanup.afterAlways(TestRuleTemporaryFilesCleanup.java:216)
	at com.carrotsearch.randomizedtesting.rules.TestRuleAdapter$1.afterAlways(TestRuleAdapter.java:31)
	at com.carrotsearch.randomizedtesting.rules.StatementAdapter.evaluate(StatementAdapter.java:43)
	at com.carrotsearch.randomizedtesting.rules.StatementAdapter.evaluate(StatementAdapter.java:36)
	at org.apache.lucene.util.TestRuleAssertionsRequired$1.evaluate(TestRuleAssertionsRequired.java:53)
	at org.apache.lucene.util.TestRuleMarkFailure$1.evaluate(TestRuleMarkFailure.java:47)
	at org.apache.lucene.util.TestRuleIgnoreAfterMaxFailures$1.evaluate(TestRuleIgnoreAfterMaxFailures.java:64)
	at org.apache.lucene.util.TestRuleIgnoreTestSuites$1.evaluate(TestRuleIgnoreTestSuites.java:54)
	at com.carrotsearch.randomizedtesting.rules.StatementAdapter.evaluate(StatementAdapter.java:36)
	at com.carrotsearch.randomizedtesting.ThreadLeakControl$StatementRunner.run(ThreadLeakControl.java:368)
	at java.base/java.lang.Thread.run(Thread.java:844)




Build Log:
[...truncated 11626 lines...]
   [junit4] Suite: org.apache.solr.handler.admin.MetricsHandlerTest
   [junit4]   2> Creating dataDir: C:\Users\jenkins\workspace\Lucene-Solr-7.x-Windows\solr\build\solr-core\test\J0\temp\solr.handler.admin.MetricsHandlerTest_8ADD837FD715799D-001\init-core-data-001
   [junit4]   2> 839664 WARN  (SUITE-MetricsHandlerTest-seed#[8ADD837FD715799D]-worker) [    ] o.a.s.SolrTestCaseJ4 startTrackingSearchers: numOpens=1 numCloses=1
   [junit4]   2> 839665 INFO  (SUITE-MetricsHandlerTest-seed#[8ADD837FD715799D]-worker) [    ] o.a.s.SolrTestCaseJ4 Using TrieFields (NUMERIC_POINTS_SYSPROP=false) w/NUMERIC_DOCVALUES_SYSPROP=false
   [junit4]   2> 839667 INFO  (SUITE-MetricsHandlerTest-seed#[8ADD837FD715799D]-worker) [    ] o.a.s.SolrTestCaseJ4 Randomized ssl (false) and clientAuth (false) via: @org.apache.solr.util.RandomizeSSL(reason="", value=0.0/0.0, ssl=0.0/0.0, clientAuth=0.0/0.0)
   [junit4]   2> 839667 INFO  (SUITE-MetricsHandlerTest-seed#[8ADD837FD715799D]-worker) [    ] o.a.s.SolrTestCaseJ4 ####initCore
   [junit4]   2> 839668 INFO  (SUITE-MetricsHandlerTest-seed#[8ADD837FD715799D]-worker) [    ] o.a.s.c.SolrResourceLoader [null] Added 2 libs to classloader, from paths: [/C:/Users/jenkins/workspace/Lucene-Solr-7.x-Windows/solr/core/src/test-files/solr/collection1/lib, /C:/Users/jenkins/workspace/Lucene-Solr-7.x-Windows/solr/core/src/test-files/solr/collection1/lib/classes]
   [junit4]   2> 839723 INFO  (SUITE-MetricsHandlerTest-seed#[8ADD837FD715799D]-worker) [    ] o.a.s.c.SolrConfig Using Lucene MatchVersion: 7.1.0
   [junit4]   2> 839764 INFO  (SUITE-MetricsHandlerTest-seed#[8ADD837FD715799D]-worker) [    ] o.a.s.s.IndexSchema [null] Schema name=test
   [junit4]   2> 839876 INFO  (SUITE-MetricsHandlerTest-seed#[8ADD837FD715799D]-worker) [    ] o.a.s.s.IndexSchema Loaded schema test/1.0 with uniqueid field id
   [junit4]   2> 839961 INFO  (SUITE-MetricsHandlerTest-seed#[8ADD837FD715799D]-worker) [    ] o.a.s.m.r.SolrJmxReporter JMX monitoring for 'solr.node' (registry 'solr.node') enabled at server: com.sun.jmx.mbeanserver.JmxMBeanServer@1979d0f
   [junit4]   2> 839965 INFO  (SUITE-MetricsHandlerTest-seed#[8ADD837FD715799D]-worker) [    ] o.a.s.m.r.SolrJmxReporter JMX monitoring for 'solr.jvm' (registry 'solr.jvm') enabled at server: com.sun.jmx.mbeanserver.JmxMBeanServer@1979d0f
   [junit4]   2> 839965 INFO  (SUITE-MetricsHandlerTest-seed#[8ADD837FD715799D]-worker) [    ] o.a.s.m.r.SolrJmxReporter JMX monitoring for 'solr.jetty' (registry 'solr.jetty') enabled at server: com.sun.jmx.mbeanserver.JmxMBeanServer@1979d0f
   [junit4]   2> 839968 INFO  (coreLoadExecutor-4173-thread-1) [    ] o.a.s.c.SolrResourceLoader [null] Added 2 libs to classloader, from paths: [/C:/Users/jenkins/workspace/Lucene-Solr-7.x-Windows/solr/core/src/test-files/solr/collection1/lib, /C:/Users/jenkins/workspace/Lucene-Solr-7.x-Windows/solr/core/src/test-files/solr/collection1/lib/classes]
   [junit4]   2> 840013 INFO  (coreLoadExecutor-4173-thread-1) [    ] o.a.s.c.SolrConfig Using Lucene MatchVersion: 7.1.0
   [junit4]   2> 840037 INFO  (coreLoadExecutor-4173-thread-1) [    ] o.a.s.s.IndexSchema [collection1] Schema name=test
   [junit4]   2> 840164 INFO  (coreLoadExecutor-4173-thread-1) [    ] o.a.s.s.IndexSchema Loaded schema test/1.0 with uniqueid field id
   [junit4]   2> 840185 INFO  (coreLoadExecutor-4173-thread-1) [    ] o.a.s.c.CoreContainer Creating SolrCore 'collection1' using configuration from instancedir C:\Users\jenkins\workspace\Lucene-Solr-7.x-Windows\solr\core\src\test-files\solr\collection1, trusted=true
   [junit4]   2> 840185 INFO  (coreLoadExecutor-4173-thread-1) [    ] o.a.s.m.r.SolrJmxReporter JMX monitoring for 'solr.core.collection1' (registry 'solr.core.collection1') enabled at server: com.sun.jmx.mbeanserver.JmxMBeanServer@1979d0f
   [junit4]   2> 840185 INFO  (coreLoadExecutor-4173-thread-1) [    ] o.a.s.c.SolrCore solr.RecoveryStrategy.Builder
   [junit4]   2> 840185 INFO  (coreLoadExecutor-4173-thread-1) [    ] o.a.s.c.SolrCore [[collection1] ] Opening new SolrCore at [C:\Users\jenkins\workspace\Lucene-Solr-7.x-Windows\solr\core\src\test-files\solr\collection1], dataDir=[C:\Users\jenkins\workspace\Lucene-Solr-7.x-Windows\solr\build\solr-core\test\J0\temp\solr.handler.admin.MetricsHandlerTest_8ADD837FD715799D-001\init-core-data-001\]
   [junit4]   2> 840189 INFO  (coreLoadExecutor-4173-thread-1) [    ] o.a.s.u.RandomMergePolicy RandomMergePolicy wrapping class org.apache.lucene.index.TieredMergePolicy: [TieredMergePolicy: maxMergeAtOnce=11, maxMergeAtOnceExplicit=39, maxMergedSegmentMB=71.333984375, floorSegmentMB=1.685546875, forceMergeDeletesPctAllowed=29.5928116800228, segmentsPerTier=28.0, maxCFSSegmentSizeMB=8.796093022207999E12, noCFSRatio=1.0
   [junit4]   2> 840348 INFO  (coreLoadExecutor-4173-thread-1) [    ] o.a.s.u.UpdateHandler Using UpdateLog implementation: org.apache.solr.update.UpdateLog
   [junit4]   2> 840348 INFO  (coreLoadExecutor-4173-thread-1) [    ] o.a.s.u.UpdateLog Initializing UpdateLog: dataDir= defaultSyncLevel=FLUSH numRecordsToKeep=100 maxNumLogsToKeep=10 numVersionBuckets=65536
   [junit4]   2> 840350 INFO  (coreLoadExecutor-4173-thread-1) [    ] o.a.s.u.CommitTracker Hard AutoCommit: disabled
   [junit4]   2> 840350 INFO  (coreLoadExecutor-4173-thread-1) [    ] o.a.s.u.CommitTracker Soft AutoCommit: disabled
   [junit4]   2> 840351 INFO  (coreLoadExecutor-4173-thread-1) [    ] o.a.s.u.RandomMergePolicy RandomMergePolicy wrapping class org.apache.lucene.index.LogByteSizeMergePolicy: [LogByteSizeMergePolicy: minMergeSize=1677721, mergeFactor=45, maxMergeSize=2147483648, maxMergeSizeForForcedMerge=9223372036854775807, calibrateSizeByDeletes=false, maxMergeDocs=2147483647, maxCFSSegmentSizeMB=8.796093022207999E12, noCFSRatio=0.0]
   [junit4]   2> 840351 INFO  (coreLoadExecutor-4173-thread-1) [    ] o.a.s.s.SolrIndexSearcher Opening [Searcher@2df0f2[collection1] main]
   [junit4]   2> 840353 INFO  (coreLoadExecutor-4173-thread-1) [    ] o.a.s.h.c.SpellCheckComponent Initializing spell checkers
   [junit4]   2> 840364 INFO  (coreLoadExecutor-4173-thread-1) [    ] o.a.s.s.DirectSolrSpellChecker init: {name=direct,classname=DirectSolrSpellChecker,field=lowerfilt,minQueryLength=3}
   [junit4]   2> 840437 INFO  (coreLoadExecutor-4173-thread-1) [    ] o.a.s.h.ReplicationHandler Commits will be reserved for  10000
   [junit4]   2> 840439 INFO  (coreLoadExecutor-4173-thread-1) [    ] o.a.s.u.UpdateLog Could not find max version in index or recent updates, using new clock 1572300446050025472
   [junit4]   2> 840440 INFO  (searcherExecutor-4174-thread-1) [    ] o.a.s.h.c.SpellCheckComponent Loading spell index for spellchecker: default
   [junit4]   2> 840442 INFO  (searcherExecutor-4174-thread-1) [    ] o.a.s.h.c.SpellCheckComponent Loading spell index for spellchecker: direct
   [junit4]   2> 840442 INFO  (searcherExecutor-4174-thread-1) [    ] o.a.s.h.c.SpellCheckComponent Loading spell index for spellchecker: wordbreak
   [junit4]   2> 840442 INFO  (searcherExecutor-4174-thread-1) [    ] o.a.s.h.c.SpellCheckComponent Loading spell index for spellchecker: multipleFields
   [junit4]   2> 840442 INFO  (SUITE-MetricsHandlerTest-seed#[8ADD837FD715799D]-worker) [    ] o.a.s.SolrTestCaseJ4 ####initCore end
   [junit4]   2> 840442 INFO  (searcherExecutor-4174-thread-1) [    ] o.a.s.h.c.SpellCheckComponent Loading spell index for spellchecker: jarowinkler
   [junit4]   2> 840445 INFO  (searcherExecutor-4174-thread-1) [    ] o.a.s.h.c.SpellCheckComponent Loading spell index for spellchecker: external
   [junit4]   2> 840448 INFO  (TEST-MetricsHandlerTest.testPropertyFilter-seed#[8ADD837FD715799D]) [    ] o.a.s.SolrTestCaseJ4 ###Starting testPropertyFilter
   [junit4]   2> 840448 INFO  (searcherExecutor-4174-thread-1) [    ] o.a.s.h.c.SpellCheckComponent Loading spell index for spellchecker: freq
   [junit4]   2> 840449 INFO  (searcherExecutor-4174-thread-1) [    ] o.a.s.h.c.SpellCheckComponent Loading spell index for spellchecker: fqcn
   [junit4]   2> 840450 INFO  (TEST-MetricsHandlerTest.testPropertyFilter-seed#[8ADD837FD715799D]) [    ] o.a.s.SolrTestCaseJ4 ###Ending testPropertyFilter
   [junit4]   2> 840451 INFO  (searcherExecutor-4174-thread-1) [    ] o.a.s.h.c.SpellCheckComponent Loading spell index for spellchecker: perDict
   [junit4]   2> NOTE: reproduce with: ant test  -Dtestcase=MetricsHandlerTest -Dtests.method=testPropertyFilter -Dtests.seed=8ADD837FD715799D -Dtests.slow=true -Dtests.locale=lg-UG -Dtests.timezone=Etc/GMT+1 -Dtests.asserts=true -Dtests.file.encoding=US-ASCII
   [junit4] FAILURE 0.01s J0 | MetricsHandlerTest.testPropertyFilter <<<
   [junit4]    > Throwable #1: java.lang.AssertionError
   [junit4]    > 	at __randomizedtesting.SeedInfo.seed([8ADD837FD715799D:E8B07D3E189B19A3]:0)
   [junit4]    > 	at org.apache.solr.handler.admin.MetricsHandlerTest.testPropertyFilter(MetricsHandlerTest.java:201)
   [junit4]    > 	at java.base/jdk.internal.reflect.NativeMethodAccessorImpl.invoke0(Native Method)
   [junit4]    > 	at java.base/jdk.internal.reflect.NativeMethodAccessorImpl.invoke(NativeMethodAccessorImpl.java:62)
   [junit4]    > 	at java.base/jdk.internal.reflect.DelegatingMethodAccessorImpl.invoke(DelegatingMethodAccessorImpl.java:43)
   [junit4]    > 	at java.base/java.lang.reflect.Method.invoke(Method.java:564)
   [junit4]    > 	at java.base/java.lang.Thread.run(Thread.java:844)
   [junit4]   2> 840452 INFO  (searcherExecutor-4174-thread-1) [    ] o.a.s.c.SolrCore [collection1] Registered new searcher Searcher@2df0f2[collection1] main{ExitableDirectoryReader(UninvertingDirectoryReader())}
   [junit4]   2> 840452 INFO  (TEST-MetricsHandlerTest.test-seed#[8ADD837FD715799D]) [    ] o.a.s.SolrTestCaseJ4 ###Starting test
   [junit4]   2> 840471 INFO  (TEST-MetricsHandlerTest.test-seed#[8ADD837FD715799D]) [    ] o.a.s.c.TransientSolrCoreCacheDefault Allocating transient cache for 2147483647 transient cores
   [junit4]   2> 840554 INFO  (TEST-MetricsHandlerTest.test-seed#[8ADD837FD715799D]) [    ] o.a.s.SolrTestCaseJ4 ###Ending test
   [junit4]   2> 840558 INFO  (TEST-MetricsHandlerTest.testCompact-seed#[8ADD837FD715799D]) [    ] o.a.s.SolrTestCaseJ4 ###Starting testCompact
   [junit4]   2> 840573 INFO  (TEST-MetricsHandlerTest.testCompact-seed#[8ADD837FD715799D]) [    ] o.a.s.SolrTestCaseJ4 ###Ending testCompact
   [junit4]   2> 840573 INFO  (SUITE-MetricsHandlerTest-seed#[8ADD837FD715799D]-worker) [    ] o.a.s.SolrTestCaseJ4 ###deleteCore
   [junit4]   2> 840573 INFO  (SUITE-MetricsHandlerTest-seed#[8ADD837FD715799D]-worker) [    ] o.a.s.c.CoreContainer Shutting down CoreContainer instance=5883298
   [junit4]   2> 840573 INFO  (SUITE-MetricsHandlerTest-seed#[8ADD837FD715799D]-worker) [    ] o.a.s.m.SolrMetricManager Closing metric reporters for registry=solr.node, tag=null
   [junit4]   2> 840575 INFO  (SUITE-MetricsHandlerTest-seed#[8ADD837FD715799D]-worker) [    ] o.a.s.m.SolrMetricManager Closing metric reporters for registry=solr.jvm, tag=null
   [junit4]   2> 840576 INFO  (SUITE-MetricsHandlerTest-seed#[8ADD837FD715799D]-worker) [    ] o.a.s.m.SolrMetricManager Closing metric reporters for registry=solr.jetty, tag=null
   [junit4]   2> 840577 INFO  (coreCloseExecutor-4179-thread-1) [    ] o.a.s.c.SolrCore [collection1]  CLOSING SolrCore org.apache.solr.core.SolrCore@9263d5
   [junit4]   2> 840578 INFO  (coreCloseExecutor-4179-thread-1) [    ] o.a.s.m.SolrMetricManager Closing metric reporters for registry=solr.core.collection1, tag=9593813
   [junit4]   2> NOTE: leaving temporary files on disk at: C:\Users\jenkins\workspace\Lucene-Solr-7.x-Windows\solr\build\solr-core\test\J0\temp\solr.handler.admin.MetricsHandlerTest_8ADD837FD715799D-001
   [junit4]   2> NOTE: test params are: codec=Asserting(Lucene70), sim=RandomSimilarity(queryNorm=true): {}, locale=lg-UG, timezone=Etc/GMT+1
   [junit4]   2> NOTE: Windows 10 10.0 x86/Oracle Corporation 9-ea (32-bit)/cpus=3,threads=1,free=137280160,total=309383168
   [junit4]   2> NOTE: All tests run in this JVM: [TestPHPSerializedResponseWriter, DistributedFacetPivotLargeTest, DefaultValueUpdateProcessorTest, TestFieldSortValues, SolrGangliaReporterTest, URLClassifyProcessorTest, TestReplicationHandlerBackup, MergeStrategyTest, DistributedQueryComponentOptimizationTest, TestRestoreCore, TestEmbeddedSolrServerSchemaAPI, TestManagedSchemaThreadSafety, CollectionsAPISolrJTest, ClusterStateTest, UnloadDistributedZkTest, DeleteInactiveReplicaTest, TestMaxTokenLenTokenizer, MinimalSchemaTest, SpellCheckCollatorWithCollapseTest, ClusterStateUpdateTest, TestConfigReload, TestSchemaSimilarityResource, TestSubQueryTransformerCrossCore, DeleteNodeTest, V2ApiIntegrationTest, TestOmitPositions, TestDefaultStatsCache, ChaosMonkeyNothingIsSafeTest, CdcrUpdateLogTest, QueryElevationComponentTest, CoreAdminCreateDiscoverTest, TestIBSimilarityFactory, FacetPivotSmallTest, TestLeaderElectionWithEmptyReplica, TestRandomFlRTGCloud, SolrJmxReporterTest, TestSolrConfigHandlerConcurrent, WordBreakSolrSpellCheckerTest, HdfsRecoverLeaseTest, RequestHandlersTest, TestNamedUpdateProcessors, BlockJoinFacetDistribTest, TestBackupRepositoryFactory, TestStressUserVersions, SharedFSAutoReplicaFailoverTest, TestConfigSetsAPIExclusivity, TestReloadDeadlock, TestConfigSets, TestSolrCloudWithHadoopAuthPlugin, SecurityConfHandlerTest, SpatialFilterTest, DocValuesMissingTest, RecoveryZkTest, SortByFunctionTest, DistributedSpellCheckComponentTest, AlternateDirectoryTest, TestUtils, ResponseHeaderTest, TestCodecSupport, FastVectorHighlighterTest, TestCloudNestedDocsSort, TestPhraseSuggestions, TestCursorMarkWithoutUniqueKey, TestClassNameShortening, TestQuerySenderListener, HdfsUnloadDistributedZkTest, SimpleMLTQParserTest, SearchHandlerTest, TestStressRecovery, ParsingFieldUpdateProcessorsTest, TestSSLRandomization, HLLSerializationTest, TestScoreJoinQPNoScore, TestJmxIntegration, TestTlogReplica, TestMultiWordSynonyms, TimeZoneUtilsTest, TestStressInPlaceUpdates, PrimUtilsTest, TestBinaryField, PeerSyncReplicationTest, TestGroupingSearch, TestCollectionAPIs, SortSpecParsingTest, TestRawTransformer, MoveReplicaTest, TestRebalanceLeaders, CSVRequestHandlerTest, ResponseLogComponentTest, TestLazyCores, XmlUpdateRequestHandlerTest, TestLegacyFieldCache, TestMinMaxOnMultiValuedField, StatsReloadRaceTest, TestMaxScoreQueryParser, HighlighterTest, DirectUpdateHandlerTest, TestJsonFacetRefinement, TestFieldCacheVsDocValues, TestUnifiedSolrHighlighter, TestSerializedLuceneMatchVersion, TestQuerySenderNoQuery, HdfsCollectionsAPIDistributedZkTest, RequiredFieldsTest, ExplicitHLLTest, CoreMergeIndexesAdminHandlerTest, SimpleCollectionCreateDeleteTest, TestCollationFieldDocValues, TestTestInjection, HardAutoCommitTest, TestOverriddenPrefixQueryForCustomFieldType, TestSweetSpotSimilarityFactory, TestSolrCloudWithDelegationTokens, TestUseDocValuesAsStored, ResourceLoaderTest, SuggesterWFSTTest, TestGraphMLResponseWriter, TestExtendedDismaxParser, TestSimpleTextCodec, TestNumericRangeQuery32, TestSchemaManager, ChaosMonkeySafeLeaderWithPullReplicasTest, PrimitiveFieldTypeTest, OverriddenZkACLAndCredentialsProvidersTest, IndexBasedSpellCheckerTest, BasicAuthStandaloneTest, DirectUpdateHandlerOptimizeTest, SolrIndexSplitterTest, TestTolerantSearch, TestChildDocTransformer, TestFunctionQuery, HdfsLockFactoryTest, UUIDUpdateProcessorFallbackTest, ReplicaListTransformerTest, DocExpirationUpdateProcessorFactoryTest, MetricsHandlerTest]
   [junit4] Completed [229/727 (1!)] on J0 in 0.94s, 3 tests, 1 failure <<< FAILURES!

[...truncated 1244 lines...]
   [junit4] Suite: org.apache.solr.handler.component.InfixSuggestersTest
   [junit4]   2> Creating dataDir: C:\Users\jenkins\workspace\Lucene-Solr-7.x-Windows\solr\build\solr-core\test\J1\temp\solr.handler.component.InfixSuggestersTest_8ADD837FD715799D-001\init-core-data-001
   [junit4]   2> 2851329 WARN  (SUITE-InfixSuggestersTest-seed#[8ADD837FD715799D]-worker) [    ] o.a.s.SolrTestCaseJ4 startTrackingSearchers: numOpens=10 numCloses=10
   [junit4]   2> 2851329 INFO  (SUITE-InfixSuggestersTest-seed#[8ADD837FD715799D]-worker) [    ] o.a.s.SolrTestCaseJ4 Using TrieFields (NUMERIC_POINTS_SYSPROP=false) w/NUMERIC_DOCVALUES_SYSPROP=false
   [junit4]   2> 2851331 INFO  (SUITE-InfixSuggestersTest-seed#[8ADD837FD715799D]-worker) [    ] o.a.s.SolrTestCaseJ4 Randomized ssl (false) and clientAuth (false) via: @org.apache.solr.util.RandomizeSSL(reason="", value=0.0/0.0, ssl=0.0/0.0, clientAuth=0.0/0.0)
   [junit4]   2> 2851331 INFO  (SUITE-InfixSuggestersTest-seed#[8ADD837FD715799D]-worker) [    ] o.a.s.SolrTestCaseJ4 ####initCore
   [junit4]   2> 2851331 INFO  (SUITE-InfixSuggestersTest-seed#[8ADD837FD715799D]-worker) [    ] o.a.s.c.SolrResourceLoader [null] Added 2 libs to classloader, from paths: [/C:/Users/jenkins/workspace/Lucene-Solr-7.x-Windows/solr/core/src/test-files/solr/collection1/lib, /C:/Users/jenkins/workspace/Lucene-Solr-7.x-Windows/solr/core/src/test-files/solr/collection1/lib/classes]
   [junit4]   2> 2851354 INFO  (SUITE-InfixSuggestersTest-seed#[8ADD837FD715799D]-worker) [    ] o.a.s.c.SolrConfig Using Lucene MatchVersion: 7.1.0
   [junit4]   2> 2851366 INFO  (SUITE-InfixSuggestersTest-seed#[8ADD837FD715799D]-worker) [    ] o.a.s.s.IndexSchema [null] Schema name=test
   [junit4]   2> 2851463 INFO  (SUITE-InfixSuggestersTest-seed#[8ADD837FD715799D]-worker) [    ] o.a.s.s.IndexSchema Loaded schema test/1.0 with uniqueid field id
   [junit4]   2> 2851518 INFO  (SUITE-InfixSuggestersTest-seed#[8ADD837FD715799D]-worker) [    ] o.a.s.m.r.SolrJmxReporter JMX monitoring for 'solr.node' (registry 'solr.node') enabled at server: com.sun.jmx.mbeanserver.JmxMBeanServer@31c2c6
   [junit4]   2> 2851522 INFO  (SUITE-InfixSuggestersTest-seed#[8ADD837FD715799D]-worker) [    ] o.a.s.m.r.SolrJmxReporter JMX monitoring for 'solr.jvm' (registry 'solr.jvm') enabled at server: com.sun.jmx.mbeanserver.JmxMBeanServer@31c2c6
   [junit4]   2> 2851522 INFO  (SUITE-InfixSuggestersTest-seed#[8ADD837FD715799D]-worker) [    ] o.a.s.m.r.SolrJmxReporter JMX monitoring for 'solr.jetty' (registry 'solr.jetty') enabled at server: com.sun.jmx.mbeanserver.JmxMBeanServer@31c2c6
   [junit4]   2> 2851525 INFO  (coreLoadExecutor-10872-thread-1) [    ] o.a.s.c.SolrResourceLoader [null] Added 2 libs to classloader, from paths: [/C:/Users/jenkins/workspace/Lucene-Solr-7.x-Windows/solr/core/src/test-files/solr/collection1/lib, /C:/Users/jenkins/workspace/Lucene-Solr-7.x-Windows/solr/core/src/test-files/solr/collection1/lib/classes]
   [junit4]   2> 2851554 INFO  (coreLoadExecutor-10872-thread-1) [    ] o.a.s.c.SolrConfig Using Lucene MatchVersion: 7.1.0
   [junit4]   2> 2851566 INFO  (coreLoadExecutor-10872-thread-1) [    ] o.a.s.s.IndexSchema [collection1] Schema name=test
   [junit4]   2> 2851665 INFO  (coreLoadExecutor-10872-thread-1) [    ] o.a.s.s.IndexSchema Loaded schema test/1.0 with uniqueid field id
   [junit4]   2> 2851679 INFO  (coreLoadExecutor-10872-thread-1) [    ] o.a.s.c.CoreContainer Creating SolrCore 'collection1' using configuration from instancedir C:\Users\jenkins\workspace\Lucene-Solr-7.x-Windows\solr\core\src\test-files\solr\collection1, trusted=true
   [junit4]   2> 2851680 INFO  (coreLoadExecutor-10872-thread-1) [    ] o.a.s.m.r.SolrJmxReporter JMX monitoring for 'solr.core.collection1' (registry 'solr.core.collection1') enabled at server: com.sun.jmx.mbeanserver.JmxMBeanServer@31c2c6
   [junit4]   2> 2851680 INFO  (coreLoadExecutor-10872-thread-1) [    ] o.a.s.c.SolrCore solr.RecoveryStrategy.Builder
   [junit4]   2> 2851680 INFO  (coreLoadExecutor-10872-thread-1) [    ] o.a.s.c.SolrCore [[collection1] ] Opening new SolrCore at [C:\Users\jenkins\workspace\Lucene-Solr-7.x-Windows\solr\core\src\test-files\solr\collection1], dataDir=[C:\Users\jenkins\workspace\Lucene-Solr-7.x-Windows\solr\build\solr-core\test\J1\temp\solr.handler.component.InfixSuggestersTest_8ADD837FD715799D-001\init-core-data-001\]
   [junit4]   2> 2851685 INFO  (coreLoadExecutor-10872-thread-1) [    ] o.a.s.u.RandomMergePolicy RandomMergePolicy wrapping class org.apache.lucene.index.TieredMergePolicy: [TieredMergePolicy: maxMergeAtOnce=45, maxMergeAtOnceExplicit=16, maxMergedSegmentMB=34.525390625, floorSegmentMB=0.232421875, forceMergeDeletesPctAllowed=12.231470141888058, segmentsPerTier=43.0, maxCFSSegmentSizeMB=8.796093022207999E12, noCFSRatio=0.0
   [junit4]   2> 2851773 INFO  (coreLoadExecutor-10872-thread-1) [    ] o.a.s.u.CommitTracker Hard AutoCommit: disabled
   [junit4]   2> 2851773 INFO  (coreLoadExecutor-10872-thread-1) [    ] o.a.s.u.CommitTracker Soft AutoCommit: disabled
   [junit4]   2> 2851774 INFO  (coreLoadExecutor-10872-thread-1) [    ] o.a.s.u.RandomMergePolicy RandomMergePolicy wrapping class org.apache.lucene.index.TieredMergePolicy: [TieredMergePolicy: maxMergeAtOnce=48, maxMergeAtOnceExplicit=29, maxMergedSegmentMB=23.234375, floorSegmentMB=1.9326171875, forceMergeDeletesPctAllowed=16.560985904948385, segmentsPerTier=50.0, maxCFSSegmentSizeMB=8.796093022207999E12, noCFSRatio=0.7103143619728762
   [junit4]   2> 2851775 INFO  (coreLoadExecutor-10872-thread-1) [    ] o.a.s.s.SolrIndexSearcher Opening [Searcher@17b98d4[collection1] main]
   [junit4]   2> 2851775 WARN  (coreLoadExecutor-10872-thread-1) [    ] o.a.s.r.ManagedResourceStorage Cannot write to config directory C:\Users\jenkins\workspace\Lucene-Solr-7.x-Windows\solr\core\src\test-files\solr\collection1\conf; switching to use InMemory storage instead.
   [junit4]   2> 2851776 INFO  (coreLoadExecutor-10872-thread-1) [    ] o.a.s.h.c.SuggestComponent Initializing SuggestComponent
   [junit4]   2> 2851776 INFO  (coreLoadExecutor-10872-thread-1) [    ] o.a.s.s.s.SolrSuggester init: {name=shortRandomAnalyzingInfixSuggester,lookupImpl=AnalyzingInfixLookupFactory,dictionaryImpl=RandomTestDictionaryFactory,randDictMaxItems=100,indexPath=short_random_analyzing_infix_suggester,suggestAnalyzerFieldType=text,buildOnCommit=false,buildOnStartup=false}
   [junit4]   2> 2851789 INFO  (coreLoadExecutor-10872-thread-1) [    ] o.a.s.s.s.SolrSuggester Dictionary loaded with params: {name=shortRandomAnalyzingInfixSuggester,lookupImpl=AnalyzingInfixLookupFactory,dictionaryImpl=RandomTestDictionaryFactory,randDictMaxItems=100,indexPath=short_random_analyzing_infix_suggester,suggestAnalyzerFieldType=text,buildOnCommit=false,buildOnStartup=false}
   [junit4]   2> 2851789 INFO  (coreLoadExecutor-10872-thread-1) [    ] o.a.s.h.c.SuggestComponent Initializing SuggestComponent
   [junit4]   2> 2851789 INFO  (coreLoadExecutor-10872-thread-1) [    ] o.a.s.s.s.SolrSuggester init: {name=longRandomAnalyzingInfixSuggester,lookupImpl=AnalyzingInfixLookupFactory,dictionaryImpl=RandomTestDictionaryFactory,randDictMaxItems=100000,indexPath=long_random_analyzing_infix_suggester,suggestAnalyzerFieldType=text,buildOnCommit=false,buildOnStartup=false}
   [junit4]   2> 2851790 INFO  (coreLoadExecutor-10872-thread-1) [    ] o.a.s.s.s.SolrSuggester Dictionary loaded with params: {name=longRandomAnalyzingInfixSuggester,lookupImpl=AnalyzingInfixLookupFactory,dictionaryImpl=RandomTestDictionaryFactory,randDictMaxItems=100000,indexPath=long_random_analyzing_infix_suggester,suggestAnalyzerFieldType=text,buildOnCommit=false,buildOnStartup=false}
   [junit4]   2> 2851790 INFO  (coreLoadExecutor-10872-thread-1) [    ] o.a.s.h.c.SuggestComponent Initializing SuggestComponent
   [junit4]   2> 2851790 INFO  (coreLoadExecutor-10872-thread-1) [    ] o.a.s.s.s.SolrSuggester init: {name=shortRandomBlendedInfixSuggester,lookupImpl=BlendedInfixLookupFactory,dictionaryImpl=RandomTestDictionaryFactory,randDictMaxItems=100,blenderType=position_linear,suggestAnalyzerFieldType=text,indexPath=short_random_blended_infix_suggester,highlight=true,buildOnStartup=false,buildOnCommit=false}
   [junit4]   2> 2851791 INFO  (coreLoadExecutor-10872-thread-1) [    ] o.a.s.s.s.SolrSuggester Dictionary loaded with params: {name=shortRandomBlendedInfixSuggester,lookupImpl=BlendedInfixLookupFactory,dictionaryImpl=RandomTestDictionaryFactory,randDictMaxItems=100,blenderType=position_linear,suggestAnalyzerFieldType=text,indexPath=short_random_blended_infix_suggester,highlight=true,buildOnStartup=false,buildOnCommit=false}
   [junit4]   2> 2851791 INFO  (coreLoadExecutor-10872-thread-1) [    ] o.a.s.h.ReplicationHandler Commits will be reserved for  10000
   [junit4]   2> 2851793 INFO  (searcherExecutor-10873-thread-1) [    ] o.a.s.c.SolrCore [collection1] Registered new searcher Searcher@17b98d4[collection1] main{ExitableDirectoryReader(UninvertingDirectoryReader())}
   [junit4]   2> 2851794 INFO  (SUITE-InfixSuggestersTest-seed#[8ADD837FD715799D]-worker) [    ] o.a.s.SolrTestCaseJ4 ####initCore end
   [junit4]   2> 2851796 INFO  (TEST-InfixSuggestersTest.testTwoSuggestersBuildThenReload-seed#[8ADD837FD715799D]) [    ] o.a.s.SolrTestCaseJ4 ###Starting testTwoSuggestersBuildThenReload
   [junit4]   2> 2851797 INFO  (TEST-InfixSuggestersTest.testTwoSuggestersBuildThenReload-seed#[8ADD837FD715799D]) [    ] o.a.s.h.c.SuggestComponent SuggestComponent prepare with : qt=/suggest_analyzing_infix_short_dictionary&suggest=true&suggest.buildAll=true&wt=xml
   [junit4]   2> 2851797 INFO  (TEST-InfixSuggestersTest.testTwoSuggestersBuildThenReload-seed#[8ADD837FD715799D]) [    ] o.a.s.s.s.SolrSuggester SolrSuggester.build(shortRandomAnalyzingInfixSuggester)
   [junit4]   2> 2851822 INFO  (TEST-InfixSuggestersTest.testTwoSuggestersBuildThenReload-seed#[8ADD837FD715799D]) [    ] o.a.s.s.s.RandomTestDictionaryFactory org.apache.solr.spelling.suggest.RandomTestDictionaryFactory$RandomTestDictionary.enabled.shortRandomAnalyzingInfixSuggester disabled after emitting 100 items.
   [junit4]   2> 2851866 INFO  (TEST-InfixSuggestersTest.testTwoSuggestersBuildThenReload-seed#[8ADD837FD715799D]) [    ] o.a.s.h.c.SuggestComponent SuggestComponent process with : qt=/suggest_analyzing_infix_short_dictionary&suggest=true&suggest.buildAll=true&wt=xml
   [junit4]   2> 2851866 INFO  (TEST-InfixSuggestersTest.testTwoSuggestersBuildThenReload-seed#[8ADD837FD715799D]) [    ] o.a.s.c.S.Request [collection1]  webapp=null path=null params={qt=/suggest_analyzing_infix_short_dictionary&suggest.buildAll=true&wt=xml} status=0 QTime=69
   [junit4]   2> 2851868 ERROR (TEST-InfixSuggestersTest.testTwoSuggestersBuildThenReload-seed#[8ADD837FD715799D]) [    ] o.a.s.c.CorePropertiesLocator Couldn't load core descriptor from C:\Users\jenkins\workspace\Lucene-Solr-7.x-Windows\solr\core\src\test-files\solr\collection1\core.properties:java.nio.file.NoSuchFileException: C:\Users\jenkins\workspace\Lucene-Solr-7.x-Windows\solr\core\src\test-files\solr\collection1\core.properties
   [junit4]   2> 2851869 INFO  (TEST-InfixSuggestersTest.testTwoSuggestersBuildThenReload-seed#[8ADD837FD715799D]) [    ] o.a.s.c.SolrResourceLoader [null] Added 2 libs to classloader, from paths: [/C:/Users/jenkins/workspace/Lucene-Solr-7.x-Windows/solr/core/src/test-files/solr/collection1/lib, /C:/Users/jenkins/workspace/Lucene-Solr-7.x-Windows/solr/core/src/test-files/solr/collection1/lib/classes]
   [junit4]   2> 2851914 INFO  (TEST-InfixSuggestersTest.testTwoSuggestersBuildThenReload-seed#[8ADD837FD715799D]) [    ] o.a.s.c.SolrConfig Using Lucene MatchVersion: 7.1.0
   [junit4]   2> 2851926 INFO  (TEST-InfixSuggestersTest.testTwoSuggestersBuildThenReload-seed#[8ADD837FD715799D]) [    ] o.a.s.s.IndexSchema [collection1] Schema name=test
   [junit4]   2> 2852035 INFO  (TEST-InfixSuggestersTest.testTwoSuggestersBuildThenReload-seed#[8ADD837FD715799D]) [    ] o.a.s.s.IndexSchema Loaded schema test/1.0 with uniqueid field id
   [junit4]   2> 2852049 INFO  (TEST-InfixSuggestersTest.testTwoSuggestersBuildThenReload-seed#[8ADD837FD715799D]) [    ] o.a.s.c.CoreContainer Reloading SolrCore 'collection1' using configuration from instancedir C:\Users\jenkins\workspace\Lucene-Solr-7.x-Windows\solr\core\src\test-files\solr\collection1
   [junit4]   2> 2852062 INFO  (TEST-InfixSuggestersTest.testTwoSuggestersBuildThenReload-seed#[8ADD837FD715799D]) [    ] o.a.s.m.r.SolrJmxReporter JMX monitoring for 'solr.core.collection1' (registry 'solr.core.collection1') enabled at server: com.sun.jmx.mbeanserver.JmxMBeanServer@31c2c6
   [junit4]   2> 2852063 INFO  (TEST-InfixSuggestersTest.testTwoSuggestersBuildThenReload-seed#[8ADD837FD715799D]) [    ] o.a.s.c.SolrCore [[collection1] ] Opening new SolrCore at [C:\Users\jenkins\workspace\Lucene-Solr-7.x-Windows\solr\core\src\test-files\solr\collection1], dataDir=[C:\Users\jenkins\workspace\Lucene-Solr-7.x-Windows\solr\build\solr-core\test\J1\temp\solr.handler.component.InfixSuggestersTest_8ADD837FD715799D-001\init-core-data-001\]
   [junit4]   2> 2852154 INFO  (TEST-InfixSuggestersTest.testTwoSuggestersBuildThenReload-seed#[8ADD837FD715799D]) [    ] o.a.s.u.CommitTracker Hard AutoCommit: disabled
   [junit4]   2> 2852154 INFO  (TEST-InfixSuggestersTest.testTwoSuggestersBuildThenReload-seed#[8ADD837FD715799D]) [    ] o.a.s.u.CommitTracker Soft AutoCommit: disabled
   [junit4]   2> 2852155 INFO  (TEST-InfixSuggestersTest.testTwoSuggestersBuildThenReload-seed#[8ADD837FD715799D]) [    ] o.a.s.s.SolrIndexSearcher Opening [Searcher@70e670[collection1] main]
   [junit4]   2> 2852156 WARN  (TEST-InfixSuggestersTest.testTwoSuggestersBuildThenReload-seed#[8ADD837FD715799D]) [    ] o.a.s.r.ManagedResourceStorage Cannot write to config directory C:\Users\jenkins\workspace\Lucene-Solr-7.x-Windows\solr\core\src\test-files\solr\collection1\conf; switching to use InMemory storage instead.
   [junit4]   2> 2852156 INFO  (TEST-InfixSuggestersTest.testTwoSuggestersBuildThenReload-seed#[8ADD837FD715799D]) [    ] o.a.s.h.c.SuggestComponent Initializing SuggestComponent
   [junit4]   2> 2852157 INFO  (TEST-InfixSuggestersTest.testTwoSuggestersBuildThenReload-seed#[8ADD837FD715799D]) [    ] o.a.s.s.s.SolrSuggester init: {name=shortRandomAnalyzingInfixSuggester,lookupImpl=AnalyzingInfixLookupFactory,dictionaryImpl=RandomTestDictionaryFactory,randDictMaxItems=100,indexPath=short_random_analyzing_infix_suggester,suggestAnalyzerFieldType=text,buildOnCommit=false,buildOnStartup=false}
   [junit4]   2> 2852159 INFO  (TEST-InfixSuggestersTest.testTwoSuggestersBuildThenReload-seed#[8ADD837FD715799D]) [    ] o.a.s.s.s.SolrSuggester Dictionary loaded with params: {name=shortRandomAnalyzingInfixSuggester,lookupImpl=AnalyzingInfixLookupFactory,dictionaryImpl=RandomTestDictionaryFactory,randDictMaxItems=100,indexPath=short_random_analyzing_infix_suggester,suggestAnalyzerFieldType=text,buildOnCommit=false,buildOnStartup=false}
   [junit4]   2> 2852159 INFO  (TEST-InfixSuggestersTest.testTwoSuggestersBuildThenReload-seed#[8ADD837FD715799D]) [    ] o.a.s.h.c.SuggestComponent Initializing SuggestComponent
   [junit4]   2> 2852159 INFO  (TEST-InfixSuggestersTest.testTwoSuggestersBuildThenReload-seed#[8ADD837FD715799D]) [    ] o.a.s.s.s.SolrSuggester init: {name=longRandomAnalyzingInfixSuggester,lookupImpl=AnalyzingInfixLookupFactory,dictionaryImpl=RandomTestDictionaryFactory,randDictMaxItems=100000,indexPath=long_random_analyzing_infix_suggester,suggestAnalyzerFieldType=text,buildOnCommit=false,buildOnStartup=false}
   [junit4]   2> 2852159 INFO  (TEST-InfixSuggestersTest.testTwoSuggestersBuildThenReload-seed#[8ADD837FD715799D]) [    ] o.a.s.s.s.SolrSuggester Dictionary loaded with params: {name=longRandomAnalyzingInfixSuggester,lookupImpl=AnalyzingInfixLookupFactory,dictionaryImpl=RandomTestDictionaryFactory,randDictMaxItems=100000,indexPath=long_random_analyzing_infix_suggester,suggestAnalyzerFieldType=text,buildOnCommit=false,buildOnStartup=false}
   [junit4]   2> 2852160 INFO  (TEST-InfixSuggestersTest.testTwoSuggestersBuildThenReload-seed#[8ADD837FD715799D]) [    ] o.a.s.h.c.SuggestComponent Initializing SuggestComponent
   [junit4]   2> 2852160 INFO  (TEST-InfixSuggestersTest.testTwoSuggestersBuildThenReload-seed#[8ADD837FD715799D]) [    ] o.a.s.s.s.SolrSuggester init: {name=shortRandomBlendedInfixSuggester,lookupImpl=BlendedInfixLookupFactory,dictionaryImpl=RandomTestDictionaryFactory,randDictMaxItems=100,blenderType=position_linear,suggestAnalyzerFieldType=text,indexPath=short_random_blended_infix_suggester,highlight=true,buildOnStartup=false,buildOnCommit=false}
   [junit4]   2> 2852160 INFO  (TEST-InfixSuggestersTest.testTwoSuggestersBuildThenReload-seed#[8ADD837FD715799D]) [    ] o.a.s.s.s.SolrSuggester Dictionary loaded with params: {name=shortRandomBlendedInfixSuggester,lookupImpl=BlendedInfixLookupFactory,dictionaryImpl=RandomTestDictionaryFactory,randDictMaxItems=100,blenderType=position_linear,suggestAnalyzerFieldType=text,indexPath=short_random_blended_infix_suggester,highlight=true,buildOnStartup=false,buildOnCommit=false}
   [junit4]   2> 2852160 INFO  (TEST-InfixSuggestersTest.testTwoSuggestersBuildThenReload-seed#[8ADD837FD715799D]) [    ] o.a.s.h.ReplicationHandler Commits will be reserved for  10000
   [junit4]   2> 2852163 INFO  (TEST-InfixSuggestersTest.testTwoSuggestersBuildThenReload-seed#[8ADD837FD715799D]) [    ] o.a.s.u.RandomMergePolicy RandomMergePolicy wrapping class org.apache.lucene.index.TieredMergePolicy: [TieredMergePolicy: maxMergeAtOnce=16, maxMergeAtOnceExplicit=25, maxMergedSegmentMB=33.564453125, floorSegmentMB=0.341796875, forceMergeDeletesPctAllowed=9.023266228831373, segmentsPerTier=14.0, maxCFSSegmentSizeMB=8.796093022207999E12, noCFSRatio=0.65849840933941
   [junit4]   2> 2852164 INFO  (searcherExecutor-10877-thread-1) [    ] o.a.s.c.SolrCore [collection1] Registered new searcher Searcher@70e670[collection1] main{ExitableDirectoryReader(UninvertingDirectoryReader())}
   [junit4]   2> 2852165 INFO  (TEST-InfixSuggestersTest.testTwoSuggestersBuildThenReload-seed#[8ADD837FD715799D]) [    ] o.a.s.u.DefaultSolrCoreState New IndexWriter is ready to be used.
   [junit4]   2> 2852165 INFO  (TEST-InfixSuggestersTest.testTwoSuggestersBuildThenReload-seed#[8ADD837FD715799D]) [    ] o.a.s.s.SolrIndexSearcher Opening [Searcher@cc4c1b[collection1] main]
   [junit4]   2> 2852166 INFO  (TEST-InfixSuggestersTest.testTwoSuggestersBuildThenReload-seed#[8ADD837FD715799D]) [    ] o.a.s.c.SolrCore [collection1]  CLOSING SolrCore org.apache.solr.core.SolrCore@5d50bc
   [junit4]   2> 2852172 INFO  (searcherExecutor-10877-thread-1) [    ] o.a.s.c.SolrCore [collection1] Registered new searcher Searcher@cc4c1b[collection1] main{ExitableDirectoryReader(UninvertingDirectoryReader())}
   [junit4]   2> 2852173 INFO  (TEST-InfixSuggestersTest.testTwoSuggestersBuildThenReload-seed#[8ADD837FD715799D]) [    ] o.a.s.m.SolrMetricManager Closing metric reporters for registry=solr.core.collection1, tag=6115516
   [junit4]   2> 2852177 INFO  (TEST-InfixSuggestersTest.testTwoSuggestersBuildThenReload-seed#[8ADD837FD715799D]) [    ] o.a.s.h.c.SuggestComponent SuggestComponent prepare with : qt=/suggest_blended_infix_short_dictionary&suggest.onlyMorePopular=true&suggest.count=10&suggest=true&suggest.collate=true&suggest.buildAll=true&suggest.dictionary=shortRandomBlendedInfixSuggester&wt=xml
   [junit4]   2> 2852177 INFO  (TEST-InfixSuggestersTest.testTwoSuggestersBuildThenReload-seed#[8ADD837FD715799D]) [    ] o.a.s.s.s.SolrSuggester SolrSuggester.build(shortRandomBlendedInfixSuggester)
   [junit4]   2> 2852197 INFO  (TEST-InfixSuggestersTest.testTwoSuggestersBuildThenReload-seed#[8ADD837FD715799D]) [    ] o.a.s.s.s.RandomTestDictionaryFactory org.apache.solr.spelling.suggest.RandomTestDictionaryFactory$RandomTestDictionary.enabled.shortRandomBlendedInfixSuggester disabled after emitting 100 items.
   [junit4]   2> 2852251 INFO  (TEST-InfixSuggestersTest.testTwoSuggestersBuildThenReload-seed#[8ADD837FD715799D]) [    ] o.a.s.h.c.SuggestComponent SuggestComponent process with : qt=/suggest_blended_infix_short_dictionary&suggest.onlyMorePopular=true&suggest.count=10&suggest=true&suggest.collate=true&suggest.buildAll=true&suggest.dictionary=shortRandomBlendedInfixSuggester&wt=xml
   [junit4]   2> 2852251 INFO  (TEST-InfixSuggestersTest.testTwoSuggestersBuildThenReload-seed#[8ADD837FD715799D]) [    ] o.a.s.c.S.Request [collection1]  webapp=null path=null params={qt=/suggest_blended_infix_short_dictionary&suggest.buildAll=true&wt=xml} status=0 QTime=73
   [junit4]   2> 2852251 ERROR (TEST-InfixSuggestersTest.testTwoSuggestersBuildThenReload-seed#[8ADD837FD715799D]) [    ] o.a.s.c.CorePropertiesLocator Couldn't load core descriptor from C:\Users\jenkins\workspace\Lucene-Solr-7.x-Windows\solr\core\src\test-files\solr\collection1\core.properties:java.nio.file.NoSuchFileException: C:\Users\jenkins\workspace\Lucene-Solr-7.x-Windows\solr\core\src\test-files\solr\collection1\core.properties
   [junit4]   2> 2852253 INFO  (TEST-InfixSuggestersTest.testTwoSuggestersBuildThenReload-seed#[8ADD837FD715799D]) [    ] o.a.s.c.SolrResourceLoader [null] Added 2 libs to classloader, from paths: [/C:/Users/jenkins/workspace/Lucene-Solr-7.x-Windows/solr/core/src/test-files/solr/collection1/lib, /C:/Users/jenkins/workspace/Lucene-Solr-7.x-Windows/solr/core/src/test-files/solr/collection1/lib/classes]
   [junit4]   2> 2852294 INFO  (TEST-InfixSuggestersTest.testTwoSuggestersBuildThenReload-seed#[8ADD837FD715799D]) [    ] o.a.s.c.SolrConfig Using Lucene MatchVersion: 7.1.0
   [junit4]   2> 2852311 INFO  (TEST-InfixSuggestersTest.testTwoSuggestersBuildThenReload-seed#[8ADD837FD715799D]) [    ] o.a.s.s.IndexSchema [collection1] Schema name=test
   [junit4]   2> 2852439 INFO  (TEST-InfixSuggestersTest.testTwoSuggestersBuildThenReload-seed#[8ADD837FD715799D]) [    ] o.a.s.s.IndexSchema Loaded schema test/1.0 with uniqueid field id
   [junit4]   2> 2852471 INFO  (TEST-InfixSuggestersTest.testTwoSuggestersBuildThenReload-seed#[8ADD837FD715799D]) [    ] o.a.s.c.CoreContainer Reloading SolrCore 'collection1' using configuration from instancedir C:\Users\jenkins\workspace\Lucene-Solr-7.x-Windows\solr\core\src\test-files\solr\collection1
   [junit4]   2> 2852482 INFO  (TEST-InfixSuggestersTest.testTwoSuggestersBuildThenReload-seed#[8ADD837FD715799D]) [    ] o.a.s.m.r.SolrJmxReporter JMX monitoring for 'solr.core.collection1' (registry 'solr.core.collection1') enabled at server: com.sun.jmx.mbeanserver.JmxMBeanServer@31c2c6
   [junit4]   2> 2852482 INFO  (TEST-InfixSuggestersTest.testTwoSuggestersBuildThenReload-seed#[8ADD837FD715799D]) [    ] o.a.s.c.SolrCore [[collection1] ] Opening new SolrCore at [C:\Users\jenkins\workspace\Lucene-Solr-7.x-Windows\solr\core\src\test-files\solr\collection1], dataDir=[C:\Users\jenkins\workspace\Lucene-Solr-7.x-Windows\solr\build\solr-core\test\J1\temp\solr.handler.component.InfixSuggestersTest_8ADD837FD715799D-001\init-core-data-001\]
   [junit4]   2> 2852578 INFO  (TEST-InfixSuggestersTest.testTwoSuggestersBuildThenReload-seed#[8ADD837FD715799D]) [    ] o.a.s.u.CommitTracker Hard AutoCommit: disabled
   [junit4]   2> 2852579 INFO  (TEST-InfixSuggestersTest.testTwoSuggestersBuildThenReload-seed#[8ADD837FD715799D]) [    ] o.a.s.u.CommitTracker Soft AutoCommit: disabled
   [junit4]   2> 2852580 INFO  (TEST-InfixSuggestersTest.testTwoSuggestersBuildThenReload-seed#[8ADD837FD715799D]) [    ] o.a.s.s.SolrIndexSearcher Opening [Searcher@17d09d2[collection1] main]
   [junit4]   2> 2852581 WARN  (TEST-InfixSuggestersTest.testTwoSuggestersBuildThenReload-seed#[8ADD837FD715799D]) [    ] o.a.s.r.ManagedResourceStorage Cannot write to config directory C:\Users\jenkins\workspace\Lucene-Solr-7.x-Windows\solr\core\src\test-files\solr\collection1\conf; switching to use InMemory storage instead.
   [junit4]   2> 2852581 INFO  (TEST-InfixSuggestersTest.testTwoSuggestersBuildThenReload-seed#[8ADD837FD715799D]) [    ] o.a.s.h.c.SuggestComponent Initializing SuggestComponent
   [junit4]   2> 2852581 INFO  (TEST-InfixSuggestersTest.testTwoSuggestersBuildThenReload-seed#[8ADD837FD715799D]) [    ] o.a.s.s.s.SolrSuggester init: {name=shortRandomAnalyzingInfixSuggester,lookupImpl=AnalyzingInfixLookupFactory,dictionaryImpl=RandomTestDictionaryFactory,randDictMaxItems=100,indexPath=short_random_analyzing_infix_suggester,suggestAnalyzerFieldType=text,buildOnCommit=false,buildOnStartup=false}
   [junit4]   2> 2852583 INFO  (TEST-InfixSuggestersTest.testTwoSuggestersBuildThenReload-seed#[8ADD837FD715799D]) [    ] o.a.s.s.s.SolrSuggester Dictionary loaded with params: {name=shortRandomAnalyzingInfixSuggester,lookupImpl=AnalyzingInfixLookupFactory,dictionaryImpl=RandomTestDictionaryFactory,randDictMaxItems=100,indexPath=short_random_analyzing_infix_suggester,suggestAnalyzerFieldType=text,buildOnCommit=false,buildOnStartup=false}
   [junit4]   2> 2852583 INFO  (TEST-InfixSuggestersTest.testTwoSuggestersBuildThenReload-seed#[8ADD837FD715799D]) [    ] o.a.s.h.c.SuggestComponent Initializing SuggestComponent
   [junit4]   2> 2852583 INFO  (TEST-InfixSuggestersTest.testTwoSuggestersBuildThenReload-seed#[8ADD837FD715799D]) [    ] o.a.s.s.s.SolrSuggester init: {name=longRandomAnalyzingInfixSuggester,lookupImpl=AnalyzingInfixLookupFactory,dictionaryImpl=RandomTestDictionaryFactory,randDictMaxItems=100000,indexPath=long_random_analyzing_infix_suggester,suggestAnalyzerFieldType=text,buildOnCommit=false,buildOnStartup=false}
   [junit4]   2> 2852584 INFO  (TEST-InfixSuggestersTest.testTwoSuggestersBuildThenReload-seed#[8ADD837FD715799D]) [    ] o.a.s.s.s.SolrSuggester Dictionary loaded with params: {name=longRandomAnalyzingInfixSuggester,lookupImpl=AnalyzingInfixLookupFactory,dictionaryImpl=RandomTestDictionaryFactory,randDictMaxItems=100000,indexPath=long_random_analyzing_infix_suggester,suggestAnalyzerFieldType=text,buildOnCommit=false,buildOnStartup=false}
   [junit4]   2> 2852585 INFO  (TEST-InfixSuggestersTest.testTwoSuggestersBuildThenReload-seed#[8ADD837FD715799D]) [    ] o.a.s.h.c.SuggestComponent Initializing SuggestComponent
   [junit4]   2> 2852585 INFO  (TEST-InfixSuggestersTest.testTwoSuggestersBuildThenReload-seed#[8ADD837FD715799D]) [    ] o.a.s.s.s.SolrSuggester init: {name=shortRandomBlendedInfixSuggester,lookupImpl=BlendedInfixLookupFactory,dictionaryImpl=RandomTestDictionaryFactory,randDictMaxItems=100,blenderType=position_linear,suggestAnalyzerFieldType=text,indexPath=short_random_blended_infix_suggester,highlight=true,buildOnStartup=false,buildOnCommit=false}
   [junit4]   2> 2852586 INFO  (TEST-InfixSuggestersTest.testTwoSuggestersBuildThenReload-seed#[8ADD837FD715799D]) [    ] o.a.s.s.s.SolrSuggester Dictionary loaded with params: {name=shortRandomBlendedInfixSuggester,lookupImpl=BlendedInfixLookupFactory,dictionaryImpl=RandomTestDictionaryFactory,randDictMaxItems=100,blenderType=position_linear,suggestAnalyzerFieldType=text,indexPath=short_random_blended_infix_suggester,highlight=true,buildOnStartup=false,buildOnCommit=false}
   [junit4]   2> 2852586 INFO  (TEST-InfixSuggestersTest.testTwoSuggestersBuildThenReload-seed#[8ADD837FD715799D]) [    ] o.a.s.h.ReplicationHandler Commits will be reserved for  10000
   [junit4]   2> 2852588 INFO  (TEST-InfixSuggestersTest.testTwoSuggestersBuildThenReload-seed#[8ADD837FD715799D]) [    ] o.a.s.u.RandomMergePolicy RandomMergePolicy wrapping class org.apache.lucene.index.LogByteSizeMergePolicy: [LogByteSizeMergePolicy: minMergeSize=1677721, mergeFactor=24, maxMergeSize=2147483648, maxMergeSizeForForcedMerge=9223372036854775807, calibrateSizeByDeletes=true, maxMergeDocs=2147483647, maxCFSSegmentSizeMB=8.796093022207999E12, noCFSRatio=1.0]
   [junit4]   2> 2852588 INFO  (searcherExecutor-10881-thread-1) [    ] o.a.s.c.SolrCore [collection1] Registered new searcher Searcher@17d09d2[collection1] main{ExitableDirectoryReader(UninvertingDirectoryReader())}
   [junit4]   2> 2852589 INFO  (TEST-InfixSuggestersTest.testTwoSuggestersBuildThenReload-seed#[8ADD837FD715799D]) [    ] o.a.s.u.DefaultSolrCoreState New IndexWriter is ready to be used.
   [junit4]   2> 2852589 INFO  (TEST-InfixSuggestersTest.testTwoSuggestersBuildThenReload-seed#[8ADD837FD715799D]) [    ] o.a.s.s.SolrIndexSearcher Opening [Searcher@90692d[collection1] main]
   [junit4]   2> 2852590 INFO  (TEST-InfixSuggestersTest.testTwoSuggestersBuildThenReload-seed#[8ADD837FD715799D]) [    ] o.a.s.c.SolrCore [collection1]  CLOSING SolrCore org.apache.solr.core.SolrCore@1d64e53
   [junit4]   2> 2852590 INFO  (TEST-InfixSuggestersTest.testTwoSuggestersBuildThenReload-seed#[8ADD837FD715799D]) [    ] o.a.s.m.SolrMetricManager Closing metric reporters for registry=solr.core.collection1, tag=30821971
   [junit4]   2> 2852591 INFO  (searcherExecutor-10881-thread-1) [    ] o.a.s.c.SolrCore [collection1] Registered new searcher Searcher@90692d[collection1] main{ExitableDirectoryReader(UninvertingDirectoryReader())}
   [junit4]   2> 2852591 INFO  (TEST-InfixSuggestersTest.testTwoSuggestersBuildThenReload-seed#[8ADD837FD715799D]) [    ] o.a.s.SolrTestCaseJ4 ###Ending testTwoSuggestersBuildThenReload
   [junit4]   2> 2852593 INFO  (TEST-InfixSuggestersTest.testBuildThen2xReload-seed#[8ADD837FD715799D]) [    ] o.a.s.SolrTestCaseJ4 ###Starting testBuildThen2xReload
   [junit4]   2> 2852593 INFO  (TEST-InfixSuggestersTest.testBuildThen2xReload-seed#[8ADD837FD715799D]) [    ] o.a.s.h.c.SuggestComponent SuggestComponent prepare with : qt=/suggest_analyzing_infix_short_dictionary&suggest=true&suggest.buildAll=true&wt=xml
   [junit4]   2> 2852593 INFO  (TEST-InfixSuggestersTest.testBuildThen2xReload-seed#[8ADD837FD715799D]) [    ] o.a.s.s.s.SolrSuggester SolrSuggester.build(shortRandomAnalyzingInfixSuggester)
   [junit4]   2> 2852606 INFO  (TEST-InfixSuggestersTest.testBuildThen2xReload-seed#[8ADD837FD715799D]) [    ] o.a.s.s.s.RandomTestDictionaryFactory org.apache.solr.spelling.suggest.RandomTestDictionaryFactory$RandomTestDictionary.enabled.shortRandomAnalyzingInfixSuggester disabled after emitting 100 items.
   [junit4]   2> 2852642 INFO  (TEST-InfixSuggestersTest.testBuildThen2xReload-seed#[8ADD837FD715799D]) [    ] o.a.s.h.c.SuggestComponent SuggestComponent process with : qt=/suggest_analyzing_infix_short_dictionary&suggest=true&suggest.buildAll=true&wt=xml
   [junit4]   2> 2852642 INFO  (TEST-InfixSuggestersTest.testBuildThen2xReload-seed#[8ADD837FD715799D]) [    ] o.a.s.c.S.Request [collection1]  webapp=null path=null params={qt=/suggest_analyzing_infix_short_dictionary&suggest.buildAll=true&wt=xml} status=0 QTime=48
   [junit4]   2> 2852643 ERROR (TEST-InfixSuggestersTest.testBuildThen2xReload-seed#[8ADD837FD715799D]) [    ] o.a.s.c.CorePropertiesLocator Couldn't load core descriptor from C:\Users\jenkins\workspace\Lucene-Solr-7.x-Windows\solr\core\src\test-files\solr\collection1\core.properties:java.nio.file.NoSuchFileException: C:\Users\jenkins\workspace\Lucene-Solr-7.x-Windows\solr\core\src\test-files\solr\collection1\core.properties
   [junit4]   2> 2852643 INFO  (TEST-InfixSuggestersTest.testBuildThen2xReload-seed#[8ADD837FD715799D]) [    ] o.a.s.c.SolrResourceLoader [null] Added 2 libs to classloader, from paths: [/C:/Users/jenkins/workspace/Lucene-Solr-7.x-Windows/solr/core/src/test-files/solr/collection1/lib, /C:/Users/jenkins/workspace/Lucene-Solr-7.x-Windows/solr/core/src/test-files/solr/collection1/lib/classes]
   [junit4]   2> 2852674 INFO  (TEST-InfixSuggestersTest.testBuildThen2xReload-seed#[8ADD837FD715799D]) [    ] o.a.s.c.SolrConfig Using Lucene MatchVersion: 7.1.0
   [junit4]   2> 2852689 INFO  (TEST-InfixSuggestersTest.testBuildThen2xReload-seed#[8ADD837FD715799D]) [    ] o.a.s.s.IndexSchema [collection1] Schema name=test
   [junit4]   2> 2852808 INFO  (TEST-InfixSuggestersTest.testBuildThen2xReload-seed#[8ADD837FD715799D]) [    ] o.a.s.s.IndexSchema Loaded schema test/1.0 with uniqueid field id
   [junit4]   2> 2852824 INFO  (TEST-InfixSuggestersTest.testBuildThen2xReload-seed#[8ADD837FD715799D]) [    ] o.a.s.c.CoreContainer Reloading SolrCore 'collection1' using configuration from instancedir C:\Users\jenkins\workspace\Lucene-Solr-7.x-Windows\solr\core\src\test-files\solr\collection1
   [junit4]   2> 2852836 INFO  (TEST-InfixSuggestersTest.testBuildThen2xReload-seed#[8ADD837FD715799D]) [    ] o.a.s.m.r.SolrJmxReporter JMX monitoring for 'solr.core.collection1' (registry 'solr.core.collection1') enabled at server: com.sun.jmx.mbeanserver.JmxMBeanServer@31c2c6
   [junit4]   2> 2852836 INFO  (TEST-InfixSuggestersTest.testBuildThen2xReload-seed#[8ADD837FD715799D]) [    ] o.a.s.c.SolrCore [[collection1] ] Opening new SolrCore at [C:\Users\jenkins\workspace\Lucene-Solr-7.x-Windows\solr\core\src\test-files\solr\collection1], dataDir=[C:\Users\jenkins\workspace\Lucene-Solr-7.x-Windows\solr\build\solr-core\test\J1\temp\solr.handler.component.InfixSuggestersTest_8ADD837FD715799D-001\init-core-data-001\]
   [junit4]   2> 2852929 INFO  (TEST-InfixSuggestersTest.testBuildThen2xReload-seed#[8ADD837FD715799D]) [    ] o.a.s.u.CommitTracker Hard AutoCommit: disabled
   [junit4]   2> 2852929 INFO  (TEST-InfixSuggestersTest.testBuildThen2xReload-seed#[8ADD837FD715799D]) [    ] o.a.s.u.CommitTracker Soft AutoCommit: disabled
   [junit4]   2> 2852930 INFO  (TEST-InfixSuggestersTest.testBuildThen2xReload-seed#[8ADD837FD715799D]) [    ] o.a.s.s.SolrIndexSearcher Opening [Searcher@151d9fd[collection1] main]
   [junit4]   2> 2852931 WARN  (TEST-InfixSuggestersTest.testBuildThen2xReload-seed#[8ADD837FD715799D]) [    ] o.a.s.r.ManagedResourceStorage Cannot write to config directory C:\Users\jenkins\workspace\Lucene-Solr-7.x-Windows\solr\core\src\test-files\solr\collection1\conf; switching to use InMemory storage instead.
   [junit4]   2> 2852931 INFO  (TEST-InfixSuggestersTest.testBuildThen2xReload-seed#[8ADD837FD715799D]) [    ] o.a.s.h.c.SuggestComponent Initializing SuggestComponent
   [junit4]   2> 2852932 INFO  (TEST-InfixSuggestersTest.testBuildThen2xReload-seed#[8ADD837FD715799D]) [    ] o.a.s.s.s.SolrSuggester init: {name=shortRandomAnalyzingInfixSuggester,lookupImpl=AnalyzingInfixLookupFactory,dictionaryImpl=RandomTestDictionaryFactory,randDictMaxItems=100,indexPath=short_random_analyzing_infix_suggester,suggestAnalyzerFieldType=text,buildOnCommit=false,buildOnStartup=false}
   [junit4]   2> 2852934 INFO  (TEST-InfixSuggestersTest.testBuildThen2xReload-seed#[8ADD837FD715799D]) [    ] o.a.s.s.s.SolrSuggester Dictionary loaded with params: {name=shortRandomAnalyzingInfixSuggester,lookupImpl=AnalyzingInfixLookupFactory,dictionaryImpl=RandomTestDictionaryFactory,randDictMaxItems=100,indexPath=short_random_analyzing_infix_suggester,suggestAnalyzerFieldType=text,buildOnCommit=false,buildOnStartup=false}
   [junit4]   2> 2852934 INFO  (TEST-InfixSuggestersTest.testBuildThen2xReload-seed#[8ADD837FD715799D]) [    ] o.a.s.h.c.SuggestComponent Initializing SuggestComponent
   [junit4]   2> 2852934 INFO  (TEST-InfixSuggestersTest.testBuildThen2xReload-seed#[8ADD837FD715799D]) [    ] o.a.s.s.s.SolrSuggester init: {name=longRandomAnalyzingInfixSuggester,lookupImpl=AnalyzingInfixLookupFactory,dictionaryImpl=RandomTestDictionaryFactory,randDictMaxItems=100000,indexPath=long_random_analyzing_infix_suggester,suggestAnalyzerFieldType=text,buildOnCommit=false,buildOnStartup=false}
   [junit4]   2> 2852934 INFO  (TEST-InfixSuggestersTest.testBuildThen2xReload-seed#[8ADD837FD715799D]) [    ] o.a.s.s.s.SolrSuggester Dictionary loaded with params: {name=longRandomAnalyzingInfixSuggester,lookupImpl=AnalyzingInfixLookupFactory,dictionaryImpl=RandomTestDictionaryFactory,randDictMaxItems=100000,indexPath=long_random_analyzing_infix_suggester,suggestAnalyzerFieldType=text,buildOnCommit=false,buildOnStartup=false}
   [junit4]   2> 2852936 INFO  (TEST-InfixSuggestersTest.testBuildThen2xReload-seed#[8ADD837FD715799D]) [    ] o.a.s.h.c.SuggestComponent Initializing SuggestComponent
   [junit4]   2> 2852936 INFO  (TEST-InfixSuggestersTest.testBuildThen2xReload-seed#[8ADD837FD715799D]) [    ] o.a.s.s.s.SolrSuggester init: {name=shortRandomBlendedInfixSuggester,lookupImpl=BlendedInfixLookupFactory,dictionaryImpl=RandomTestDictionaryFactory,randDictMaxItems=100,blenderType=position_linear,suggestAnalyzerFieldType=text,indexPath=short_random_blended_infix_suggester,highlight=true,buildOnStartup=false,buildOnCommit=false}
   [junit4]   2> 2852937 INFO  (TEST-InfixSuggestersTest.testBuildThen2xReload-seed#[8ADD837FD715799D]) [    ] o.a.s.s.s.SolrSuggester Dictionary loaded with params: {name=shortRandomBlendedInfixSuggester,lookupImpl=BlendedInfixLookupFactory,dictionaryImpl=RandomTestDictionaryFactory,randDictMaxItems=100,blenderType=position_linear,suggestAnalyzerFieldType=text,indexPath=short_random_blended_infix_suggester,highlight=true,buildOnStartup=false,buildOnCommit=false}
   [junit4]   2> 2852937 INFO  (TEST-InfixSuggestersTest.testBuildThen2xReload-seed#[8ADD837FD715799D]) [    ] o.a.s.h.ReplicationHandler Commits will be reserved for  10000
   [junit4]   2> 2852939 INFO  (TEST-InfixSuggestersTest.testBuildThen2xReload-seed#[8ADD837FD715799D]) [    ] o.a.s.u.RandomMergePolicy RandomMergePolicy wrapping class org.apache.lucene.index.LogDocMergePolicy: [LogDocMergePolicy: minMergeSize=1000, mergeFactor=22, maxMergeSize=9223372036854775807, maxMergeSizeForForcedMerge=9223372036854775807, calibrateSizeByDeletes=true, maxMergeDocs=2147483647, maxCFSSegmentSizeMB=8.796093022207999E12, noCFSRatio=0.4300311628635144]
   [junit4]   2> 2852940 INFO  (TEST-InfixSuggestersTest.testBuildThen2xReload-seed#[8ADD837FD715799D]) [    ] o.a.s.u.DefaultSolrCoreState New IndexWriter is ready to be used.
   [junit4]   2> 2852941 INFO  (searcherExecutor-10885-thread-1) [    ] o.a.s.c.SolrCore [collection1] Registered new searcher Searcher@151d9fd[collection1] main{ExitableDirectoryReader(UninvertingDirectoryReader())}
   [junit4]   2> 2852941 INFO  (TEST-InfixSuggestersTest.testBuildThen2xReload-seed#[8ADD837FD715799D]) [    ] o.a.s.s.SolrIndexSearcher Opening [Searcher@bd2081[collection1] main]
   [junit4]   2> 2852942 INFO  (TEST-InfixSuggestersTest.testBuildThen2xReload-seed#[8ADD837FD715799D]) [    ] o.a.s.c.SolrCore [collection1]  CLOSING SolrCore org.apache.solr.core.SolrCore@e0edd
   [junit4]   2> 2852942 INFO  (TEST-InfixSuggestersTest.testBuildThen2xReload-seed#[8ADD837FD715799D]) [    ] o.a.s.m.SolrMetricManager Closing metric reporters for registry=solr.core.collection1, tag=921309
   [junit4]   2> 2852943 INFO  (searcherExecutor-10885-thread-1) [    ] o.a.s.c.SolrCore [collection1] Registered new searcher Searcher@bd2081[collection1] main{ExitableDirectoryReader(UninvertingDirectoryReader())}
   [junit4]   2> 2852947 ERROR (TEST-InfixSuggestersTest.testBuildThen2xReload-seed#[8ADD837FD715799D]) [    ] o.a.s.c.CorePropertiesLocator Couldn't load core descriptor from C:\Users\jenkins\workspace\Lucene-Solr-7.x-Windows\solr\core\src\test-files\solr\collection1\core.properties:java.nio.file.NoSuchFileException: C:\Users\jenkins\workspace\Lucene-Solr-7.x-Windows\solr\core\src\test-files\solr\collection1\core.properties
   [junit4]   2> 2852948 INFO  (TEST-InfixSuggestersTest.testBuildThen2xReload-seed#[8ADD837FD715799D]) [    ] o.a.s.c.SolrResourceLoader [null] Added 2 libs to classloader, from paths: [/C:/Users/jenkins/workspace/Lucene-Solr-7.x-Windows/solr/core/src/test-files/solr/collection1/lib, /C:/Users/jenkins/workspace/Lucene-Solr-7.x-Windows/solr/core/src/test-files/solr/collection1/lib/classes]
   [junit4]   2> 2853004 INFO  (TEST-InfixSuggestersTest.testBuildThen2xReload-seed#[8ADD837FD715799D]) [    ] o.a.s.c.SolrConfig Using Lucene MatchVersion: 7.1.0
   [junit4]   2> 2853016 INFO  (TEST-InfixSuggestersTest.testBuildThen2xReload-seed#[8ADD837FD715799D]) [    ] o.a.s.s.IndexSchema [collection1] Schema name=test
   [junit4]   2> 2853117 INFO  (TEST-InfixSuggestersTest.testBuildThen2xReload-seed#[8ADD837FD715799D]) [    ] o.a.s.s.IndexSchema Loaded schema test/1.0 with uniqueid field id
   [junit4]   2> 2853131 INFO  (TEST-InfixSuggestersTest.testBuildThen2xReload-seed#[8ADD837FD715799D]) [    ] o.a.s.c.CoreContainer Reloading SolrCore 'collection1' using configuration from instancedir C:\Users\jenkins\workspace\Lucene-Solr-7.x-Windows\solr\core\src\test-files\solr\collection1
   [junit4]   2> 2853142 INFO  (TEST-InfixSuggestersTest.testBuildThen2xReload-seed#[8ADD837FD715799D]) [    ] o.a.s.m.r.SolrJmxReporter JMX monitoring for 'solr.core.collection1' (registry 'solr.core.collection1') enabled at server: com.sun.jmx.mbeanserver.JmxMBeanServer@31c2c6
   [junit4]   2> 2853142 INFO  (TEST-InfixSuggestersTest.testBuildThen2xReload-seed#[8ADD837FD715799D]) [    ] o.a.s.c.SolrCore [[collection1] ] Opening new SolrCore at [C:\Users\jenkins\workspace\Lucene-Solr-7.x-Windows\solr\core\src\test-files\solr\collection1], dataDir=[C:\Users\jenkins\workspace\Lucene-Solr-7.x-Windows\solr\build\solr-core\test\J1\temp\solr.handler.component.InfixSuggestersTest_8ADD837FD715799D-001\init-core-data-001\]
   [junit4]   2> 2853216 INFO  (TEST-InfixSuggestersTest.testBuildThen2xReload-seed#[8ADD837FD715799D]) [    ] o.a.s.u.CommitTracker Hard AutoCommit: disabled
   [junit4]   2> 2853216 INFO  (TEST-InfixSuggestersTest.testBuildThen2xReload-seed#[8ADD837FD715799D]) [    ] o.a.s.u.CommitTracker Soft AutoCommit: disabled
   [junit4]   2> 2853217 INFO  (TEST-InfixSuggestersTest.testBuildThen2xReload-seed#[8ADD837FD715799D]) [    ] o.a.s.s.SolrIndexSearcher Opening [Searcher@ac94ea[collection1] main]
   [junit4]   2> 2853218 WARN  (TEST-InfixSuggestersTest.testBuildThen2xReload-seed#[8ADD837FD715799D]) [    ] o.a.s.r.ManagedResourceStorage Cannot write to config directory C:\Users\jenkins\workspace\Lucene-Solr-7.x-Windows\solr\core\src\test-files\solr\collection1\conf; switching to use InMemory storage instead.
   [junit4]   2> 2853219 INFO  (TEST-InfixSuggestersTest.testBuildThen2xReload-seed#[8ADD837FD715799D]) [    ] o.a.s.h.c.SuggestComponent Initializing SuggestComponent
   [junit4]   2> 2853219 INFO  (TEST-InfixSuggestersTest.testBuildThen2xReload-seed#[8ADD837FD715799D]) [    ] o.a.s.s.s.SolrSuggester init: {name=shortRandomAnalyzingInfixSuggester,lookupImpl=AnalyzingInfixLookupFactory,dictionaryImpl=RandomTestDictionaryFactory,randDictMaxItems=100,indexPath=short_random_analyzing_infix_suggester,suggestAnalyzerFieldType=text,buildOnCommit=false,buildOnStartup=false}
   [junit4]   2> 2853221 INFO  (TEST-InfixSuggestersTest.testBuildThen2xReload-seed#[8ADD837FD715799D]) [    ] o.a.s.s.s.SolrSuggester Dictionary loaded with params: {name=shortRandomAnalyzingInfixSuggester,lookupImpl=AnalyzingInfixLookupFactory,dictionaryImpl=RandomTestDictionaryFactory,randDictMaxItems=100,indexPath=short_random_analyzing_infix_suggester,suggestAnalyzerFieldType=text,buildOnCommit=false,buildOnStartup=false}
   [junit4]   2> 2853221 INFO  (TEST-InfixSuggestersTest.testBuildThen2xReload-seed#[8ADD837FD715799D]) [    ] o.a.s.h.c.SuggestComponent Initializing SuggestComponent
   [junit4]   2> 2853221 INFO  (TEST-InfixSuggestersTest.testBuildThen2xReload-seed#[8ADD837FD715799D]) [    ] o.a.s.s.s.SolrSuggester init: {name=longRandomAnalyzingInfixSuggester,lookupImpl=AnalyzingInfixLookupFactory,dictionaryImpl=RandomTestDictionaryFactory,randDictMaxItems=100000,indexPath=long_random_analyzing_infix_suggester,suggestAnalyzerFieldType=text,buildOnCommit=false,buildOnStartup=false}
   [junit4]   2> 2853221 INFO  (TEST-InfixSuggestersTest.testBuildThen2xReload-seed#[8ADD837FD715799D]) [    ] o.a.s.s.s.SolrSuggester Dictionary loaded with params: {name=longRandomAnalyzingInfixSuggester,lookupImpl=AnalyzingInfixLookupFactory,dictionaryImpl=RandomTestDictionaryFactory,randDictMaxItems=100000,indexPath=long_random_analyzing_infix_suggester,suggestAnalyzerFieldType=text,buildOnCommit=false,buildOnStartup=false}
   [junit4]   2> 2853221 INFO  (TEST-InfixSuggestersTest.testBuildThen2xReload-seed#[8ADD837FD715799D]) [    ] o.a.s.h.c.SuggestComponent Initializing SuggestComponent
   [junit4]   2> 2853222 INFO  (TEST-InfixSuggestersTest.testBuildThen2xReload-seed#[8ADD837FD715799D]) [    ] o.a.s.s.s.SolrSuggester init: {name=shortRandomBlendedInfixSuggester,lookupImpl=BlendedInfixLookupFactory,dictionaryImpl=RandomTestDictionaryFactory,randDictMaxItems=100,blenderType=position_linear,suggestAnalyzerFieldType=text,indexPath=short_random_blended_infix_suggester,highlight=true,buildOnStartup=false,buildOnCommit=false}
   [junit4]   2> 2853223 INFO  (TEST-InfixSuggestersTest.testBuildThen2xReload-seed#[8ADD837FD715799D]) [    ] o.a.s.s.s.SolrSuggester Dictionary loaded with params: {name=shortRandomBlendedInfixSuggester,lookupImpl=BlendedInfixLookupFactory,dictionaryImpl=RandomTestDictionaryFactory,randDictMaxItems=100,blenderType=position_linear,suggestAnalyzerFieldType=text,indexPath=short_random_blended_infix_suggester,highlight=true,buildOnStartup=false,buildOnCommit=false}
   [junit4]   2> 2853223 INFO  (TEST-InfixSuggestersTest.testBuildThen2xReload-seed#[8ADD837FD715799D]) [    ] o.a.s.h.ReplicationHandler Commits will be reserved for  10000
   [junit4]   2> 2853224 INFO  (TEST-InfixSuggestersTest.testBuildThen2xReload-seed#[8ADD837FD715799D]) [    ] o.a.s.u.RandomMergePolicy RandomMergePolicy wrapping class org.apache.lucene.index.TieredMergePolicy: [TieredMergePolicy: maxMergeAtOnce=43, maxMergeAtOnceExplicit=35, maxMergedSegmentMB=0.89453125, floorSegmentMB=1.2333984375, forceMergeDeletesPctAllowed=9.363570096035566, segmentsPerTier=42.0, maxCFSSegmentSizeMB=8.796093022207999E12, noCFSRatio=1.0
   [junit4]   2> 2853225 INFO  (searcherExecutor-10889-thread-1) [    ] o.a.s.c.SolrCore [collection1] Registered new searcher Searcher@ac94ea[collection1] main{ExitableDirectoryReader(UninvertingDirectoryReader())}
   [junit4]   2> 2853225 INFO  (TEST-InfixSuggestersTest.testBuildThen2xReload-seed#[8ADD837FD715799D]) [    ] o.a.s.u.DefaultSolrCoreState New IndexWriter is ready to be used.
   [junit4]   2> 2853225 INFO  (TEST-InfixSuggestersTest.testBuildThen2xReload-seed#[8ADD837FD715799D]) [    ] o.a.s.s.SolrIndexSearcher Opening [Searcher@6cc314[collection1] main]
   [junit4]   2> 2853226 INFO  (TEST-InfixSuggestersTest.testBuildThen2xReload-seed#[8ADD837FD715799D]) [    ] o.a.s.c.SolrCore [collection1]  CLOSING SolrCore org.apache.solr.core.SolrCore@16f08d8
   [junit4]   2> 2853226 INFO  (TEST-InfixSuggestersTest.testBuildThen2xReload-seed#[8ADD837FD715799D]) [    ] o.a.s.m.SolrMetricManager Closing metric reporters for registry=solr.core.collection1, tag=24053976
   [junit4]   2> 2853227 INFO  (searcherExecutor-10889-thread-1) [    ] o.a.s.c.SolrCore [collection1] Registered new searcher Searcher@6cc314[collection1] main{ExitableDirectoryReader(UninvertingDirectoryReader())}
   [junit4]   2> 2853228 INFO  (TEST-InfixSuggestersTest.testBuildThen2xReload-seed#[8ADD837FD715799D]) [    ] o.a.s.SolrTestCaseJ4 ###Ending testBuildThen2xReload
   [junit4]   2> 2853230 INFO  (TEST-InfixSuggestersTest.test2xBuildReload-seed#[8ADD837FD715799D]) [    ] o.a.s.SolrTestCaseJ4 ###Starting test2xBuildReload
   [junit4]   2> 2853230 INFO  (TEST-InfixSuggestersTest.test2xBuildReload-seed#[8ADD837FD715799D]) [    ] o.a.s.h.c.SuggestComponent SuggestComponent prepare with : qt=/suggest_analyzing_infix_short_dictionary&suggest=true&suggest.buildAll=true&wt=xml
   [junit4]   2> 2853230 INFO  (TEST-InfixSuggestersTest.test2xBuildReload-seed#[8ADD837FD715799D]) [    ] o.a.s.s.s.SolrSuggester SolrSuggester.build(shortRandomAnalyzingInfixSuggester)
   [junit4]   2> 2853245 INFO  (TEST-InfixSuggestersTest.test2xBuildReload-seed#[8ADD837FD715799D]) [    ] o.a.s.s.s.RandomTestDictionaryFactory org.apache.solr.spelling.suggest.RandomTestDictionaryFactory$RandomTestDictionary.enabled.shortRandomAnalyzingInfixSuggester disabled after emitting 100 items.
   [junit4]   2> 2853277 INFO  (TEST-InfixSuggestersTest.test2xBuildReload-seed#[8ADD837FD715799D]) [    ] o.a.s.h.c.SuggestComponent SuggestComponent process with : qt=/suggest_analyzing_infix_short_dictionary&suggest=true&suggest.buildAll=true&wt=xml
   [junit4]   2> 2853277 INFO  (TEST-InfixSuggestersTest.test2xBuildReload-seed#[8ADD837FD715799D]) [    ] o.a.s.c.S.Request [collection1]  webapp=null path=null params={qt=/suggest_analyzing_infix_short_dictionary&suggest.buildAll=true&wt=xml} status=0 QTime=46
   [junit4]   2> 2853277 ERROR (TEST-InfixSuggestersTest.test2xBuildReload-seed#[8ADD837FD715799D]) [    ] o.a.s.c.CorePropertiesLocator Couldn't load core descriptor from C:\Users\jenkins\workspace\Lucene-Solr-7.x-Windows\solr\core\src\test-files\solr\collection1\core.properties:java.nio.file.NoSuchFileException: C:\Users\jenkins\workspace\Lucene-Solr-7.x-Windows\solr\core\src\test-files\solr\collection1\core.properties
   [junit4]   2> 2853278 INFO  (TEST-InfixSuggestersTest.test2xBuildReload-seed#[8ADD837FD715799D]) [    ] o.a.s.c.SolrResourceLoader [null] Added 2 libs to classloader, from paths: [/C:/Users/jenkins/workspace/Lucene-Solr-7.x-Windows/solr/core/src/test-files/solr/collection1/lib, /C:/Users/jenkins/workspace/Lucene-Solr-7.x-Windows/solr/core/src/test-files/solr/collection1/lib/classes]
   [junit4]   2> 2853305 INFO  (TEST-InfixSuggestersTest.test2xBuildReload-seed#[8ADD837FD715799D]) [    ] o.a.s.c.SolrConfig Using Lucene MatchVersion: 7.1.0
   [junit4]   2> 2853316 INFO  (TEST-InfixSuggestersTest.test2xBuildReload-seed#[8ADD837FD715799D]) [    ] o.a.s.s.IndexSchema [collection1] Schema name=test
   [junit4]   2> 2853403 INFO  (TEST-InfixSuggestersTest.test2xBuildReload-seed#[8ADD837FD715799D]) [    ] o.a.s.s.IndexSchema Loaded schema test/1.0 with uniqueid field id
   [junit4]   2> 2853416 INFO  (TEST-InfixSuggestersTest.test2xBuildReload-seed#[8ADD837FD715799D]) [    ] o.a.s.c.CoreContainer Reloading SolrCore 'collection1' using configuration from instancedir C:\Users\jenkins\workspace\Lucene-Solr-7.x-Windows\solr\core\src\test-files\solr\collection1
   [junit4]   2> 2853428 INFO  (TEST-InfixSuggestersTest.test2xBuildReload-seed#[8ADD837FD715799D]) [    ] o.a.s.m.r.SolrJmxReporter JMX monitoring for 'solr.core.collection1' (registry 'solr.core.collection1') enabled at server: com.sun.jmx.mbeanserver.JmxMBeanServer@31c2c6
   [junit4]   2> 2853428 INFO  (TEST-InfixSuggestersTest.test2xBuildReload-seed#[8ADD837FD715799D]) [    ] o.a.s.c.SolrCore [[collection1] ] Opening new SolrCore at [C:\Users\jenkins\workspace\Lucene-Solr-7.x-Windows\solr\core\src\test-files\solr\collection1], dataDir=[C:\Users\jenkins\workspace\Lucene-Solr-7.x-Windows\solr\build\solr-core\test\J1\temp\solr.handler.component.InfixSuggestersTest_8ADD837FD715799D-001\init-core-data-001\]
   [junit4]   2> 2853513 INFO  (TEST-InfixSuggestersTest.test2xBuildReload-seed#[8ADD837FD715799D]) [    ] o.a.s.u.CommitTracker Hard AutoCommit: disabled
   [junit4]   2> 2853513 INFO  (TEST-InfixSuggestersTest.test2xBuildReload-seed#[8ADD837FD715799D]) [    ] o.a.s.u.CommitTracker Soft AutoCommit: disabled
   [junit4]   2> 2853514 INFO  (TEST-InfixSuggestersTest.test2xBuildReload-seed#[8ADD837FD715799D]) [    ] o.a.s.s.SolrIndexSearcher Opening [Searcher@1196ea3[collection1] main]
   [junit4]   2> 2853515 WARN  (TEST-InfixSuggestersTest.test2xBuildReload-seed#[8ADD837FD715799D]) [    ] o.a.s.r.ManagedResourceStorage Cannot write to config directory C:\Users\jenkins\workspace\Lucene-Solr-7.x-Windows\solr\core\src\test-files\solr\collection1\conf; switching to use InMemory storage instead.
   [junit4]   2> 2853515 INFO  (TEST-InfixSuggestersTest.test2xBuildReload-seed#[8ADD837FD715799D]) [    ] o.a.s.h.c.SuggestComponent Initializing SuggestComponent
   [junit4]   2> 2853515 INFO  (TEST-InfixSuggestersTest.test2xBuildReload-seed#[8ADD837FD715799D]) [    ] o.a.s.s.s.SolrSuggester init: {name=shortRandomAnalyzingInfixSuggester,lookupImpl=AnalyzingInfixLookupFactory,dictionaryImpl=RandomTestDictionaryFactory,randDictMaxItems=100,indexPath=short_random_analyzing_infix_suggester,suggestAnalyzerFieldType=text,buildOnCommit=false,buildOnStartup=false}
   [junit4]   2> 2853517 INFO  (TEST-InfixSuggestersTest.test2xBuildReload-seed#[8ADD837FD715799D]) [    ] o.a.s.s.s.SolrSuggester Dictionary loaded with params: {name=shortRandomAnalyzingInfixSuggester,lookupImpl=AnalyzingInfixLookupFactory,dictionaryImpl=RandomTestDictionaryFactory,randDictMaxItems=100,indexPath=short_random_analyzing_infix_suggester,suggestAnalyzerFieldType=text,buildOnCommit=false,buildOnStartup=false}
   [junit4]   2> 2853518 INFO  (TEST-InfixSuggestersTest.test2xBuildReload-seed#[8ADD837FD715799D]) [    ] o.a.s.h.c.SuggestComponent Initializing SuggestComponent
   [junit4]   2> 2853518 INFO  (TEST-InfixSuggestersTest.test2xBuildReload-seed#[8ADD837FD715799D]) [    ] o.a.s.s.s.SolrSuggester init: {name=longRandomAnalyzingInfixSuggester,lookupImpl=AnalyzingInfixLookupFactory,dictionaryImpl=RandomTestDictionaryFactory,randDictMaxItems=100000,indexPath=long_random_analyzing_infix_suggester,suggestAnalyzerFieldType=text,buildOnCommit=false,buildOnStartup=false}
   [junit4]   2> 2853518 INFO  (TEST-InfixSuggestersTest.test2xBuildReload-seed#[8ADD837FD715799D]) [    ] o.a.s.s.s.SolrSuggester Dictionary loaded with params: {name=longRandomAnalyzingInfixSuggester,lookupImpl=AnalyzingInfixLookupFactory,dictionaryImpl=RandomTestDictionaryFactory,randDictMaxItems=100000,indexPath=long_random_analyzing_infix_suggester,suggestAnalyzerFieldType=text,buildOnCommit=false,buildOnStartup=false}
   [junit4]   2> 2853518 INFO  (TEST-InfixSuggestersTest.test2xBuildReload-seed#[8ADD837FD715799D]) [    ] o.a.s.h.c.SuggestComponent Initializing SuggestComponent
   [junit4]   2> 2853518 INFO  (TEST-InfixSuggestersTest.test2xBuildReload-seed#[8ADD837FD715799D]) [    ] o.a.s.s.s.SolrSuggester init: {name=shortRandomBlendedInfixSuggester,lookupImpl=BlendedInfixLookupFactory,dictionaryImpl=RandomTestDictionaryFactory,randDictMaxItems=100,blenderType=position_linear,suggestAnalyzerFieldType=text,indexPath=short_random_blended_infix_suggester,highlight=true,buildOnStartup=false,buildOnCommit=false}
   [junit4]   2> 2853520 INFO  (TEST-InfixSuggestersTest.test2xBuildReload-seed#[8ADD837FD715799D]) [    ] o.a.s.s.s.SolrSuggester Dictionary loaded with params: {name=shortRandomBlendedInfixSuggester,lookupImpl=BlendedInfixLookupFactory,dictionaryImpl=RandomTestDictionaryFactory,randDictMaxItems=100,blenderType=position_linear,suggestAnalyzerFieldType=text,indexPath=short_random_blended_infix_suggester,highlight=true,buildOnStartup=false,buildOnCommit=false}
   [junit4]   2> 2853520 INFO  (TEST-InfixSuggestersTest.test2xBuildReload-seed#[8ADD837FD715799D]) [    ] o.a.s.h.ReplicationHandler Commits will be reserved for  10000
   [junit4]   2> 2853522 INFO  (TEST-InfixSuggestersTest.test2xBuildReload-seed#[8ADD837FD715799D]) [    ] o.a.s.u.RandomMergePolicy RandomMergePolicy wrapping class org.apache.lucene.index.TieredMergePolicy: [TieredMergePolicy: maxMergeAtOnce=12, maxMergeAtOnceExplicit=48, maxMergedSegmentMB=47.017578125, floorSegmentMB=0.9345703125, forceMergeDeletesPctAllowed=26.85565159180502, segmentsPerTier=42.0, maxCFSSegmentSizeMB=8.796093022207999E12, noCFSRatio=0.5561236104587234
   [junit4]   2> 2853522 INFO  (searcherExecutor-10893-thread-1) [    ] o.a.s.c.SolrCore [collection1] Registered new searcher Searcher@1196ea3[collection1] main{ExitableDirectoryReader(UninvertingDirectoryReader())}
   [junit4]   2> 2853522 INFO  (TEST-InfixSuggestersTest.test2xBuildReload-seed#[8ADD837FD715799D]) [    ] o.a.s.u.DefaultSolrCoreState New IndexWriter is ready to be used.
   [junit4]   2> 2853522 INFO  (TEST-InfixSuggestersTest.test2xBuildReload-seed#[8ADD837FD715799D]) [    ] o.a.s.s.SolrIndexSearcher Opening [Searcher@6cfdce[collection1] main]
   [junit4]   2> 2853523 INFO  (TEST-InfixSuggestersTest.test2xBuildReload-seed#[8ADD837FD715799D]) [    ] o.a.s.c.SolrCore [collection1]  CLOSING SolrCore org.apache.solr.core.SolrCore@50db1f
   [junit4]   2> 2853523 INFO  (TEST-InfixSuggestersTest.test2xBuildReload-seed#[8ADD837FD715799D]) [    ] o.a.s.m.SolrMetricManager Closing metric reporters for registry=solr.core.collection1, tag=5298975
   [junit4]   2> 2853524 INFO  (searcherExecutor-10893-thread-1) [    ] o.a.s.c.SolrCore [collection1] Registered new searcher Searcher@6cfdce[collection1] main{ExitableDirectoryReader(UninvertingDirectoryReader())}
   [junit4]   2> 2853527 INFO  (TEST-InfixSuggestersTest.test2xBuildReload-seed#[8ADD837FD715799D]) [    ] o.a.s.h.c.SuggestComponent SuggestComponent prepare with : qt=/suggest_analyzing_infix_short_dictionary&suggest=true&suggest.buildAll=true&wt=xml
   [junit4]   2> 2853527 INFO  (TEST-InfixSuggestersTest.test2xBuildReload-seed#[8ADD837FD715799D]) [    ] o.a.s.s.s.SolrSuggester SolrSuggester.build(shortRandomAnalyzingInfixSuggester)
   [junit4]   2> 2853536 INFO  (TEST-InfixSuggestersTest.test2xBuildReload-seed#[8ADD837FD715799D]) [    ] o.a.s.s.s.RandomTestDictionaryFactory org.apache.solr.spelling.suggest.RandomTestDictionaryFactory$RandomTestDictionary.enabled.shortRandomAnalyzingInfixSuggester disabled after emitting 100 items.
   [junit4]   2> 2853569 INFO  (TEST-InfixSuggestersTest.test2xBuildReload-seed#[8ADD837FD715799D]) [    ] o.a.s.h.c.SuggestComponent SuggestComponent process with : qt=/suggest_analyzing_infix_short_dictionary&suggest=true&suggest.buildAll=true&wt=xml
   [junit4]   2> 2853570 INFO  (TEST-InfixSuggestersTest.test2xBuildReload-seed#[8ADD837FD715799D]) [    ] o.a.s.c.S.Request [collection1]  webapp=null path=null params={qt=/suggest_analyzing_infix_short_dictionary&suggest.buildAll=true&wt=xml} status=0 QTime=42
   [junit4]   2> 2853570 ERROR (TEST-InfixSuggestersTest.test2xBuildReload-seed#[8ADD837FD715799D]) [    ] o.a.s.c.CorePropertiesLocator Couldn't load core descriptor from C:\Users\jenkins\workspace\Lucene-Solr-7.x-Windows\solr\core\src\test-files\solr\collection1\core.properties:java.nio.file.NoSuchFileException: C:\Users\jenkins\workspace\Lucene-Solr-7.x-Windows\solr\core\src\test-files\solr\collection1\core.properties
   [junit4]   2> 2853571 INFO  (TEST-InfixSuggestersTest.test2xBuildReload-seed#[8ADD837FD715799D]) [    ] o.a.s.c.SolrResourceLoader [null] Added 2 libs to classloader, from paths: [/C:/Users/jenkins/workspace/Lucene-Solr-7.x-Windows/solr/core/src/test-files/solr/collection1/lib, /C:/Users/jenkins/workspace/Lucene-Solr-7.x-Windows/solr/core/src/test-files/solr/collection1/lib/classes]
   [junit4]   2> 2853600 INFO  (TEST-InfixSuggestersTest.test2xBuildReload-seed#[8ADD837FD715799D]) [    ] o.a.s.c.SolrConfig Using Lucene MatchVersion: 7.1.0
   [junit4]   2> 2853613 INFO  (TEST-InfixSuggestersTest.test2xBuildReload-seed#[8ADD837FD715799D]) [    ] o.a.s.s.IndexSchema [collection1] Schema name=test
   [junit4]   2> 2853709 INFO  (TEST-InfixSuggestersTest.test2xBuildReload-seed#[8ADD837FD715799D]) [    ] o.a.s.s.IndexSchema Loaded schema test/1.0 with uniqueid field id
   [junit4]   2> 2853735 INFO  (TEST-InfixSuggestersTest.test2xBuildReload-seed#[8ADD837FD715799D]) [    ] o.a.s.c.CoreContainer Reloading SolrCore 'collection1' using configuration from instancedir C:\Users\jenkins\workspace\Lucene-Solr-7.x-Windows\solr\core\src\test-files\solr\collection1
   [junit4]   2> 2853745 INFO  (TEST-InfixSuggestersTest.test2xBuildReload-seed#[8ADD837FD715799D]) [    ] o.a.s.m.r.SolrJmxReporter JMX monitoring for 'solr.core.collection1' (registry 'solr.core.collection1') enabled at server: com.sun.jmx.mbeanserver.JmxMBeanServer@31c2c6
   [junit4]   2> 2853745 INFO  (TEST-InfixSuggestersTest.test2xBuildReload-seed#[8ADD837FD715799D]) [    ] o.a.s.c.SolrCore [[collection1] ] Opening new SolrCore at [C:\Users\jenkins\workspace\Lucene-Solr-7.x-Windows\solr\core\src\test-files\solr\collection1], dataDir=[C:\Users\jenkins\workspace\Lucene-Solr-7.x-Windows\solr\build\solr-core\test\J1\temp\solr.handler.component.InfixSuggestersTest_8ADD837FD715799D-001\init-core-data-001\]
   [junit4]   2> 2853819 INFO  (TEST-InfixSuggestersTest.test2xBuildReload-seed#[8ADD837FD715799D]) [    ] o.a.s.u.CommitTracker Hard AutoCommit: disabled
   [junit4]   2> 2853819 INFO  (TEST-InfixSuggestersTest.test2xBuildReload-seed#[8ADD837FD715799D]) [    ] o.a.s.u.CommitTracker Soft AutoCommit: disabled
   [junit4]   2> 2853820 INFO  (TEST-InfixSuggestersTest.test2xBuildReload-seed#[8ADD837FD715799D]) [    ] o.a.s.s.SolrIndexSearcher Opening [Searcher@e14454[collection1] main]
   [junit4]   2> 2853821 WARN  (TEST-InfixSuggestersTest.test2xBuildReload-seed#[8ADD837FD715799D]) [    ] o.a.s.r.ManagedResourceStorage Cannot write to config directory C:\Users\jenkins\workspace\Lucene-Solr-7.x-Windows\solr\core\src\test-files\solr\collection1\conf; switching to use InMemory storage instead.
   [junit4]   2> 2853822 INFO  (TEST-InfixSuggestersTest.test2xBuildReload-seed#[8ADD837FD715799D]) [    ] o.a.s.h.c.SuggestComponent Initializing SuggestComponent
   [junit4]   2> 2853822 INFO  (TEST-InfixSuggestersTest.test2xBuildReload-seed#[8ADD837FD715799D]) [    ] o.a.s.s.s.SolrSuggester init: {name=shortRandomAnalyzingInfixSuggester,lookupImpl=AnalyzingInfixLookupFactory,dictionaryImpl=RandomTestDictionaryFactory,randDictMaxItems=100,indexPath=short_random_analyzing_infix_suggester,suggestAnalyzerFieldType=text,buildOnCommit=false,buildOnStartup=false}
   [junit4]   2> 2853825 INFO  (TEST-InfixSuggestersTest.test2xBuildReload-seed#[8ADD837FD715799D]) [    ] o.a.s.s.s.SolrSuggester Dictionary loaded with params: {name=shortRandomAnalyzingInfixSuggester,lookupImpl=AnalyzingInfixLookupFactory,dictionaryImpl=RandomTestDictionaryFactory,randDictMaxItems=100,indexPath=short_random_analyzing_infix_suggester,suggestAnalyzerFieldType=text,buildOnCommit=false,buildOnStartup=false}
   [junit4]   2> 2853825 INFO  (TEST-InfixSuggestersTest.test2xBuildReload-seed#[8ADD837FD715799D]) [    ] o.a.s.h.c.SuggestComponent Initializing SuggestComponent
   [junit4]   2> 2853825 INFO  (TEST-InfixSuggestersTest.test2xBuildReload-seed#[8ADD837FD715799D]) [    ] o.a.s.s.s.SolrSuggester init: {name=longRandomAnalyzingInfixSuggester,lookupImpl=AnalyzingInfixLookupFactory,dictionaryImpl=RandomTestDictionaryFactory,randDictMaxItems=100000,indexPath=long_random_analyzing_infix_suggester,suggestAnalyzerFieldType=text,buildOnCommit=false,buildOnStartup=false}
   [junit4]   2> 2853825 INFO  (TEST-InfixSuggestersTest.test2xBuildReload-seed#[8ADD837FD715799D]) [    ] o.a.s.s.s.SolrSuggester Dictionary loaded with params: {name=longRandomAnalyzingInfixSuggester,lookupImpl=AnalyzingInfixLookupFactory,dictionaryImpl=RandomTestDictionaryFactory,randDictMaxItems=100000,indexPath=long_random_analyzing_infix_suggester,suggestAnalyzerFieldType=text,buildOnCommit=false,buildOnStartup=false}
   [junit4]   2> 2853825 INFO  (TEST-InfixSuggestersTest.test2xBuildReload-seed#[8ADD837FD715799D]) [    ] o.a.s.h.c.SuggestComponent Initializing SuggestComponent
   [junit4]   2> 2853825 INFO  (TEST-InfixSuggestersTest.test2xBuildReload-seed#[8ADD837FD715799D]) [    ] o.a.s.s.s.SolrSuggester init: {name=shortRandomBlendedInfixSuggester,lookupImpl=BlendedInfixLookupFactory,dictionaryImpl=RandomTestDictionaryFactory,randDictMaxItems=100,blenderType=position_linear,suggestAnalyzerFieldType=text,indexPath=short_random_blended_infix_suggester,highlight=true,buildOnStartup=false,buildOnCommit=false}
   [junit4]   2> 2853826 INFO  (TEST-InfixSuggestersTest.test2xBuildReload-seed#[8ADD837FD715799D]) [    ] o.a.s.s.s.SolrSuggester Dictionary loaded with params: {name=shortRandomBlendedInfixSuggester,lookupImpl=BlendedInfixLookupFactory,dictionaryImpl=RandomTestDictionaryFactory,randDictMaxItems=100,blenderType=position_linear,suggestAnalyzerFieldType=text,indexPath=short_random_blended_infix_suggester,highlight=true,buildOnStartup=false,buildOnCommit=false}
   [junit4]   2> 2853826 INFO  (TEST-InfixSuggestersTest.test2xBuildReload-seed#[8ADD837FD715799D]) [    ] o.a.s.h.ReplicationHandler Commits will be reserved for  10000
   [junit4]   2> 2853829 INFO  (searcherExecutor-10897-thread-1) [    ] o.a.s.c.SolrCore [collection1] Registered new searcher Searcher@e14454[collection1] main{ExitableDirectoryReader(UninvertingDirectoryReader())}
   [junit4]   2> 2853829 INFO  (TEST-InfixSuggestersTest.test2xBuildReload-seed#[8ADD837FD715799D]) [    ] o.a.s.u.RandomMergePolicy RandomMergePolicy wrapping class org.apache.lucene.index.TieredMergePolicy: [TieredMergePolicy: maxMergeAtOnce=35, maxMergeAtOnceExplicit=50, maxMergedSegmentMB=95.4892578125, floorSegmentMB=1.26953125, forceMergeDeletesPctAllowed=13.048883622680338, segmentsPerTier=29.0, maxCFSSegmentSizeMB=8.796093022207999E12, noCFSRatio=0.0
   [junit4]   2> 2853830 INFO  (TEST-InfixSuggestersTest.test2xBuildReload-seed#[8ADD837FD715799D]) [    ] o.a.s.u.DefaultSolrCoreState New IndexWriter is ready to be used.
   [junit4]   2> 2853830 INFO  (TEST-InfixSuggestersTest.test2xBuildReload-seed#[8ADD837FD715799D]) [    ] o.a.s.s.SolrIndexSearcher Opening [Searcher@90b50c[collection1] main]
   [junit4]   2> 2853831 INFO  (TEST-InfixSuggestersTest.test2xBuildReload-seed#[8ADD837FD715799D]) [    ] o.a.s.c.SolrCore [collection1]  CLOSING SolrCore org.apache.solr.core.SolrCore@180923a
   [junit4]   2> 2853831 INFO  (TEST-InfixSuggestersTest.test2xBuildReload-seed#[8ADD837FD715799D]) [    ] o.a.s.m.SolrMetricManager Closing metric reporters for registry=solr.core.collection1, tag=25203258
   [junit4]   2> 2853831 INFO  (searcherExecutor-10897-thread-1) [    ] o.a.s.c.SolrCore [collection1] Registered new searcher Searcher@90b50c[collection1] main{ExitableDirectoryReader(UninvertingDirectoryReader())}
   [junit4]   2> 2853833 INFO  (TEST-InfixSuggestersTest.test2xBuildReload-seed#[8ADD837FD715799D]) [    ] o.a.s.SolrTestCaseJ4 ###Ending test2xBuildReload
   [junit4]   2> 2853835 INFO  (TEST-InfixSuggestersTest.testBlendedInfixSuggesterBuildThenReload-seed#[8ADD837FD715799D]) [    ] o.a.s.SolrTestCaseJ4 ###Starting testBlendedInfixSuggesterBuildThenReload
   [junit4]   2> 2853836 INFO  (TEST-InfixSuggestersTest.testBlendedInfixSuggesterBuildThenReload-seed#[8ADD837FD715799D]) [    ] o.a.s.h.c.SuggestComponent SuggestComponent prepare with : qt=/suggest_blended_infix_short_dictionary&suggest.onlyMorePopular=true&suggest.count=10&suggest=true&suggest.collate=true&suggest.buildAll=true&suggest.dictionary=shortRandomBlendedInfixSuggester&wt=xml
   [junit4]   2> 2853836 INFO  (TEST-InfixSuggestersTest.testBlendedInfixSuggesterBuildThenReload-seed#[8ADD837FD715799D]) [    ] o.a.s.s.s.SolrSuggester SolrSuggester.build(shortRandomBlendedInfixSuggester)
   [junit4]   2> 2853851 INFO  (TEST-InfixSuggestersTest.testBlendedInfixSuggesterBuildThenReload-seed#[8ADD837FD715799D]) [    ] o.a.s.s.s.RandomTestDictionaryFactory org.apache.solr.sp

[...truncated too long message...]

ces to be released
   [junit4]   2> NOTE: test params are: codec=Asserting(Lucene70): {textgrams=PostingsFormat(name=Memory), text=PostingsFormat(name=Memory), exacttext=FSTOrd50}, docValues:{weight=DocValuesFormat(name=Lucene70), text=DocValuesFormat(name=Memory)}, maxPointsInLeafNode=1642, maxMBSortInHeap=6.845745103615167, sim=RandomSimilarity(queryNorm=false): {}, locale=pt-GW, timezone=Pacific/Rarotonga
   [junit4]   2> NOTE: Windows 10 10.0 x86/Oracle Corporation 9-ea (32-bit)/cpus=3,threads=1,free=196578600,total=518979584
   [junit4]   2> NOTE: All tests run in this JVM: [TestSearchPerf, AddSchemaFieldsUpdateProcessorFactoryTest, TestDocumentBuilder, TemplateUpdateProcessorTest, TestFieldCacheReopen, DistributedQueryComponentCustomSortTest, TestSuggestSpellingConverter, OpenCloseCoreStressTest, DataDrivenBlockJoinTest, TestCustomDocTransformer, QueryEqualityTest, TestPayloadCheckQParserPlugin, ActionThrottleTest, TestMiniSolrCloudCluster, UpdateRequestProcessorFactoryTest, TestRealTimeGet, DebugComponentTest, CollectionsAPIDistributedZkTest, CoreAdminRequestStatusTest, ExternalFileFieldSortTest, ZkNodePropsTest, PropertiesRequestHandlerTest, TestPKIAuthenticationPlugin, ShardSplitTest, TestHashQParserPlugin, TestRangeQuery, TestLeaderElectionZkExpiry, RuleEngineTest, HdfsChaosMonkeySafeLeaderTest, MoreLikeThisHandlerTest, JsonLoaderTest, TestHalfAndHalfDocValues, TestComplexPhraseLeadingWildcard, DocValuesMultiTest, TestDocTermOrds, HLLUtilTest, CollectionStateFormat2Test, TestSlowCompositeReaderWrapper, BasicFunctionalityTest, TermVectorComponentTest, TestCrossCoreJoin, HdfsWriteToMultipleCollectionsTest, BasicAuthIntegrationTest, TestConfigOverlay, HdfsTlogReplayBufferedWhileIndexingTest, LeaderInitiatedRecoveryOnCommitTest, TestLuceneMatchVersion, TestShardHandlerFactory, BitVectorTest, ChaosMonkeyNothingIsSafeWithPullReplicasTest, TestAnalyzeInfixSuggestions, TestHttpShardHandlerFactory, TestPerFieldSimilarity, DistributedQueueTest, SolrRequestParserTest, HdfsDirectoryTest, LoggingHandlerTest, UtilsToolTest, AtomicUpdatesTest, TestConfigSetProperties, TestCloudJSONFacetJoinDomain, LeaderElectionIntegrationTest, DistributedQueryElevationComponentTest, TestJsonFacets, ZkStateWriterTest, TestQueryWrapperFilter, PreAnalyzedUpdateProcessorTest, DateRangeFieldTest, ShardRoutingCustomTest, DistributedFacetPivotSmallTest, DistribDocExpirationUpdateProcessorTest, TestCollationField, TestFiltering, TestSmileRequest, PingRequestHandlerTest, TestCharFilters, CustomCollectionTest, BlobRepositoryCloudTest, TestNumericRangeQuery64, BigEndianAscendingWordDeserializerTest, TlogReplayBufferedWhileIndexingTest, BaseCdcrDistributedZkTest, CloudMLTQParserTest, TestCustomSort, TestSolrIndexConfig, SuggesterFSTTest, BasicDistributedZk2Test, TolerantUpdateProcessorTest, TestDistributedMissingSort, TestSolrCloudWithKerberosAlt, IndexSchemaRuntimeFieldTest, TestIndexSearcher, TestBlobHandler, TestNoOpRegenerator, ConnectionManagerTest, StatsComponentTest, SOLR749Test, TestXmlQParserPlugin, TestSubQueryTransformerDistrib, AnalyticsQueryTest, TestEmbeddedSolrServerConstructors, MBeansHandlerTest, ConcurrentDeleteAndCreateCollectionTest, ChangedSchemaMergeTest, IgnoreCommitOptimizeUpdateProcessorFactoryTest, SolrGraphiteReporterTest, TestSubQueryTransformer, TestInPlaceUpdatesDistrib, SearchHandlerTest, OutOfBoxZkACLAndCredentialsProvidersTest, TestUniqueKeyFieldResource, TestSchemalessBufferedUpdates, FileBasedSpellCheckerTest, TestNonDefinedSimilarityFactory, TestPolicyCloud, LukeRequestHandlerTest, TestSha256AuthenticationProvider, TestStressCloudBlindAtomicUpdates, TestAnalyzedSuggestions, ExitableDirectoryReaderTest, TestPostingsSolrHighlighter, TestFieldCacheWithThreads, TestCloudSchemaless, MetricUtilsTest, CachingDirectoryFactoryTest, TestLegacyNumericUtils, TestHighFrequencyDictionaryFactory, TestFastLRUCache, HttpSolrCallGetCoreTest, BadIndexSchemaTest, TestRecovery, TestSizeLimitedDistributedMap, SegmentsInfoRequestHandlerTest, TestPointFields, TestQueryUtils, SolrIndexMetricsTest, BlockJoinFacetRandomTest, SuggestComponentContextFilterQueryTest, TestNestedDocsSort, TestTolerantUpdateProcessorCloud, SolrCoreCheckLockOnStartupTest, ConjunctionSolrSpellCheckerTest, TestCloudDeleteByQuery, ClassificationUpdateProcessorIntegrationTest, TestFilteredDocIdSet, CloneFieldUpdateProcessorFactoryTest, SystemInfoHandlerTest, TestSolrCoreParser, V2StandaloneTest, TestJettySolrRunner, PreAnalyzedFieldManagedSchemaCloudTest, DocValuesNotIndexedTest, TestReplicaProperties, EnumFieldTest, TestStressLucene, TestMergePolicyConfig, MigrateRouteKeyTest, ZkSolrClientTest, DeleteStatusTest, TestReqParamsAPI, RestartWhileUpdatingTest, TestPullReplicaErrorHandling, WrapperMergePolicyFactoryTest, TestConfigsApi, AutoCommitTest, SpatialRPTFieldTypeTest, TestSchemaResource, HighlighterMaxOffsetTest, DistributedTermsComponentTest, PKIAuthenticationIntegrationTest, SolrMetricManagerTest, TestSolrQueryParser, TestUninvertingReader, BadCopyFieldTest, ConvertedLegacyTest, HdfsNNFailoverTest, PreAnalyzedFieldTest, TestJavabinTupleStreamParser, BlockDirectoryTest, ChaosMonkeySafeLeaderTest, OverseerTest, ShardRoutingTest, BasicZkTest, FullSolrCloudDistribCmdsTest, TestRandomFaceting, LeaderElectionTest, TestZkChroot, TestRandomDVFaceting, ZkCLITest, TestDistributedSearch, TermVectorComponentDistributedTest, TestStressReorder, TestJoin, TestStressVersions, TestCoreContainer, TestSolr4Spatial, SpellCheckComponentTest, PeerSyncTest, SimplePostToolTest, AnalysisAfterCoreReloadTest, SignatureUpdateProcessorFactoryTest, SpellCheckCollatorTest, TestFoldingMultitermQuery, DocValuesTest, TestRemoteStreaming, TestSolrDeletionPolicy1, XsltUpdateRequestHandlerTest, TestSurroundQueryParser, TestWriterPerf, TestReversedWildcardFilterFactory, TestQueryTypes, DocumentBuilderTest, PathHierarchyTokenizerFactoryTest, FieldAnalysisRequestHandlerTest, SolrPluginUtilsTest, QueryParsingTest, BinaryUpdateRequestHandlerTest, TestComponentsName, UpdateParamsTest, CopyFieldTest, SolrIndexConfigTest, BadComponentTest, TestSolrDeletionPolicy2, MultiTermTest, SampleTest, TestDocSet, NumericFieldsTest, TestElisionMultitermQuery, TestConfig, OutputWriterTest, TestFuzzyAnalyzedSuggestions, TestSolrCoreProperties, DirectSolrConnectionTest, SpellPossibilityIteratorTest, SynonymTokenizerTest, TestXIncludeConfig, EchoParamsTest, TestDFRSimilarityFactory, TestLMDirichletSimilarityFactory, TestBM25SimilarityFactory, TestFastOutputStream, OpenExchangeRatesOrgProviderTest, DateMathParserTest, SpellingQueryConverterTest, TestSolrJ, TestLRUCache, FileUtilsTest, TestRTGBase, CursorPagingTest, SolrTestCaseJ4Test, TestSimpleTrackingShardHandler, ConnectionReuseTest, AssignTest, AsyncCallRequestStatusResponseTest, CdcrBootstrapTest, CollectionTooManyReplicasTest, ConfigSetsAPITest, CreateCollectionCleanupTest, DeleteReplicaTest, ForceLeaderTest, LeaderElectionContextKeyTest, LeaderFailoverAfterPartitionTest, NodeMutatorTest, OverseerCollectionConfigSetProcessorTest, OverseerModifyCollectionTest, OverseerRolesTest, OverseerStatusTest, OverseerTaskQueueTest, RecoveryAfterSoftCommitTest, SSLMigrationTest, SaslZkACLProviderTest, SharedFSAutoReplicaFailoverUtilsTest, SolrCLIZkUtilsTest, SolrXmlInZkTest, TestAuthenticationFramework, TestCloudInspectUtil, TestCloudPivotFacet, TestClusterProperties, TestConfigSetsAPI, TestDistribDocBasedVersion, TestLocalFSCloudBackupRestore, TestPrepRecovery, TestRandomRequestDistribution, TestRequestForwarding, TestRequestStatusCollectionAPI, TestSolrCloudWithSecureImpersonation, TestStressLiveNodes, TestTolerantUpdateProcessorRandomCloud, VMParamsZkACLAndCredentialsProvidersTest, AutoScalingHandlerTest, HdfsBasicDistributedZkTest, HdfsChaosMonkeyNothingIsSafeTest, HdfsRecoveryZkTest, HdfsRestartWhileUpdatingTest, HdfsSyncSliceTest, HdfsThreadLeakTest, StressHdfsTest, TestClusterStateMutator, ZkStateReaderTest, ConfigureRecoveryStrategyTest, CoreSorterTest, DirectoryFactoryTest, HdfsDirectoryFactoryTest, QueryResultKeyTest, TestCorePropertiesReload, TestCustomStream, TestImplicitCoreProperties, TestInfoStreamLogging, TestInitParams, TestNRTOpen, TestReloadAndDeleteDocs, TestSolrConfigHandler, TestSolrCloudSnapshots, TestSolrConfigHandlerCloud, InfoHandlerTest, TestApiFramework, TestCoreAdminApis, DistributedDebugComponentTest, DistributedExpandComponentTest, DistributedFacetExistsSmallTest, DistributedFacetPivotLongTailTest, DistributedFacetPivotWhiteBoxTest, InfixSuggestersTest]
   [junit4]   2> NOTE: reproduce with: ant test  -Dtestcase=InfixSuggestersTest -Dtests.seed=8ADD837FD715799D -Dtests.slow=true -Dtests.locale=pt-GW -Dtests.timezone=Pacific/Rarotonga -Dtests.asserts=true -Dtests.file.encoding=US-ASCII
   [junit4] ERROR   0.00s J1 | InfixSuggestersTest (suite) <<<
   [junit4]    > Throwable #1: java.io.IOException: Could not remove the following files (in the order of attempts):
   [junit4]    >    C:\Users\jenkins\workspace\Lucene-Solr-7.x-Windows\solr\build\solr-core\test\J1\temp\solr.handler.component.InfixSuggestersTest_8ADD837FD715799D-001\init-core-data-001: java.nio.file.AccessDeniedException: C:\Users\jenkins\workspace\Lucene-Solr-7.x-Windows\solr\build\solr-core\test\J1\temp\solr.handler.component.InfixSuggestersTest_8ADD837FD715799D-001\init-core-data-001
   [junit4]    >    C:\Users\jenkins\workspace\Lucene-Solr-7.x-Windows\solr\build\solr-core\test\J1\temp\solr.handler.component.InfixSuggestersTest_8ADD837FD715799D-001: java.nio.file.DirectoryNotEmptyException: C:\Users\jenkins\workspace\Lucene-Solr-7.x-Windows\solr\build\solr-core\test\J1\temp\solr.handler.component.InfixSuggestersTest_8ADD837FD715799D-001
   [junit4]    > 	at __randomizedtesting.SeedInfo.seed([8ADD837FD715799D]:0)
   [junit4]    > 	at org.apache.lucene.util.IOUtils.rm(IOUtils.java:329)
   [junit4]    > 	at java.base/java.lang.Thread.run(Thread.java:844)
   [junit4] Completed [609/727 (2!)] on J1 in 4.99s, 7 tests, 1 error <<< FAILURES!

[...truncated 36909 lines...]

Mime
View raw message