lucene-dev mailing list archives

Site index · List index
Message view « Date » · « Thread »
Top « Date » · « Thread »
From Apache Jenkins Server <jenk...@builds.apache.org>
Subject [JENKINS] Lucene-Solr-Tests-master - Build # 1945 - Unstable
Date Wed, 05 Jul 2017 20:22:15 GMT
Build: https://builds.apache.org/job/Lucene-Solr-Tests-master/1945/

3 tests failed.
FAILED:  org.apache.solr.cloud.ChaosMonkeyNothingIsSafeWithPullReplicasTest.test

Error Message:
Timeout occured while waiting response from server at: http://127.0.0.1:35634/d/d

Stack Trace:
org.apache.solr.client.solrj.SolrServerException: Timeout occured while waiting response from server at: http://127.0.0.1:35634/d/d
	at __randomizedtesting.SeedInfo.seed([FFF3B976A4923FDD:77A786AC0A6E5225]:0)
	at org.apache.solr.client.solrj.impl.HttpSolrClient.executeMethod(HttpSolrClient.java:637)
	at org.apache.solr.client.solrj.impl.HttpSolrClient.request(HttpSolrClient.java:252)
	at org.apache.solr.client.solrj.impl.HttpSolrClient.request(HttpSolrClient.java:241)
	at org.apache.solr.client.solrj.impl.LBHttpSolrClient.doRequest(LBHttpSolrClient.java:483)
	at org.apache.solr.client.solrj.impl.LBHttpSolrClient.request(LBHttpSolrClient.java:413)
	at org.apache.solr.client.solrj.impl.CloudSolrClient.sendRequest(CloudSolrClient.java:1121)
	at org.apache.solr.client.solrj.impl.CloudSolrClient.requestWithRetryOnStaleState(CloudSolrClient.java:862)
	at org.apache.solr.client.solrj.impl.CloudSolrClient.request(CloudSolrClient.java:793)
	at org.apache.solr.client.solrj.SolrClient.request(SolrClient.java:1219)
	at org.apache.solr.cloud.AbstractFullDistribZkTestBase.createCollection(AbstractFullDistribZkTestBase.java:1667)
	at org.apache.solr.cloud.AbstractFullDistribZkTestBase.createCollection(AbstractFullDistribZkTestBase.java:1694)
	at org.apache.solr.cloud.ChaosMonkeyNothingIsSafeWithPullReplicasTest.test(ChaosMonkeyNothingIsSafeWithPullReplicasTest.java:297)
	at sun.reflect.NativeMethodAccessorImpl.invoke0(Native Method)
	at sun.reflect.NativeMethodAccessorImpl.invoke(NativeMethodAccessorImpl.java:62)
	at sun.reflect.DelegatingMethodAccessorImpl.invoke(DelegatingMethodAccessorImpl.java:43)
	at java.lang.reflect.Method.invoke(Method.java:498)
	at com.carrotsearch.randomizedtesting.RandomizedRunner.invoke(RandomizedRunner.java:1713)
	at com.carrotsearch.randomizedtesting.RandomizedRunner$8.evaluate(RandomizedRunner.java:907)
	at com.carrotsearch.randomizedtesting.RandomizedRunner$9.evaluate(RandomizedRunner.java:943)
	at com.carrotsearch.randomizedtesting.RandomizedRunner$10.evaluate(RandomizedRunner.java:957)
	at org.apache.solr.BaseDistributedSearchTestCase$ShardsRepeatRule$ShardsFixedStatement.callStatement(BaseDistributedSearchTestCase.java:985)
	at org.apache.solr.BaseDistributedSearchTestCase$ShardsRepeatRule$ShardsStatement.evaluate(BaseDistributedSearchTestCase.java:960)
	at com.carrotsearch.randomizedtesting.rules.SystemPropertiesRestoreRule$1.evaluate(SystemPropertiesRestoreRule.java:57)
	at org.apache.lucene.util.TestRuleSetupTeardownChained$1.evaluate(TestRuleSetupTeardownChained.java:49)
	at org.apache.lucene.util.AbstractBeforeAfterRule$1.evaluate(AbstractBeforeAfterRule.java:45)
	at org.apache.lucene.util.TestRuleThreadAndTestName$1.evaluate(TestRuleThreadAndTestName.java:48)
	at org.apache.lucene.util.TestRuleIgnoreAfterMaxFailures$1.evaluate(TestRuleIgnoreAfterMaxFailures.java:64)
	at org.apache.lucene.util.TestRuleMarkFailure$1.evaluate(TestRuleMarkFailure.java:47)
	at com.carrotsearch.randomizedtesting.rules.StatementAdapter.evaluate(StatementAdapter.java:36)
	at com.carrotsearch.randomizedtesting.ThreadLeakControl$StatementRunner.run(ThreadLeakControl.java:368)
	at com.carrotsearch.randomizedtesting.ThreadLeakControl.forkTimeoutingTask(ThreadLeakControl.java:817)
	at com.carrotsearch.randomizedtesting.ThreadLeakControl$3.evaluate(ThreadLeakControl.java:468)
	at com.carrotsearch.randomizedtesting.RandomizedRunner.runSingleTest(RandomizedRunner.java:916)
	at com.carrotsearch.randomizedtesting.RandomizedRunner$5.evaluate(RandomizedRunner.java:802)
	at com.carrotsearch.randomizedtesting.RandomizedRunner$6.evaluate(RandomizedRunner.java:852)
	at com.carrotsearch.randomizedtesting.RandomizedRunner$7.evaluate(RandomizedRunner.java:863)
	at com.carrotsearch.randomizedtesting.rules.StatementAdapter.evaluate(StatementAdapter.java:36)
	at com.carrotsearch.randomizedtesting.rules.SystemPropertiesRestoreRule$1.evaluate(SystemPropertiesRestoreRule.java:57)
	at org.apache.lucene.util.AbstractBeforeAfterRule$1.evaluate(AbstractBeforeAfterRule.java:45)
	at com.carrotsearch.randomizedtesting.rules.StatementAdapter.evaluate(StatementAdapter.java:36)
	at org.apache.lucene.util.TestRuleStoreClassName$1.evaluate(TestRuleStoreClassName.java:41)
	at com.carrotsearch.randomizedtesting.rules.NoShadowingOrOverridesOnMethodsRule$1.evaluate(NoShadowingOrOverridesOnMethodsRule.java:40)
	at com.carrotsearch.randomizedtesting.rules.NoShadowingOrOverridesOnMethodsRule$1.evaluate(NoShadowingOrOverridesOnMethodsRule.java:40)
	at com.carrotsearch.randomizedtesting.rules.StatementAdapter.evaluate(StatementAdapter.java:36)
	at com.carrotsearch.randomizedtesting.rules.StatementAdapter.evaluate(StatementAdapter.java:36)
	at com.carrotsearch.randomizedtesting.rules.StatementAdapter.evaluate(StatementAdapter.java:36)
	at org.apache.lucene.util.TestRuleAssertionsRequired$1.evaluate(TestRuleAssertionsRequired.java:53)
	at org.apache.lucene.util.TestRuleMarkFailure$1.evaluate(TestRuleMarkFailure.java:47)
	at org.apache.lucene.util.TestRuleIgnoreAfterMaxFailures$1.evaluate(TestRuleIgnoreAfterMaxFailures.java:64)
	at org.apache.lucene.util.TestRuleIgnoreTestSuites$1.evaluate(TestRuleIgnoreTestSuites.java:54)
	at com.carrotsearch.randomizedtesting.rules.StatementAdapter.evaluate(StatementAdapter.java:36)
	at com.carrotsearch.randomizedtesting.ThreadLeakControl$StatementRunner.run(ThreadLeakControl.java:368)
	at java.lang.Thread.run(Thread.java:748)
Caused by: java.net.SocketTimeoutException: Read timed out
	at java.net.SocketInputStream.socketRead0(Native Method)
	at java.net.SocketInputStream.socketRead(SocketInputStream.java:116)
	at java.net.SocketInputStream.read(SocketInputStream.java:171)
	at java.net.SocketInputStream.read(SocketInputStream.java:141)
	at org.apache.http.impl.io.SessionInputBufferImpl.streamRead(SessionInputBufferImpl.java:139)
	at org.apache.http.impl.io.SessionInputBufferImpl.fillBuffer(SessionInputBufferImpl.java:155)
	at org.apache.http.impl.io.SessionInputBufferImpl.readLine(SessionInputBufferImpl.java:284)
	at org.apache.http.impl.conn.DefaultHttpResponseParser.parseHead(DefaultHttpResponseParser.java:140)
	at org.apache.http.impl.conn.DefaultHttpResponseParser.parseHead(DefaultHttpResponseParser.java:57)
	at org.apache.http.impl.io.AbstractMessageParser.parse(AbstractMessageParser.java:261)
	at org.apache.http.impl.DefaultBHttpClientConnection.receiveResponseHeader(DefaultBHttpClientConnection.java:165)
	at org.apache.http.impl.conn.CPoolProxy.receiveResponseHeader(CPoolProxy.java:167)
	at org.apache.http.protocol.HttpRequestExecutor.doReceiveResponse(HttpRequestExecutor.java:272)
	at org.apache.http.protocol.HttpRequestExecutor.execute(HttpRequestExecutor.java:124)
	at org.apache.http.impl.execchain.MainClientExec.execute(MainClientExec.java:271)
	at org.apache.http.impl.execchain.ProtocolExec.execute(ProtocolExec.java:184)
	at org.apache.http.impl.execchain.RetryExec.execute(RetryExec.java:88)
	at org.apache.http.impl.execchain.RedirectExec.execute(RedirectExec.java:110)
	at org.apache.http.impl.client.InternalHttpClient.doExecute(InternalHttpClient.java:184)
	at org.apache.http.impl.client.CloseableHttpClient.execute(CloseableHttpClient.java:82)
	at org.apache.http.impl.client.CloseableHttpClient.execute(CloseableHttpClient.java:55)
	at org.apache.solr.client.solrj.impl.HttpSolrClient.executeMethod(HttpSolrClient.java:523)
	... 52 more


FAILED:  junit.framework.TestSuite.org.apache.solr.cloud.ChaosMonkeyNothingIsSafeWithPullReplicasTest

Error Message:
3 threads leaked from SUITE scope at org.apache.solr.cloud.ChaosMonkeyNothingIsSafeWithPullReplicasTest:     1) Thread[id=5969, name=TEST-ChaosMonkeyNothingIsSafeWithPullReplicasTest.test-seed#[FFF3B976A4923FDD]-SendThread(127.0.0.1:50117), state=TIMED_WAITING, group=TGRP-ChaosMonkeyNothingIsSafeWithPullReplicasTest]         at java.lang.Thread.sleep(Native Method)         at org.apache.zookeeper.ClientCnxnSocketNIO.cleanup(ClientCnxnSocketNIO.java:230)         at org.apache.zookeeper.ClientCnxn$SendThread.cleanup(ClientCnxn.java:1246)         at org.apache.zookeeper.ClientCnxn$SendThread.run(ClientCnxn.java:1170)    2) Thread[id=5968, name=Connection evictor, state=TIMED_WAITING, group=TGRP-ChaosMonkeyNothingIsSafeWithPullReplicasTest]         at java.lang.Thread.sleep(Native Method)         at org.apache.http.impl.client.IdleConnectionEvictor$1.run(IdleConnectionEvictor.java:66)         at java.lang.Thread.run(Thread.java:748)    3) Thread[id=5970, name=TEST-ChaosMonkeyNothingIsSafeWithPullReplicasTest.test-seed#[FFF3B976A4923FDD]-EventThread, state=WAITING, group=TGRP-ChaosMonkeyNothingIsSafeWithPullReplicasTest]         at sun.misc.Unsafe.park(Native Method)         at java.util.concurrent.locks.LockSupport.park(LockSupport.java:175)         at java.util.concurrent.locks.AbstractQueuedSynchronizer$ConditionObject.await(AbstractQueuedSynchronizer.java:2039)         at java.util.concurrent.LinkedBlockingQueue.take(LinkedBlockingQueue.java:442)         at org.apache.zookeeper.ClientCnxn$EventThread.run(ClientCnxn.java:501)

Stack Trace:
com.carrotsearch.randomizedtesting.ThreadLeakError: 3 threads leaked from SUITE scope at org.apache.solr.cloud.ChaosMonkeyNothingIsSafeWithPullReplicasTest: 
   1) Thread[id=5969, name=TEST-ChaosMonkeyNothingIsSafeWithPullReplicasTest.test-seed#[FFF3B976A4923FDD]-SendThread(127.0.0.1:50117), state=TIMED_WAITING, group=TGRP-ChaosMonkeyNothingIsSafeWithPullReplicasTest]
        at java.lang.Thread.sleep(Native Method)
        at org.apache.zookeeper.ClientCnxnSocketNIO.cleanup(ClientCnxnSocketNIO.java:230)
        at org.apache.zookeeper.ClientCnxn$SendThread.cleanup(ClientCnxn.java:1246)
        at org.apache.zookeeper.ClientCnxn$SendThread.run(ClientCnxn.java:1170)
   2) Thread[id=5968, name=Connection evictor, state=TIMED_WAITING, group=TGRP-ChaosMonkeyNothingIsSafeWithPullReplicasTest]
        at java.lang.Thread.sleep(Native Method)
        at org.apache.http.impl.client.IdleConnectionEvictor$1.run(IdleConnectionEvictor.java:66)
        at java.lang.Thread.run(Thread.java:748)
   3) Thread[id=5970, name=TEST-ChaosMonkeyNothingIsSafeWithPullReplicasTest.test-seed#[FFF3B976A4923FDD]-EventThread, state=WAITING, group=TGRP-ChaosMonkeyNothingIsSafeWithPullReplicasTest]
        at sun.misc.Unsafe.park(Native Method)
        at java.util.concurrent.locks.LockSupport.park(LockSupport.java:175)
        at java.util.concurrent.locks.AbstractQueuedSynchronizer$ConditionObject.await(AbstractQueuedSynchronizer.java:2039)
        at java.util.concurrent.LinkedBlockingQueue.take(LinkedBlockingQueue.java:442)
        at org.apache.zookeeper.ClientCnxn$EventThread.run(ClientCnxn.java:501)
	at __randomizedtesting.SeedInfo.seed([FFF3B976A4923FDD]:0)


FAILED:  junit.framework.TestSuite.org.apache.solr.cloud.ChaosMonkeyNothingIsSafeWithPullReplicasTest

Error Message:
There are still zombie threads that couldn't be terminated:    1) Thread[id=5969, name=TEST-ChaosMonkeyNothingIsSafeWithPullReplicasTest.test-seed#[FFF3B976A4923FDD]-SendThread(127.0.0.1:50117), state=TIMED_WAITING, group=TGRP-ChaosMonkeyNothingIsSafeWithPullReplicasTest]         at java.lang.Thread.sleep(Native Method)         at org.apache.zookeeper.client.StaticHostProvider.next(StaticHostProvider.java:101)         at org.apache.zookeeper.ClientCnxn$SendThread.startConnect(ClientCnxn.java:997)         at org.apache.zookeeper.ClientCnxn$SendThread.run(ClientCnxn.java:1060)

Stack Trace:
com.carrotsearch.randomizedtesting.ThreadLeakError: There are still zombie threads that couldn't be terminated:
   1) Thread[id=5969, name=TEST-ChaosMonkeyNothingIsSafeWithPullReplicasTest.test-seed#[FFF3B976A4923FDD]-SendThread(127.0.0.1:50117), state=TIMED_WAITING, group=TGRP-ChaosMonkeyNothingIsSafeWithPullReplicasTest]
        at java.lang.Thread.sleep(Native Method)
        at org.apache.zookeeper.client.StaticHostProvider.next(StaticHostProvider.java:101)
        at org.apache.zookeeper.ClientCnxn$SendThread.startConnect(ClientCnxn.java:997)
        at org.apache.zookeeper.ClientCnxn$SendThread.run(ClientCnxn.java:1060)
	at __randomizedtesting.SeedInfo.seed([FFF3B976A4923FDD]:0)




Build Log:
[...truncated 11414 lines...]
   [junit4] Suite: org.apache.solr.cloud.ChaosMonkeyNothingIsSafeWithPullReplicasTest
   [junit4]   2> Creating dataDir: /x1/jenkins/jenkins-slave/workspace/Lucene-Solr-Tests-master/solr/build/solr-core/test/J2/temp/solr.cloud.ChaosMonkeyNothingIsSafeWithPullReplicasTest_FFF3B976A4923FDD-001/init-core-data-001
   [junit4]   2> 493752 WARN  (SUITE-ChaosMonkeyNothingIsSafeWithPullReplicasTest-seed#[FFF3B976A4923FDD]-worker) [    ] o.a.s.SolrTestCaseJ4 startTrackingSearchers: numOpens=2 numCloses=2
   [junit4]   2> 493752 INFO  (SUITE-ChaosMonkeyNothingIsSafeWithPullReplicasTest-seed#[FFF3B976A4923FDD]-worker) [    ] o.a.s.SolrTestCaseJ4 Using TrieFields (NUMERIC_POINTS_SYSPROP=false) w/NUMERIC_DOCVALUES_SYSPROP=true
   [junit4]   2> 493753 INFO  (SUITE-ChaosMonkeyNothingIsSafeWithPullReplicasTest-seed#[FFF3B976A4923FDD]-worker) [    ] o.a.s.SolrTestCaseJ4 Randomized ssl (false) and clientAuth (false) via: @org.apache.solr.SolrTestCaseJ4$SuppressSSL(bugUrl=https://issues.apache.org/jira/browse/SOLR-5776)
   [junit4]   2> 493753 INFO  (SUITE-ChaosMonkeyNothingIsSafeWithPullReplicasTest-seed#[FFF3B976A4923FDD]-worker) [    ] o.a.s.BaseDistributedSearchTestCase Setting hostContext system property: /d/d
   [junit4]   2> 493754 INFO  (TEST-ChaosMonkeyNothingIsSafeWithPullReplicasTest.test-seed#[FFF3B976A4923FDD]) [    ] o.a.s.c.ChaosMonkeyNothingIsSafeWithPullReplicasTest Starting ChaosMonkey test with 1 shards and 4 nodes
   [junit4]   2> 493756 INFO  (TEST-ChaosMonkeyNothingIsSafeWithPullReplicasTest.test-seed#[FFF3B976A4923FDD]) [    ] o.a.s.c.ZkTestServer STARTING ZK TEST SERVER
   [junit4]   2> 493756 INFO  (Thread-829) [    ] o.a.s.c.ZkTestServer client port:0.0.0.0/0.0.0.0:0
   [junit4]   2> 493756 INFO  (Thread-829) [    ] o.a.s.c.ZkTestServer Starting server
   [junit4]   2> 493760 ERROR (Thread-829) [    ] o.a.z.s.ZooKeeperServer ZKShutdownHandler is not registered, so ZooKeeper server won't take any action on ERROR or SHUTDOWN server state changes
   [junit4]   2> 493856 INFO  (TEST-ChaosMonkeyNothingIsSafeWithPullReplicasTest.test-seed#[FFF3B976A4923FDD]) [    ] o.a.s.c.ZkTestServer start zk server on port:50117
   [junit4]   2> 493868 INFO  (TEST-ChaosMonkeyNothingIsSafeWithPullReplicasTest.test-seed#[FFF3B976A4923FDD]) [    ] o.a.s.c.AbstractZkTestCase put /x1/jenkins/jenkins-slave/workspace/Lucene-Solr-Tests-master/solr/core/src/test-files/solr/collection1/conf/solrconfig-tlog.xml to /configs/conf1/solrconfig.xml
   [junit4]   2> 493870 INFO  (TEST-ChaosMonkeyNothingIsSafeWithPullReplicasTest.test-seed#[FFF3B976A4923FDD]) [    ] o.a.s.c.AbstractZkTestCase put /x1/jenkins/jenkins-slave/workspace/Lucene-Solr-Tests-master/solr/core/src/test-files/solr/collection1/conf/schema15.xml to /configs/conf1/schema.xml
   [junit4]   2> 493876 INFO  (TEST-ChaosMonkeyNothingIsSafeWithPullReplicasTest.test-seed#[FFF3B976A4923FDD]) [    ] o.a.s.c.AbstractZkTestCase put /x1/jenkins/jenkins-slave/workspace/Lucene-Solr-Tests-master/solr/core/src/test-files/solr/collection1/conf/solrconfig.snippet.randomindexconfig.xml to /configs/conf1/solrconfig.snippet.randomindexconfig.xml
   [junit4]   2> 493877 INFO  (TEST-ChaosMonkeyNothingIsSafeWithPullReplicasTest.test-seed#[FFF3B976A4923FDD]) [    ] o.a.s.c.AbstractZkTestCase put /x1/jenkins/jenkins-slave/workspace/Lucene-Solr-Tests-master/solr/core/src/test-files/solr/collection1/conf/stopwords.txt to /configs/conf1/stopwords.txt
   [junit4]   2> 493878 INFO  (TEST-ChaosMonkeyNothingIsSafeWithPullReplicasTest.test-seed#[FFF3B976A4923FDD]) [    ] o.a.s.c.AbstractZkTestCase put /x1/jenkins/jenkins-slave/workspace/Lucene-Solr-Tests-master/solr/core/src/test-files/solr/collection1/conf/protwords.txt to /configs/conf1/protwords.txt
   [junit4]   2> 493880 INFO  (TEST-ChaosMonkeyNothingIsSafeWithPullReplicasTest.test-seed#[FFF3B976A4923FDD]) [    ] o.a.s.c.AbstractZkTestCase put /x1/jenkins/jenkins-slave/workspace/Lucene-Solr-Tests-master/solr/core/src/test-files/solr/collection1/conf/currency.xml to /configs/conf1/currency.xml
   [junit4]   2> 493881 INFO  (TEST-ChaosMonkeyNothingIsSafeWithPullReplicasTest.test-seed#[FFF3B976A4923FDD]) [    ] o.a.s.c.AbstractZkTestCase put /x1/jenkins/jenkins-slave/workspace/Lucene-Solr-Tests-master/solr/core/src/test-files/solr/collection1/conf/enumsConfig.xml to /configs/conf1/enumsConfig.xml
   [junit4]   2> 493883 INFO  (TEST-ChaosMonkeyNothingIsSafeWithPullReplicasTest.test-seed#[FFF3B976A4923FDD]) [    ] o.a.s.c.AbstractZkTestCase put /x1/jenkins/jenkins-slave/workspace/Lucene-Solr-Tests-master/solr/core/src/test-files/solr/collection1/conf/open-exchange-rates.json to /configs/conf1/open-exchange-rates.json
   [junit4]   2> 493884 INFO  (TEST-ChaosMonkeyNothingIsSafeWithPullReplicasTest.test-seed#[FFF3B976A4923FDD]) [    ] o.a.s.c.AbstractZkTestCase put /x1/jenkins/jenkins-slave/workspace/Lucene-Solr-Tests-master/solr/core/src/test-files/solr/collection1/conf/mapping-ISOLatin1Accent.txt to /configs/conf1/mapping-ISOLatin1Accent.txt
   [junit4]   2> 493885 INFO  (TEST-ChaosMonkeyNothingIsSafeWithPullReplicasTest.test-seed#[FFF3B976A4923FDD]) [    ] o.a.s.c.AbstractZkTestCase put /x1/jenkins/jenkins-slave/workspace/Lucene-Solr-Tests-master/solr/core/src/test-files/solr/collection1/conf/old_synonyms.txt to /configs/conf1/old_synonyms.txt
   [junit4]   2> 493887 INFO  (TEST-ChaosMonkeyNothingIsSafeWithPullReplicasTest.test-seed#[FFF3B976A4923FDD]) [    ] o.a.s.c.AbstractZkTestCase put /x1/jenkins/jenkins-slave/workspace/Lucene-Solr-Tests-master/solr/core/src/test-files/solr/collection1/conf/synonyms.txt to /configs/conf1/synonyms.txt
   [junit4]   2> 493888 INFO  (TEST-ChaosMonkeyNothingIsSafeWithPullReplicasTest.test-seed#[FFF3B976A4923FDD]) [    ] o.a.s.c.AbstractFullDistribZkTestBase Will use TLOG replicas unless explicitly asked otherwise
   [junit4]   2> 494017 INFO  (TEST-ChaosMonkeyNothingIsSafeWithPullReplicasTest.test-seed#[FFF3B976A4923FDD]) [    ] o.e.j.s.Server jetty-9.3.14.v20161028
   [junit4]   2> 494038 INFO  (TEST-ChaosMonkeyNothingIsSafeWithPullReplicasTest.test-seed#[FFF3B976A4923FDD]) [    ] o.e.j.s.h.ContextHandler Started o.e.j.s.ServletContextHandler@16ac9727{/d/d,null,AVAILABLE}
   [junit4]   2> 494038 INFO  (TEST-ChaosMonkeyNothingIsSafeWithPullReplicasTest.test-seed#[FFF3B976A4923FDD]) [    ] o.e.j.s.AbstractConnector Started ServerConnector@460c04b7{HTTP/1.1,[http/1.1]}{127.0.0.1:42957}
   [junit4]   2> 494038 INFO  (TEST-ChaosMonkeyNothingIsSafeWithPullReplicasTest.test-seed#[FFF3B976A4923FDD]) [    ] o.e.j.s.Server Started @496958ms
   [junit4]   2> 494038 INFO  (TEST-ChaosMonkeyNothingIsSafeWithPullReplicasTest.test-seed#[FFF3B976A4923FDD]) [    ] o.a.s.c.s.e.JettySolrRunner Jetty properties: {solr.data.dir=/x1/jenkins/jenkins-slave/workspace/Lucene-Solr-Tests-master/solr/build/solr-core/test/J2/temp/solr.cloud.ChaosMonkeyNothingIsSafeWithPullReplicasTest_FFF3B976A4923FDD-001/tempDir-001/control/data, replicaType=NRT, hostContext=/d/d, hostPort=42957, coreRootDirectory=/x1/jenkins/jenkins-slave/workspace/Lucene-Solr-Tests-master/solr/build/solr-core/test/J2/temp/solr.cloud.ChaosMonkeyNothingIsSafeWithPullReplicasTest_FFF3B976A4923FDD-001/control-001/cores}
   [junit4]   2> 494039 ERROR (TEST-ChaosMonkeyNothingIsSafeWithPullReplicasTest.test-seed#[FFF3B976A4923FDD]) [    ] o.a.s.s.StartupLoggingUtils Missing Java Option solr.log.dir. Logging may be missing or incomplete.
   [junit4]   2> 494039 INFO  (TEST-ChaosMonkeyNothingIsSafeWithPullReplicasTest.test-seed#[FFF3B976A4923FDD]) [    ] o.a.s.s.SolrDispatchFilter  ___      _       Welcome to Apache Solr™ version 8.0.0
   [junit4]   2> 494039 INFO  (TEST-ChaosMonkeyNothingIsSafeWithPullReplicasTest.test-seed#[FFF3B976A4923FDD]) [    ] o.a.s.s.SolrDispatchFilter / __| ___| |_ _   Starting in cloud mode on port null
   [junit4]   2> 494039 INFO  (TEST-ChaosMonkeyNothingIsSafeWithPullReplicasTest.test-seed#[FFF3B976A4923FDD]) [    ] o.a.s.s.SolrDispatchFilter \__ \/ _ \ | '_|  Install dir: null, Default config dir: null
   [junit4]   2> 494039 INFO  (TEST-ChaosMonkeyNothingIsSafeWithPullReplicasTest.test-seed#[FFF3B976A4923FDD]) [    ] o.a.s.s.SolrDispatchFilter |___/\___/_|_|    Start time: 2017-07-05T19:40:55.637Z
   [junit4]   2> 494042 INFO  (TEST-ChaosMonkeyNothingIsSafeWithPullReplicasTest.test-seed#[FFF3B976A4923FDD]) [    ] o.a.s.s.SolrDispatchFilter Loading solr.xml from SolrHome (not found in ZooKeeper)
   [junit4]   2> 494042 INFO  (TEST-ChaosMonkeyNothingIsSafeWithPullReplicasTest.test-seed#[FFF3B976A4923FDD]) [    ] o.a.s.c.SolrXmlConfig Loading container configuration from /x1/jenkins/jenkins-slave/workspace/Lucene-Solr-Tests-master/solr/build/solr-core/test/J2/temp/solr.cloud.ChaosMonkeyNothingIsSafeWithPullReplicasTest_FFF3B976A4923FDD-001/control-001/solr.xml
   [junit4]   2> 494048 INFO  (TEST-ChaosMonkeyNothingIsSafeWithPullReplicasTest.test-seed#[FFF3B976A4923FDD]) [    ] o.a.s.c.SolrXmlConfig MBean server found: com.sun.jmx.mbeanserver.JmxMBeanServer@7eeda257, but no JMX reporters were configured - adding default JMX reporter.
   [junit4]   2> 494051 INFO  (TEST-ChaosMonkeyNothingIsSafeWithPullReplicasTest.test-seed#[FFF3B976A4923FDD]) [    ] o.a.s.c.ZkContainer Zookeeper client=127.0.0.1:50117/solr
   [junit4]   2> 494155 INFO  (TEST-ChaosMonkeyNothingIsSafeWithPullReplicasTest.test-seed#[FFF3B976A4923FDD]) [n:127.0.0.1:42957_d%2Fd    ] o.a.s.c.Overseer Overseer (id=null) closing
   [junit4]   2> 494156 INFO  (TEST-ChaosMonkeyNothingIsSafeWithPullReplicasTest.test-seed#[FFF3B976A4923FDD]) [n:127.0.0.1:42957_d%2Fd    ] o.a.s.c.OverseerElectionContext I am going to be the leader 127.0.0.1:42957_d%2Fd
   [junit4]   2> 494157 INFO  (TEST-ChaosMonkeyNothingIsSafeWithPullReplicasTest.test-seed#[FFF3B976A4923FDD]) [n:127.0.0.1:42957_d%2Fd    ] o.a.s.c.Overseer Overseer (id=98257053637476356-127.0.0.1:42957_d%2Fd-n_0000000000) starting
   [junit4]   2> 494164 INFO  (TEST-ChaosMonkeyNothingIsSafeWithPullReplicasTest.test-seed#[FFF3B976A4923FDD]) [n:127.0.0.1:42957_d%2Fd    ] o.a.s.c.ZkController Register node as live in ZooKeeper:/live_nodes/127.0.0.1:42957_d%2Fd
   [junit4]   2> 494165 INFO  (zkCallback-1703-thread-1-processing-n:127.0.0.1:42957_d%2Fd) [n:127.0.0.1:42957_d%2Fd    ] o.a.s.c.c.ZkStateReader Updated live nodes from ZooKeeper... (0) -> (1)
   [junit4]   2> 494234 INFO  (TEST-ChaosMonkeyNothingIsSafeWithPullReplicasTest.test-seed#[FFF3B976A4923FDD]) [n:127.0.0.1:42957_d%2Fd    ] o.a.s.m.r.SolrJmxReporter JMX monitoring for 'solr.node' (registry 'solr.node') enabled at server: com.sun.jmx.mbeanserver.JmxMBeanServer@7eeda257
   [junit4]   2> 494240 INFO  (TEST-ChaosMonkeyNothingIsSafeWithPullReplicasTest.test-seed#[FFF3B976A4923FDD]) [n:127.0.0.1:42957_d%2Fd    ] o.a.s.m.r.SolrJmxReporter JMX monitoring for 'solr.jvm' (registry 'solr.jvm') enabled at server: com.sun.jmx.mbeanserver.JmxMBeanServer@7eeda257
   [junit4]   2> 494241 INFO  (TEST-ChaosMonkeyNothingIsSafeWithPullReplicasTest.test-seed#[FFF3B976A4923FDD]) [n:127.0.0.1:42957_d%2Fd    ] o.a.s.m.r.SolrJmxReporter JMX monitoring for 'solr.jetty' (registry 'solr.jetty') enabled at server: com.sun.jmx.mbeanserver.JmxMBeanServer@7eeda257
   [junit4]   2> 494242 INFO  (TEST-ChaosMonkeyNothingIsSafeWithPullReplicasTest.test-seed#[FFF3B976A4923FDD]) [n:127.0.0.1:42957_d%2Fd    ] o.a.s.c.CorePropertiesLocator Found 0 core definitions underneath /x1/jenkins/jenkins-slave/workspace/Lucene-Solr-Tests-master/solr/build/solr-core/test/J2/temp/solr.cloud.ChaosMonkeyNothingIsSafeWithPullReplicasTest_FFF3B976A4923FDD-001/control-001/cores
   [junit4]   2> 494263 INFO  (TEST-ChaosMonkeyNothingIsSafeWithPullReplicasTest.test-seed#[FFF3B976A4923FDD]) [    ] o.a.s.c.c.ZkStateReader Updated live nodes from ZooKeeper... (0) -> (1)
   [junit4]   2> 494264 INFO  (TEST-ChaosMonkeyNothingIsSafeWithPullReplicasTest.test-seed#[FFF3B976A4923FDD]) [    ] o.a.s.c.s.i.ZkClientClusterStateProvider Cluster at 127.0.0.1:50117/solr ready
   [junit4]   2> 494266 INFO  (qtp294695345-5936) [n:127.0.0.1:42957_d%2Fd    ] o.a.s.h.a.CollectionsHandler Invoked Collection Action :create with params replicationFactor=1&collection.configName=conf1&name=control_collection&nrtReplicas=1&action=CREATE&numShards=1&createNodeSet=127.0.0.1:42957_d%252Fd&wt=javabin&version=2 and sendToOCPQueue=true
   [junit4]   2> 494269 INFO  (OverseerThreadFactory-2169-thread-1-processing-n:127.0.0.1:42957_d%2Fd) [n:127.0.0.1:42957_d%2Fd    ] o.a.s.c.CreateCollectionCmd Create collection control_collection
   [junit4]   2> 494374 INFO  (qtp294695345-5933) [n:127.0.0.1:42957_d%2Fd    ] o.a.s.h.a.CoreAdminOperation core create command qt=/admin/cores&collection.configName=conf1&newCollection=true&name=control_collection_shard1_replica_n1&action=CREATE&numShards=1&collection=control_collection&shard=shard1&wt=javabin&version=2&replicaType=NRT
   [junit4]   2> 494375 INFO  (qtp294695345-5933) [n:127.0.0.1:42957_d%2Fd    ] o.a.s.c.TransientSolrCoreCacheDefault Allocating transient cache for 4 transient cores
   [junit4]   2> 494481 INFO  (zkCallback-1703-thread-1-processing-n:127.0.0.1:42957_d%2Fd) [n:127.0.0.1:42957_d%2Fd    ] o.a.s.c.c.ZkStateReader A cluster state change: [WatchedEvent state:SyncConnected type:NodeDataChanged path:/collections/control_collection/state.json] for collection [control_collection] has occurred - updating... (live nodes size: [1])
   [junit4]   2> 495398 INFO  (qtp294695345-5933) [n:127.0.0.1:42957_d%2Fd c:control_collection s:shard1  x:control_collection_shard1_replica_n1] o.a.s.c.SolrConfig Using Lucene MatchVersion: 8.0.0
   [junit4]   2> 495411 INFO  (qtp294695345-5933) [n:127.0.0.1:42957_d%2Fd c:control_collection s:shard1  x:control_collection_shard1_replica_n1] o.a.s.s.IndexSchema [control_collection_shard1_replica_n1] Schema name=test
   [junit4]   2> 495496 INFO  (qtp294695345-5933) [n:127.0.0.1:42957_d%2Fd c:control_collection s:shard1  x:control_collection_shard1_replica_n1] o.a.s.s.IndexSchema Loaded schema test/1.6 with uniqueid field id
   [junit4]   2> 495513 INFO  (qtp294695345-5933) [n:127.0.0.1:42957_d%2Fd c:control_collection s:shard1  x:control_collection_shard1_replica_n1] o.a.s.c.CoreContainer Creating SolrCore 'control_collection_shard1_replica_n1' using configuration from collection control_collection, trusted=true
   [junit4]   2> 495514 INFO  (qtp294695345-5933) [n:127.0.0.1:42957_d%2Fd c:control_collection s:shard1  x:control_collection_shard1_replica_n1] o.a.s.m.r.SolrJmxReporter JMX monitoring for 'solr.core.control_collection.shard1.replica_n1' (registry 'solr.core.control_collection.shard1.replica_n1') enabled at server: com.sun.jmx.mbeanserver.JmxMBeanServer@7eeda257
   [junit4]   2> 495520 INFO  (qtp294695345-5933) [n:127.0.0.1:42957_d%2Fd c:control_collection s:shard1  x:control_collection_shard1_replica_n1] o.a.s.c.SolrCore solr.RecoveryStrategy.Builder
   [junit4]   2> 495520 INFO  (qtp294695345-5933) [n:127.0.0.1:42957_d%2Fd c:control_collection s:shard1  x:control_collection_shard1_replica_n1] o.a.s.c.SolrCore [[control_collection_shard1_replica_n1] ] Opening new SolrCore at [/x1/jenkins/jenkins-slave/workspace/Lucene-Solr-Tests-master/solr/build/solr-core/test/J2/temp/solr.cloud.ChaosMonkeyNothingIsSafeWithPullReplicasTest_FFF3B976A4923FDD-001/control-001/cores/control_collection_shard1_replica_n1], dataDir=[/x1/jenkins/jenkins-slave/workspace/Lucene-Solr-Tests-master/solr/build/solr-core/test/J2/temp/solr.cloud.ChaosMonkeyNothingIsSafeWithPullReplicasTest_FFF3B976A4923FDD-001/control-001/cores/control_collection_shard1_replica_n1/data/]
   [junit4]   2> 495524 INFO  (qtp294695345-5933) [n:127.0.0.1:42957_d%2Fd c:control_collection s:shard1  x:control_collection_shard1_replica_n1] o.a.s.u.RandomMergePolicy RandomMergePolicy wrapping class org.apache.lucene.index.LogDocMergePolicy: [LogDocMergePolicy: minMergeSize=1000, mergeFactor=39, maxMergeSize=9223372036854775807, maxMergeSizeForForcedMerge=9223372036854775807, calibrateSizeByDeletes=true, maxMergeDocs=2147483647, maxCFSSegmentSizeMB=8.796093022207999E12, noCFSRatio=0.0]
   [junit4]   2> 495533 WARN  (qtp294695345-5933) [n:127.0.0.1:42957_d%2Fd c:control_collection s:shard1  x:control_collection_shard1_replica_n1] o.a.s.c.RequestHandlers INVALID paramSet a in requestHandler {type = requestHandler,name = /dump,class = DumpRequestHandler,attributes = {initParams=a, name=/dump, class=DumpRequestHandler},args = {defaults={a=A,b=B}}}
   [junit4]   2> 495586 INFO  (qtp294695345-5933) [n:127.0.0.1:42957_d%2Fd c:control_collection s:shard1  x:control_collection_shard1_replica_n1] o.a.s.u.UpdateHandler Using UpdateLog implementation: org.apache.solr.update.UpdateLog
   [junit4]   2> 495586 INFO  (qtp294695345-5933) [n:127.0.0.1:42957_d%2Fd c:control_collection s:shard1  x:control_collection_shard1_replica_n1] o.a.s.u.UpdateLog Initializing UpdateLog: dataDir= defaultSyncLevel=FLUSH numRecordsToKeep=100 maxNumLogsToKeep=10 numVersionBuckets=65536
   [junit4]   2> 495587 INFO  (qtp294695345-5933) [n:127.0.0.1:42957_d%2Fd c:control_collection s:shard1  x:control_collection_shard1_replica_n1] o.a.s.u.CommitTracker Hard AutoCommit: if uncommited for 15000ms; 
   [junit4]   2> 495587 INFO  (qtp294695345-5933) [n:127.0.0.1:42957_d%2Fd c:control_collection s:shard1  x:control_collection_shard1_replica_n1] o.a.s.u.CommitTracker Soft AutoCommit: disabled
   [junit4]   2> 495589 INFO  (qtp294695345-5933) [n:127.0.0.1:42957_d%2Fd c:control_collection s:shard1  x:control_collection_shard1_replica_n1] o.a.s.u.RandomMergePolicy RandomMergePolicy wrapping class org.apache.lucene.index.TieredMergePolicy: [TieredMergePolicy: maxMergeAtOnce=13, maxMergeAtOnceExplicit=44, maxMergedSegmentMB=49.30078125, floorSegmentMB=0.4638671875, forceMergeDeletesPctAllowed=4.699991737354454, segmentsPerTier=31.0, maxCFSSegmentSizeMB=8.796093022207999E12, noCFSRatio=1.0
   [junit4]   2> 495589 INFO  (qtp294695345-5933) [n:127.0.0.1:42957_d%2Fd c:control_collection s:shard1  x:control_collection_shard1_replica_n1] o.a.s.s.SolrIndexSearcher Opening [Searcher@6d8342d9[control_collection_shard1_replica_n1] main]
   [junit4]   2> 495595 INFO  (qtp294695345-5933) [n:127.0.0.1:42957_d%2Fd c:control_collection s:shard1  x:control_collection_shard1_replica_n1] o.a.s.r.ManagedResourceStorage Configured ZooKeeperStorageIO with znodeBase: /configs/conf1
   [junit4]   2> 495596 INFO  (qtp294695345-5933) [n:127.0.0.1:42957_d%2Fd c:control_collection s:shard1  x:control_collection_shard1_replica_n1] o.a.s.r.ManagedResourceStorage Loaded null at path _rest_managed.json using ZooKeeperStorageIO:path=/configs/conf1
   [junit4]   2> 495597 INFO  (qtp294695345-5933) [n:127.0.0.1:42957_d%2Fd c:control_collection s:shard1  x:control_collection_shard1_replica_n1] o.a.s.h.ReplicationHandler Commits will be reserved for  10000
   [junit4]   2> 495598 INFO  (searcherExecutor-2172-thread-1-processing-n:127.0.0.1:42957_d%2Fd x:control_collection_shard1_replica_n1 s:shard1 c:control_collection) [n:127.0.0.1:42957_d%2Fd c:control_collection s:shard1  x:control_collection_shard1_replica_n1] o.a.s.c.SolrCore [control_collection_shard1_replica_n1] Registered new searcher Searcher@6d8342d9[control_collection_shard1_replica_n1] main{ExitableDirectoryReader(UninvertingDirectoryReader())}
   [junit4]   2> 495598 INFO  (qtp294695345-5933) [n:127.0.0.1:42957_d%2Fd c:control_collection s:shard1  x:control_collection_shard1_replica_n1] o.a.s.u.UpdateLog Could not find max version in index or recent updates, using new clock 1572112860127952896
   [junit4]   2> 495605 INFO  (qtp294695345-5933) [n:127.0.0.1:42957_d%2Fd c:control_collection s:shard1  x:control_collection_shard1_replica_n1] o.a.s.c.ShardLeaderElectionContext Enough replicas found to continue.
   [junit4]   2> 495605 INFO  (qtp294695345-5933) [n:127.0.0.1:42957_d%2Fd c:control_collection s:shard1  x:control_collection_shard1_replica_n1] o.a.s.c.ShardLeaderElectionContext I may be the new leader - try and sync
   [junit4]   2> 495605 INFO  (qtp294695345-5933) [n:127.0.0.1:42957_d%2Fd c:control_collection s:shard1  x:control_collection_shard1_replica_n1] o.a.s.c.SyncStrategy Sync replicas to http://127.0.0.1:42957/d/d/control_collection_shard1_replica_n1/
   [junit4]   2> 495605 INFO  (qtp294695345-5933) [n:127.0.0.1:42957_d%2Fd c:control_collection s:shard1  x:control_collection_shard1_replica_n1] o.a.s.c.SyncStrategy Sync Success - now sync replicas to me
   [junit4]   2> 495605 INFO  (qtp294695345-5933) [n:127.0.0.1:42957_d%2Fd c:control_collection s:shard1  x:control_collection_shard1_replica_n1] o.a.s.c.SyncStrategy http://127.0.0.1:42957/d/d/control_collection_shard1_replica_n1/ has no replicas
   [junit4]   2> 495605 INFO  (qtp294695345-5933) [n:127.0.0.1:42957_d%2Fd c:control_collection s:shard1  x:control_collection_shard1_replica_n1] o.a.s.c.ShardLeaderElectionContext Found all replicas participating in election, clear LIR
   [junit4]   2> 495609 INFO  (qtp294695345-5933) [n:127.0.0.1:42957_d%2Fd c:control_collection s:shard1  x:control_collection_shard1_replica_n1] o.a.s.c.ShardLeaderElectionContext I am the new leader: http://127.0.0.1:42957/d/d/control_collection_shard1_replica_n1/ shard1
   [junit4]   2> 495711 INFO  (zkCallback-1703-thread-1-processing-n:127.0.0.1:42957_d%2Fd) [n:127.0.0.1:42957_d%2Fd    ] o.a.s.c.c.ZkStateReader A cluster state change: [WatchedEvent state:SyncConnected type:NodeDataChanged path:/collections/control_collection/state.json] for collection [control_collection] has occurred - updating... (live nodes size: [1])
   [junit4]   2> 495760 INFO  (qtp294695345-5933) [n:127.0.0.1:42957_d%2Fd c:control_collection s:shard1  x:control_collection_shard1_replica_n1] o.a.s.c.ZkController I am the leader, no recovery necessary
   [junit4]   2> 495763 INFO  (qtp294695345-5933) [n:127.0.0.1:42957_d%2Fd c:control_collection s:shard1  x:control_collection_shard1_replica_n1] o.a.s.s.HttpSolrCall [admin] webapp=null path=/admin/cores params={qt=/admin/cores&collection.configName=conf1&newCollection=true&name=control_collection_shard1_replica_n1&action=CREATE&numShards=1&collection=control_collection&shard=shard1&wt=javabin&version=2&replicaType=NRT} status=0 QTime=1389
   [junit4]   2> 495766 INFO  (qtp294695345-5936) [n:127.0.0.1:42957_d%2Fd    ] o.a.s.h.a.CollectionsHandler Wait for new collection to be active for at most 30 seconds. Check all shard replicas
   [junit4]   2> 495864 INFO  (zkCallback-1703-thread-1-processing-n:127.0.0.1:42957_d%2Fd) [n:127.0.0.1:42957_d%2Fd    ] o.a.s.c.c.ZkStateReader A cluster state change: [WatchedEvent state:SyncConnected type:NodeDataChanged path:/collections/control_collection/state.json] for collection [control_collection] has occurred - updating... (live nodes size: [1])
   [junit4]   2> 496271 INFO  (OverseerCollectionConfigSetProcessor-98257053637476356-127.0.0.1:42957_d%2Fd-n_0000000000) [n:127.0.0.1:42957_d%2Fd    ] o.a.s.c.OverseerTaskQueue Response ZK path: /overseer/collection-queue-work/qnr-0000000000 doesn't exist.  Requestor may have disconnected from ZooKeeper
   [junit4]   2> 496766 INFO  (qtp294695345-5936) [n:127.0.0.1:42957_d%2Fd    ] o.a.s.s.HttpSolrCall [admin] webapp=null path=/admin/collections params={replicationFactor=1&collection.configName=conf1&name=control_collection&nrtReplicas=1&action=CREATE&numShards=1&createNodeSet=127.0.0.1:42957_d%252Fd&wt=javabin&version=2} status=0 QTime=2499
   [junit4]   2> 496774 INFO  (TEST-ChaosMonkeyNothingIsSafeWithPullReplicasTest.test-seed#[FFF3B976A4923FDD]) [    ] o.a.s.c.c.ZkStateReader Updated live nodes from ZooKeeper... (0) -> (1)
   [junit4]   2> 496775 INFO  (TEST-ChaosMonkeyNothingIsSafeWithPullReplicasTest.test-seed#[FFF3B976A4923FDD]) [    ] o.a.s.c.s.i.ZkClientClusterStateProvider Cluster at 127.0.0.1:50117/solr ready
   [junit4]   2> 496776 INFO  (TEST-ChaosMonkeyNothingIsSafeWithPullReplicasTest.test-seed#[FFF3B976A4923FDD]) [    ] o.a.s.c.ChaosMonkey monkey: init - expire sessions:false cause connection loss:false
   [junit4]   2> 496777 INFO  (qtp294695345-5938) [n:127.0.0.1:42957_d%2Fd    ] o.a.s.h.a.CollectionsHandler Invoked Collection Action :create with params replicationFactor=1&collection.configName=conf1&name=collection1&nrtReplicas=1&action=CREATE&numShards=1&createNodeSet=&stateFormat=2&wt=javabin&version=2 and sendToOCPQueue=true
   [junit4]   2> 496779 INFO  (OverseerThreadFactory-2169-thread-2-processing-n:127.0.0.1:42957_d%2Fd) [n:127.0.0.1:42957_d%2Fd    ] o.a.s.c.CreateCollectionCmd Create collection collection1
   [junit4]   2> 496780 WARN  (OverseerThreadFactory-2169-thread-2-processing-n:127.0.0.1:42957_d%2Fd) [n:127.0.0.1:42957_d%2Fd    ] o.a.s.c.CreateCollectionCmd It is unusual to create a collection (collection1) without cores.
   [junit4]   2> 496984 INFO  (qtp294695345-5938) [n:127.0.0.1:42957_d%2Fd    ] o.a.s.h.a.CollectionsHandler Wait for new collection to be active for at most 30 seconds. Check all shard replicas
   [junit4]   2> 496984 INFO  (qtp294695345-5938) [n:127.0.0.1:42957_d%2Fd    ] o.a.s.s.HttpSolrCall [admin] webapp=null path=/admin/collections params={replicationFactor=1&collection.configName=conf1&name=collection1&nrtReplicas=1&action=CREATE&numShards=1&createNodeSet=&stateFormat=2&wt=javabin&version=2} status=0 QTime=207
   [junit4]   2> 497110 INFO  (TEST-ChaosMonkeyNothingIsSafeWithPullReplicasTest.test-seed#[FFF3B976A4923FDD]) [    ] o.a.s.c.AbstractFullDistribZkTestBase create jetty 1 in directory /x1/jenkins/jenkins-slave/workspace/Lucene-Solr-Tests-master/solr/build/solr-core/test/J2/temp/solr.cloud.ChaosMonkeyNothingIsSafeWithPullReplicasTest_FFF3B976A4923FDD-001/shard-1-001 of type TLOG
   [junit4]   2> 497110 INFO  (TEST-ChaosMonkeyNothingIsSafeWithPullReplicasTest.test-seed#[FFF3B976A4923FDD]) [    ] o.e.j.s.Server jetty-9.3.14.v20161028
   [junit4]   2> 497112 INFO  (TEST-ChaosMonkeyNothingIsSafeWithPullReplicasTest.test-seed#[FFF3B976A4923FDD]) [    ] o.e.j.s.h.ContextHandler Started o.e.j.s.ServletContextHandler@332ea7ba{/d/d,null,AVAILABLE}
   [junit4]   2> 497112 INFO  (TEST-ChaosMonkeyNothingIsSafeWithPullReplicasTest.test-seed#[FFF3B976A4923FDD]) [    ] o.e.j.s.AbstractConnector Started ServerConnector@6de60ab2{HTTP/1.1,[http/1.1]}{127.0.0.1:35634}
   [junit4]   2> 497112 INFO  (TEST-ChaosMonkeyNothingIsSafeWithPullReplicasTest.test-seed#[FFF3B976A4923FDD]) [    ] o.e.j.s.Server Started @500032ms
   [junit4]   2> 497112 INFO  (TEST-ChaosMonkeyNothingIsSafeWithPullReplicasTest.test-seed#[FFF3B976A4923FDD]) [    ] o.a.s.c.s.e.JettySolrRunner Jetty properties: {solr.data.dir=/x1/jenkins/jenkins-slave/workspace/Lucene-Solr-Tests-master/solr/build/solr-core/test/J2/temp/solr.cloud.ChaosMonkeyNothingIsSafeWithPullReplicasTest_FFF3B976A4923FDD-001/tempDir-001/jetty1, replicaType=TLOG, solrconfig=solrconfig.xml, hostContext=/d/d, hostPort=35634, coreRootDirectory=/x1/jenkins/jenkins-slave/workspace/Lucene-Solr-Tests-master/solr/build/solr-core/test/J2/temp/solr.cloud.ChaosMonkeyNothingIsSafeWithPullReplicasTest_FFF3B976A4923FDD-001/shard-1-001/cores}
   [junit4]   2> 497113 ERROR (TEST-ChaosMonkeyNothingIsSafeWithPullReplicasTest.test-seed#[FFF3B976A4923FDD]) [    ] o.a.s.s.StartupLoggingUtils Missing Java Option solr.log.dir. Logging may be missing or incomplete.
   [junit4]   2> 497113 INFO  (TEST-ChaosMonkeyNothingIsSafeWithPullReplicasTest.test-seed#[FFF3B976A4923FDD]) [    ] o.a.s.s.SolrDispatchFilter  ___      _       Welcome to Apache Solr™ version 8.0.0
   [junit4]   2> 497113 INFO  (TEST-ChaosMonkeyNothingIsSafeWithPullReplicasTest.test-seed#[FFF3B976A4923FDD]) [    ] o.a.s.s.SolrDispatchFilter / __| ___| |_ _   Starting in cloud mode on port null
   [junit4]   2> 497113 INFO  (TEST-ChaosMonkeyNothingIsSafeWithPullReplicasTest.test-seed#[FFF3B976A4923FDD]) [    ] o.a.s.s.SolrDispatchFilter \__ \/ _ \ | '_|  Install dir: null, Default config dir: null
   [junit4]   2> 497113 INFO  (TEST-ChaosMonkeyNothingIsSafeWithPullReplicasTest.test-seed#[FFF3B976A4923FDD]) [    ] o.a.s.s.SolrDispatchFilter |___/\___/_|_|    Start time: 2017-07-05T19:40:58.711Z
   [junit4]   2> 497116 INFO  (TEST-ChaosMonkeyNothingIsSafeWithPullReplicasTest.test-seed#[FFF3B976A4923FDD]) [    ] o.a.s.s.SolrDispatchFilter Loading solr.xml from SolrHome (not found in ZooKeeper)
   [junit4]   2> 497116 INFO  (TEST-ChaosMonkeyNothingIsSafeWithPullReplicasTest.test-seed#[FFF3B976A4923FDD]) [    ] o.a.s.c.SolrXmlConfig Loading container configuration from /x1/jenkins/jenkins-slave/workspace/Lucene-Solr-Tests-master/solr/build/solr-core/test/J2/temp/solr.cloud.ChaosMonkeyNothingIsSafeWithPullReplicasTest_FFF3B976A4923FDD-001/shard-1-001/solr.xml
   [junit4]   2> 497122 INFO  (TEST-ChaosMonkeyNothingIsSafeWithPullReplicasTest.test-seed#[FFF3B976A4923FDD]) [    ] o.a.s.c.SolrXmlConfig MBean server found: com.sun.jmx.mbeanserver.JmxMBeanServer@7eeda257, but no JMX reporters were configured - adding default JMX reporter.
   [junit4]   2> 497125 INFO  (TEST-ChaosMonkeyNothingIsSafeWithPullReplicasTest.test-seed#[FFF3B976A4923FDD]) [    ] o.a.s.c.ZkContainer Zookeeper client=127.0.0.1:50117/solr
   [junit4]   2> 497135 INFO  (TEST-ChaosMonkeyNothingIsSafeWithPullReplicasTest.test-seed#[FFF3B976A4923FDD]) [n:127.0.0.1:35634_d%2Fd    ] o.a.s.c.c.ZkStateReader Updated live nodes from ZooKeeper... (0) -> (1)
   [junit4]   2> 497137 INFO  (TEST-ChaosMonkeyNothingIsSafeWithPullReplicasTest.test-seed#[FFF3B976A4923FDD]) [n:127.0.0.1:35634_d%2Fd    ] o.a.s.c.Overseer Overseer (id=null) closing
   [junit4]   2> 497139 INFO  (TEST-ChaosMonkeyNothingIsSafeWithPullReplicasTest.test-seed#[FFF3B976A4923FDD]) [n:127.0.0.1:35634_d%2Fd    ] o.a.s.c.ZkController Register node as live in ZooKeeper:/live_nodes/127.0.0.1:35634_d%2Fd
   [junit4]   2> 497141 INFO  (zkCallback-1710-thread-1) [    ] o.a.s.c.c.ZkStateReader Updated live nodes from ZooKeeper... (1) -> (2)
   [junit4]   2> 497141 INFO  (zkCallback-1715-thread-1-processing-n:127.0.0.1:35634_d%2Fd) [n:127.0.0.1:35634_d%2Fd    ] o.a.s.c.c.ZkStateReader Updated live nodes from ZooKeeper... (1) -> (2)
   [junit4]   2> 497142 INFO  (zkCallback-1703-thread-1-processing-n:127.0.0.1:42957_d%2Fd) [n:127.0.0.1:42957_d%2Fd    ] o.a.s.c.c.ZkStateReader Updated live nodes from ZooKeeper... (1) -> (2)
   [junit4]   2> 497283 INFO  (TEST-ChaosMonkeyNothingIsSafeWithPullReplicasTest.test-seed#[FFF3B976A4923FDD]) [n:127.0.0.1:35634_d%2Fd    ] o.a.s.m.r.SolrJmxReporter JMX monitoring for 'solr.node' (registry 'solr.node') enabled at server: com.sun.jmx.mbeanserver.JmxMBeanServer@7eeda257
   [junit4]   2> 497289 INFO  (TEST-ChaosMonkeyNothingIsSafeWithPullReplicasTest.test-seed#[FFF3B976A4923FDD]) [n:127.0.0.1:35634_d%2Fd    ] o.a.s.m.r.SolrJmxReporter JMX monitoring for 'solr.jvm' (registry 'solr.jvm') enabled at server: com.sun.jmx.mbeanserver.JmxMBeanServer@7eeda257
   [junit4]   2> 497289 INFO  (TEST-ChaosMonkeyNothingIsSafeWithPullReplicasTest.test-seed#[FFF3B976A4923FDD]) [n:127.0.0.1:35634_d%2Fd    ] o.a.s.m.r.SolrJmxReporter JMX monitoring for 'solr.jetty' (registry 'solr.jetty') enabled at server: com.sun.jmx.mbeanserver.JmxMBeanServer@7eeda257
   [junit4]   2> 497291 INFO  (TEST-ChaosMonkeyNothingIsSafeWithPullReplicasTest.test-seed#[FFF3B976A4923FDD]) [n:127.0.0.1:35634_d%2Fd    ] o.a.s.c.CorePropertiesLocator Found 0 core definitions underneath /x1/jenkins/jenkins-slave/workspace/Lucene-Solr-Tests-master/solr/build/solr-core/test/J2/temp/solr.cloud.ChaosMonkeyNothingIsSafeWithPullReplicasTest_FFF3B976A4923FDD-001/shard-1-001/cores
   [junit4]   2> 497317 INFO  (qtp1900972421-5976) [n:127.0.0.1:35634_d%2Fd    ] o.a.s.h.a.CollectionsHandler Invoked Collection Action :addreplica with params node=127.0.0.1:35634_d%252Fd&action=ADDREPLICA&collection=collection1&shard=shard1&type=TLOG&wt=javabin&version=2 and sendToOCPQueue=true
   [junit4]   2> 497320 INFO  (OverseerCollectionConfigSetProcessor-98257053637476356-127.0.0.1:42957_d%2Fd-n_0000000000) [n:127.0.0.1:42957_d%2Fd    ] o.a.s.c.OverseerTaskQueue Response ZK path: /overseer/collection-queue-work/qnr-0000000002 doesn't exist.  Requestor may have disconnected from ZooKeeper
   [junit4]   2> 497320 INFO  (OverseerThreadFactory-2169-thread-3-processing-n:127.0.0.1:42957_d%2Fd) [n:127.0.0.1:42957_d%2Fd    ] o.a.s.c.AddReplicaCmd Node Identified 127.0.0.1:35634_d%2Fd for creating new replica
   [junit4]   2> 497323 INFO  (qtp1900972421-5978) [n:127.0.0.1:35634_d%2Fd    ] o.a.s.h.a.CoreAdminOperation core create command qt=/admin/cores&collection.configName=conf1&name=collection1_shard1_replica_t0&action=CREATE&collection=collection1&shard=shard1&wt=javabin&version=2&replicaType=TLOG
   [junit4]   2> 497323 INFO  (qtp1900972421-5978) [n:127.0.0.1:35634_d%2Fd    ] o.a.s.c.TransientSolrCoreCacheDefault Allocating transient cache for 4 transient cores
   [junit4]   2> 497427 INFO  (zkCallback-1715-thread-1-processing-n:127.0.0.1:35634_d%2Fd) [n:127.0.0.1:35634_d%2Fd    ] o.a.s.c.c.ZkStateReader A cluster state change: [WatchedEvent state:SyncConnected type:NodeDataChanged path:/collections/collection1/state.json] for collection [collection1] has occurred - updating... (live nodes size: [2])
   [junit4]   2> 498340 INFO  (qtp1900972421-5978) [n:127.0.0.1:35634_d%2Fd c:collection1 s:shard1  x:collection1_shard1_replica_t0] o.a.s.c.SolrConfig Using Lucene MatchVersion: 8.0.0
   [junit4]   2> 498355 INFO  (qtp1900972421-5978) [n:127.0.0.1:35634_d%2Fd c:collection1 s:shard1  x:collection1_shard1_replica_t0] o.a.s.s.IndexSchema [collection1_shard1_replica_t0] Schema name=test
   [junit4]   2> 498444 INFO  (qtp1900972421-5978) [n:127.0.0.1:35634_d%2Fd c:collection1 s:shard1  x:collection1_shard1_replica_t0] o.a.s.s.IndexSchema Loaded schema test/1.6 with uniqueid field id
   [junit4]   2> 498462 INFO  (qtp1900972421-5978) [n:127.0.0.1:35634_d%2Fd c:collection1 s:shard1  x:collection1_shard1_replica_t0] o.a.s.c.CoreContainer Creating SolrCore 'collection1_shard1_replica_t0' using configuration from collection collection1, trusted=true
   [junit4]   2> 498463 INFO  (qtp1900972421-5978) [n:127.0.0.1:35634_d%2Fd c:collection1 s:shard1  x:collection1_shard1_replica_t0] o.a.s.m.r.SolrJmxReporter JMX monitoring for 'solr.core.collection1.shard1.replica_t0' (registry 'solr.core.collection1.shard1.replica_t0') enabled at server: com.sun.jmx.mbeanserver.JmxMBeanServer@7eeda257
   [junit4]   2> 498463 INFO  (qtp1900972421-5978) [n:127.0.0.1:35634_d%2Fd c:collection1 s:shard1  x:collection1_shard1_replica_t0] o.a.s.c.SolrCore solr.RecoveryStrategy.Builder
   [junit4]   2> 498463 INFO  (qtp1900972421-5978) [n:127.0.0.1:35634_d%2Fd c:collection1 s:shard1  x:collection1_shard1_replica_t0] o.a.s.c.SolrCore [[collection1_shard1_replica_t0] ] Opening new SolrCore at [/x1/jenkins/jenkins-slave/workspace/Lucene-Solr-Tests-master/solr/build/solr-core/test/J2/temp/solr.cloud.ChaosMonkeyNothingIsSafeWithPullReplicasTest_FFF3B976A4923FDD-001/shard-1-001/cores/collection1_shard1_replica_t0], dataDir=[/x1/jenkins/jenkins-slave/workspace/Lucene-Solr-Tests-master/solr/build/solr-core/test/J2/temp/solr.cloud.ChaosMonkeyNothingIsSafeWithPullReplicasTest_FFF3B976A4923FDD-001/shard-1-001/cores/collection1_shard1_replica_t0/data/]
   [junit4]   2> 498467 INFO  (qtp1900972421-5978) [n:127.0.0.1:35634_d%2Fd c:collection1 s:shard1  x:collection1_shard1_replica_t0] o.a.s.u.RandomMergePolicy RandomMergePolicy wrapping class org.apache.lucene.index.LogDocMergePolicy: [LogDocMergePolicy: minMergeSize=1000, mergeFactor=39, maxMergeSize=9223372036854775807, maxMergeSizeForForcedMerge=9223372036854775807, calibrateSizeByDeletes=true, maxMergeDocs=2147483647, maxCFSSegmentSizeMB=8.796093022207999E12, noCFSRatio=0.0]
   [junit4]   2> 498476 WARN  (qtp1900972421-5978) [n:127.0.0.1:35634_d%2Fd c:collection1 s:shard1  x:collection1_shard1_replica_t0] o.a.s.c.RequestHandlers INVALID paramSet a in requestHandler {type = requestHandler,name = /dump,class = DumpRequestHandler,attributes = {initParams=a, name=/dump, class=DumpRequestHandler},args = {defaults={a=A,b=B}}}
   [junit4]   2> 498527 INFO  (qtp1900972421-5978) [n:127.0.0.1:35634_d%2Fd c:collection1 s:shard1  x:collection1_shard1_replica_t0] o.a.s.u.UpdateHandler Using UpdateLog implementation: org.apache.solr.update.UpdateLog
   [junit4]   2> 498527 INFO  (qtp1900972421-5978) [n:127.0.0.1:35634_d%2Fd c:collection1 s:shard1  x:collection1_shard1_replica_t0] o.a.s.u.UpdateLog Initializing UpdateLog: dataDir= defaultSyncLevel=FLUSH numRecordsToKeep=100 maxNumLogsToKeep=10 numVersionBuckets=65536
   [junit4]   2> 498528 INFO  (qtp1900972421-5978) [n:127.0.0.1:35634_d%2Fd c:collection1 s:shard1  x:collection1_shard1_replica_t0] o.a.s.u.CommitTracker Hard AutoCommit: if uncommited for 15000ms; 
   [junit4]   2> 498528 INFO  (qtp1900972421-5978) [n:127.0.0.1:35634_d%2Fd c:collection1 s:shard1  x:collection1_shard1_replica_t0] o.a.s.u.CommitTracker Soft AutoCommit: disabled
   [junit4]   2> 498530 INFO  (qtp1900972421-5978) [n:127.0.0.1:35634_d%2Fd c:collection1 s:shard1  x:collection1_shard1_replica_t0] o.a.s.u.RandomMergePolicy RandomMergePolicy wrapping class org.apache.lucene.index.TieredMergePolicy: [TieredMergePolicy: maxMergeAtOnce=13, maxMergeAtOnceExplicit=44, maxMergedSegmentMB=49.30078125, floorSegmentMB=0.4638671875, forceMergeDeletesPctAllowed=4.699991737354454, segmentsPerTier=31.0, maxCFSSegmentSizeMB=8.796093022207999E12, noCFSRatio=1.0
   [junit4]   2> 498530 INFO  (qtp1900972421-5978) [n:127.0.0.1:35634_d%2Fd c:collection1 s:shard1  x:collection1_shard1_replica_t0] o.a.s.s.SolrIndexSearcher Opening [Searcher@613b7855[collection1_shard1_replica_t0] main]
   [junit4]   2> 498532 INFO  (qtp1900972421-5978) [n:127.0.0.1:35634_d%2Fd c:collection1 s:shard1  x:collection1_shard1_replica_t0] o.a.s.r.ManagedResourceStorage Configured ZooKeeperStorageIO with znodeBase: /configs/conf1
   [junit4]   2> 498532 INFO  (qtp1900972421-5978) [n:127.0.0.1:35634_d%2Fd c:collection1 s:shard1  x:collection1_shard1_replica_t0] o.a.s.r.ManagedResourceStorage Loaded null at path _rest_managed.json using ZooKeeperStorageIO:path=/configs/conf1
   [junit4]   2> 498533 INFO  (qtp1900972421-5978) [n:127.0.0.1:35634_d%2Fd c:collection1 s:shard1  x:collection1_shard1_replica_t0] o.a.s.h.ReplicationHandler Commits will be reserved for  10000
   [junit4]   2> 498533 INFO  (qtp1900972421-5978) [n:127.0.0.1:35634_d%2Fd c:collection1 s:shard1  x:collection1_shard1_replica_t0] o.a.s.u.UpdateLog Could not find max version in index or recent updates, using new clock 1572112863205523456
   [junit4]   2> 498538 INFO  (searcherExecutor-2183-thread-1-processing-n:127.0.0.1:35634_d%2Fd x:collection1_shard1_replica_t0 s:shard1 c:collection1) [n:127.0.0.1:35634_d%2Fd c:collection1 s:shard1  x:collection1_shard1_replica_t0] o.a.s.c.SolrCore [collection1_shard1_replica_t0] Registered new searcher Searcher@613b7855[collection1_shard1_replica_t0] main{ExitableDirectoryReader(UninvertingDirectoryReader())}
   [junit4]   2> 498540 INFO  (qtp1900972421-5978) [n:127.0.0.1:35634_d%2Fd c:collection1 s:shard1  x:collection1_shard1_replica_t0] o.a.s.c.ShardLeaderElectionContext Enough replicas found to continue.
   [junit4]   2> 498540 INFO  (qtp1900972421-5978) [n:127.0.0.1:35634_d%2Fd c:collection1 s:shard1  x:collection1_shard1_replica_t0] o.a.s.c.ShardLeaderElectionContext I may be the new leader - try and sync
   [junit4]   2> 498540 INFO  (qtp1900972421-5978) [n:127.0.0.1:35634_d%2Fd c:collection1 s:shard1  x:collection1_shard1_replica_t0] o.a.s.c.SyncStrategy Sync replicas to http://127.0.0.1:35634/d/d/collection1_shard1_replica_t0/
   [junit4]   2> 498540 INFO  (qtp1900972421-5978) [n:127.0.0.1:35634_d%2Fd c:collection1 s:shard1  x:collection1_shard1_replica_t0] o.a.s.c.SyncStrategy Sync Success - now sync replicas to me
   [junit4]   2> 498540 INFO  (qtp1900972421-5978) [n:127.0.0.1:35634_d%2Fd c:collection1 s:shard1  x:collection1_shard1_replica_t0] o.a.s.c.SyncStrategy http://127.0.0.1:35634/d/d/collection1_shard1_replica_t0/ has no replicas
   [junit4]   2> 498540 INFO  (qtp1900972421-5978) [n:127.0.0.1:35634_d%2Fd c:collection1 s:shard1  x:collection1_shard1_replica_t0] o.a.s.c.ShardLeaderElectionContext Found all replicas participating in election, clear LIR
   [junit4]   2> 498541 INFO  (qtp1900972421-5978) [n:127.0.0.1:35634_d%2Fd c:collection1 s:shard1  x:collection1_shard1_replica_t0] o.a.s.c.ZkController collection1_shard1_replica_t0 stopping background replication from leader
   [junit4]   2> 498544 INFO  (qtp1900972421-5978) [n:127.0.0.1:35634_d%2Fd c:collection1 s:shard1  x:collection1_shard1_replica_t0] o.a.s.c.ShardLeaderElectionContext I am the new leader: http://127.0.0.1:35634/d/d/collection1_shard1_replica_t0/ shard1
   [junit4]   2> 498647 INFO  (zkCallback-1715-thread-1-processing-n:127.0.0.1:35634_d%2Fd) [n:127.0.0.1:35634_d%2Fd    ] o.a.s.c.c.ZkStateReader A cluster state change: [WatchedEvent state:SyncConnected type:NodeDataChanged path:/collections/collection1/state.json] for collection [collection1] has occurred - updating... (live nodes size: [2])
   [junit4]   2> 498695 INFO  (qtp1900972421-5978) [n:127.0.0.1:35634_d%2Fd c:collection1 s:shard1  x:collection1_shard1_replica_t0] o.a.s.c.ZkController I am the leader, no recovery necessary
   [junit4]   2> 498698 INFO  (qtp1900972421-5978) [n:127.0.0.1:35634_d%2Fd c:collection1 s:shard1  x:collection1_shard1_replica_t0] o.a.s.s.HttpSolrCall [admin] webapp=null path=/admin/cores params={qt=/admin/cores&collection.configName=conf1&name=collection1_shard1_replica_t0&action=CREATE&collection=collection1&shard=shard1&wt=javabin&version=2&replicaType=TLOG} status=0 QTime=1374
   [junit4]   2> 498700 INFO  (qtp1900972421-5976) [n:127.0.0.1:35634_d%2Fd    ] o.a.s.s.HttpSolrCall [admin] webapp=null path=/admin/collections params={node=127.0.0.1:35634_d%252Fd&action=ADDREPLICA&collection=collection1&shard=shard1&type=TLOG&wt=javabin&version=2} status=0 QTime=1383
   [junit4]   2> 498799 INFO  (zkCallback-1715-thread-1-processing-n:127.0.0.1:35634_d%2Fd) [n:127.0.0.1:35634_d%2Fd    ] o.a.s.c.c.ZkStateReader A cluster state change: [WatchedEvent state:SyncConnected type:NodeDataChanged path:/collections/collection1/state.json] for collection [collection1] has occurred - updating... (live nodes size: [2])
   [junit4]   2> 498828 INFO  (TEST-ChaosMonkeyNothingIsSafeWithPullReplicasTest.test-seed#[FFF3B976A4923FDD]) [    ] o.a.s.c.AbstractFullDistribZkTestBase create jetty 2 in directory /x1/jenkins/jenkins-slave/workspace/Lucene-Solr-Tests-master/solr/build/solr-core/test/J2/temp/solr.cloud.ChaosMonkeyNothingIsSafeWithPullReplicasTest_FFF3B976A4923FDD-001/shard-2-001 of type TLOG
   [junit4]   2> 498829 INFO  (TEST-ChaosMonkeyNothingIsSafeWithPullReplicasTest.test-seed#[FFF3B976A4923FDD]) [    ] o.e.j.s.Server jetty-9.3.14.v20161028
   [junit4]   2> 498830 INFO  (TEST-ChaosMonkeyNothingIsSafeWithPullReplicasTest.test-seed#[FFF3B976A4923FDD]) [    ] o.e.j.s.h.ContextHandler Started o.e.j.s.ServletContextHandler@4ead1019{/d/d,null,AVAILABLE}
   [junit4]   2> 498831 INFO  (TEST-ChaosMonkeyNothingIsSafeWithPullReplicasTest.test-seed#[FFF3B976A4923FDD]) [    ] o.e.j.s.AbstractConnector Started ServerConnector@4063c95b{HTTP/1.1,[http/1.1]}{127.0.0.1:41415}
   [junit4]   2> 498831 INFO  (TEST-ChaosMonkeyNothingIsSafeWithPullReplicasTest.test-seed#[FFF3B976A4923FDD]) [    ] o.e.j.s.Server Started @501751ms
   [junit4]   2> 498831 INFO  (TEST-ChaosMonkeyNothingIsSafeWithPullReplicasTest.test-seed#[FFF3B976A4923FDD]) [    ] o.a.s.c.s.e.JettySolrRunner Jetty properties: {solr.data.dir=/x1/jenkins/jenkins-slave/workspace/Lucene-Solr-Tests-master/solr/build/solr-core/test/J2/temp/solr.cloud.ChaosMonkeyNothingIsSafeWithPullReplicasTest_FFF3B976A4923FDD-001/tempDir-001/jetty2, replicaType=TLOG, solrconfig=solrconfig.xml, hostContext=/d/d, hostPort=41415, coreRootDirectory=/x1/jenkins/jenkins-slave/workspace/Lucene-Solr-Tests-master/solr/build/solr-core/test/J2/temp/solr.cloud.ChaosMonkeyNothingIsSafeWithPullReplicasTest_FFF3B976A4923FDD-001/shard-2-001/cores}
   [junit4]   2> 498831 ERROR (TEST-ChaosMonkeyNothingIsSafeWithPullReplicasTest.test-seed#[FFF3B976A4923FDD]) [    ] o.a.s.s.StartupLoggingUtils Missing Java Option solr.log.dir. Logging may be missing or incomplete.
   [junit4]   2> 498832 INFO  (TEST-ChaosMonkeyNothingIsSafeWithPullReplicasTest.test-seed#[FFF3B976A4923FDD]) [    ] o.a.s.s.SolrDispatchFilter  ___      _       Welcome to Apache Solr™ version 8.0.0
   [junit4]   2> 498832 INFO  (TEST-ChaosMonkeyNothingIsSafeWithPullReplicasTest.test-seed#[FFF3B976A4923FDD]) [    ] o.a.s.s.SolrDispatchFilter / __| ___| |_ _   Starting in cloud mode on port null
   [junit4]   2> 498832 INFO  (TEST-ChaosMonkeyNothingIsSafeWithPullReplicasTest.test-seed#[FFF3B976A4923FDD]) [    ] o.a.s.s.SolrDispatchFilter \__ \/ _ \ | '_|  Install dir: null, Default config dir: null
   [junit4]   2> 498832 INFO  (TEST-ChaosMonkeyNothingIsSafeWithPullReplicasTest.test-seed#[FFF3B976A4923FDD]) [    ] o.a.s.s.SolrDispatchFilter |___/\___/_|_|    Start time: 2017-07-05T19:41:00.430Z
   [junit4]   2> 498835 INFO  (TEST-ChaosMonkeyNothingIsSafeWithPullReplicasTest.test-seed#[FFF3B976A4923FDD]) [    ] o.a.s.s.SolrDispatchFilter Loading solr.xml from SolrHome (not found in ZooKeeper)
   [junit4]   2> 498835 INFO  (TEST-ChaosMonkeyNothingIsSafeWithPullReplicasTest.test-seed#[FFF3B976A4923FDD]) [    ] o.a.s.c.SolrXmlConfig Loading container configuration from /x1/jenkins/jenkins-slave/workspace/Lucene-Solr-Tests-master/solr/build/solr-core/test/J2/temp/solr.cloud.ChaosMonkeyNothingIsSafeWithPullReplicasTest_FFF3B976A4923FDD-001/shard-2-001/solr.xml
   [junit4]   2> 498840 INFO  (TEST-ChaosMonkeyNothingIsSafeWithPullReplicasTest.test-seed#[FFF3B976A4923FDD]) [    ] o.a.s.c.SolrXmlConfig MBean server found: com.sun.jmx.mbeanserver.JmxMBeanServer@7eeda257, but no JMX reporters were configured - adding default JMX reporter.
   [junit4]   2> 498843 INFO  (TEST-ChaosMonkeyNothingIsSafeWithPullReplicasTest.test-seed#[FFF3B976A4923FDD]) [    ] o.a.s.c.ZkContainer Zookeeper client=127.0.0.1:50117/solr
   [junit4]   2> 498853 INFO  (TEST-ChaosMonkeyNothingIsSafeWithPullReplicasTest.test-seed#[FFF3B976A4923FDD]) [n:127.0.0.1:41415_d%2Fd    ] o.a.s.c.c.ZkStateReader Updated live nodes from ZooKeeper... (0) -> (2)
   [junit4]   2> 498855 INFO  (TEST-ChaosMonkeyNothingIsSafeWithPullReplicasTest.test-seed#[FFF3B976A4923FDD]) [n:127.0.0.1:41415_d%2Fd    ] o.a.s.c.Overseer Overseer (id=null) closing
   [junit4]   2> 498857 INFO  (TEST-ChaosMonkeyNothingIsSafeWithPullReplicasTest.test-seed#[FFF3B976A4923FDD]) [n:127.0.0.1:41415_d%2Fd    ] o.a.s.c.ZkController Register node as live in ZooKeeper:/live_nodes/127.0.0.1:41415_d%2Fd
   [junit4]   2> 498859 INFO  (zkCallback-1710-thread-1) [    ] o.a.s.c.c.ZkStateReader Updated live nodes from ZooKeeper... (2) -> (3)
   [junit4]   2> 498859 INFO  (zkCallback-1721-thread-1-processing-n:127.0.0.1:41415_d%2Fd) [n:127.0.0.1:41415_d%2Fd    ] o.a.s.c.c.ZkStateReader Updated live nodes from ZooKeeper... (2) -> (3)
   [junit4]   2> 498859 INFO  (zkCallback-1715-thread-1-processing-n:127.0.0.1:35634_d%2Fd) [n:127.0.0.1:35634_d%2Fd    ] o.a.s.c.c.ZkStateReader Updated live nodes from ZooKeeper... (2) -> (3)
   [junit4]   2> 498860 INFO  (zkCallback-1703-thread-1-processing-n:127.0.0.1:42957_d%2Fd) [n:127.0.0.1:42957_d%2Fd    ] o.a.s.c.c.ZkStateReader Updated live nodes from ZooKeeper... (2) -> (3)
   [junit4]   2> 498946 INFO  (TEST-ChaosMonkeyNothingIsSafeWithPullReplicasTest.test-seed#[FFF3B976A4923FDD]) [n:127.0.0.1:41415_d%2Fd    ] o.a.s.m.r.SolrJmxReporter JMX monitoring for 'solr.node' (registry 'solr.node') enabled at server: com.sun.jmx.mbeanserver.JmxMBeanServer@7eeda257
   [junit4]   2> 498952 INFO  (TEST-ChaosMonkeyNothingIsSafeWithPullReplicasTest.test-seed#[FFF3B976A4923FDD]) [n:127.0.0.1:41415_d%2Fd    ] o.a.s.m.r.SolrJmxReporter JMX monitoring for 'solr.jvm' (registry 'solr.jvm') enabled at server: com.sun.jmx.mbeanserver.JmxMBeanServer@7eeda257
   [junit4]   2> 498952 INFO  (TEST-ChaosMonkeyNothingIsSafeWithPullReplicasTest.test-seed#[FFF3B976A4923FDD]) [n:127.0.0.1:41415_d%2Fd    ] o.a.s.m.r.SolrJmxReporter JMX monitoring for 'solr.jetty' (registry 'solr.jetty') enabled at server: com.sun.jmx.mbeanserver.JmxMBeanServer@7eeda257
   [junit4]   2> 498954 INFO  (TEST-ChaosMonkeyNothingIsSafeWithPullReplicasTest.test-seed#[FFF3B976A4923FDD]) [n:127.0.0.1:41415_d%2Fd    ] o.a.s.c.CorePropertiesLocator Found 0 core definitions underneath /x1/jenkins/jenkins-slave/workspace/Lucene-Solr-Tests-master/solr/build/solr-core/test/J2/temp/solr.cloud.ChaosMonkeyNothingIsSafeWithPullReplicasTest_FFF3B976A4923FDD-001/shard-2-001/cores
   [junit4]   2> 498986 INFO  (qtp1900972421-5977) [n:127.0.0.1:35634_d%2Fd    ] o.a.s.h.a.CollectionsHandler Invoked Collection Action :addreplica with params node=127.0.0.1:41415_d%252Fd&action=ADDREPLICA&collection=collection1&shard=shard1&type=TLOG&wt=javabin&version=2 and sendToOCPQueue=true
   [junit4]   2> 498989 INFO  (OverseerCollectionConfigSetProcessor-98257053637476356-127.0.0.1:42957_d%2Fd-n_0000000000) [n:127.0.0.1:42957_d%2Fd    ] o.a.s.c.OverseerTaskQueue Response ZK path: /overseer/collection-queue-work/qnr-0000000004 doesn't exist.  Requestor may have disconnected from ZooKeeper
   [junit4]   2> 498989 INFO  (OverseerThreadFactory-2169-thread-4-processing-n:127.0.0.1:42957_d%2Fd) [n:127.0.0.1:42957_d%2Fd    ] o.a.s.c.AddReplicaCmd Node Identified 127.0.0.1:41415_d%2Fd for creating new replica
   [junit4]   2> 498992 INFO  (qtp1227828404-6006) [n:127.0.0.1:41415_d%2Fd    ] o.a.s.h.a.CoreAdminOperation core create command qt=/admin/cores&collection.configName=conf1&name=collection1_shard1_replica_t1&action=CREATE&collection=collection1&shard=shard1&wt=javabin&version=2&replicaType=TLOG
   [junit4]   2> 498992 INFO  (qtp1227828404-6006) [n:127.0.0.1:41415_d%2Fd    ] o.a.s.c.TransientSolrCoreCacheDefault Allocating transient cache for 4 transient cores
   [junit4]   2> 499100 INFO  (zkCallback-1715-thread-1-processing-n:127.0.0.1:35634_d%2Fd) [n:127.0.0.1:35634_d%2Fd    ] o.a.s.c.c.ZkStateReader A cluster state change: [WatchedEvent state:SyncConnected type:NodeDataChanged path:/collections/collection1/state.json] for collection [collection1] has occurred - updating... (live nodes size: [3])
   [junit4]   2> 499100 INFO  (zkCallback-1721-thread-1-processing-n:127.0.0.1:41415_d%2Fd) [n:127.0.0.1:41415_d%2Fd    ] o.a.s.c.c.ZkStateReader A cluster state change: [WatchedEvent state:SyncConnected type:NodeDataChanged path:/collections/collection1/state.json] for collection [collection1] has occurred - updating... (live nodes size: [3])
   [junit4]   2> 500011 INFO  (qtp1227828404-6006) [n:127.0.0.1:41415_d%2Fd c:collection1 s:shard1  x:collection1_shard1_replica_t1] o.a.s.c.SolrConfig Using Lucene MatchVersion: 8.0.0
   [junit4]   2> 500024 INFO  (qtp1227828404-6006) [n:127.0.0.1:41415_d%2Fd c:collection1 s:shard1  x:collection1_shard1_replica_t1] o.a.s.s.IndexSchema [collection1_shard1_replica_t1] Schema name=test
   [junit4]   2> 500105 INFO  (qtp1227828404-6006) [n:127.0.0.1:41415_d%2Fd c:collection1 s:shard1  x:collection1_shard1_replica_t1] o.a.s.s.IndexSchema Loaded schema test/1.6 with uniqueid field id
   [junit4]   2> 500125 INFO  (qtp1227828404-6006) [n:127.0.0.1:41415_d%2Fd c:collection1 s:shard1  x:collection1_shard1_replica_t1] o.a.s.c.CoreContainer Creating SolrCore 'collection1_shard1_replica_t1' using configuration from collection collection1, trusted=true
   [junit4]   2> 500126 INFO  (qtp1227828404-6006) [n:127.0.0.1:41415_d%2Fd c:collection1 s:shard1  x:collection1_shard1_replica_t1] o.a.s.m.r.SolrJmxReporter JMX monitoring for 'solr.core.collection1.shard1.replica_t1' (registry 'solr.core.collection1.shard1.replica_t1') enabled at server: com.sun.jmx.mbeanserver.JmxMBeanServer@7eeda257
   [junit4]   2> 500126 INFO  (qtp1227828404-6006) [n:127.0.0.1:41415_d%2Fd c:collection1 s:shard1  x:collection1_shard1_replica_t1] o.a.s.c.SolrCore solr.RecoveryStrategy.Builder
   [junit4]   2> 500126 INFO  (qtp1227828404-6006) [n:127.0.0.1:41415_d%2Fd c:collection1 s:shard1  x:collection1_shard1_replica_t1] o.a.s.c.SolrCore [[collection1_shard1_replica_t1] ] Opening new SolrCore at [/x1/jenkins/jenkins-slave/workspace/Lucene-Solr-Tests-master/solr/build/solr-core/test/J2/temp/solr.cloud.ChaosMonkeyNothingIsSafeWithPullReplicasTest_FFF3B976A4923FDD-001/shard-2-001/cores/collection1_shard1_replica_t1], dataDir=[/x1/jenkins/jenkins-slave/workspace/Lucene-Solr-Tests-master/solr/build/solr-core/test/J2/temp/solr.cloud.ChaosMonkeyNothingIsSafeWithPullReplicasTest_FFF3B976A4923FDD-001/shard-2-001/cores/collection1_shard1_replica_t1/data/]
   [junit4]   2> 500130 INFO  (qtp1227828404-6006) [n:127.0.0.1:41415_d%2Fd c:collection1 s:shard1  x:collection1_shard1_replica_t1] o.a.s.u.RandomMergePolicy RandomMergePolicy wrapping class org.apache.lucene.index.LogDocMergePolicy: [LogDocMergePolicy: minMergeSize=1000, mergeFactor=39, maxMergeSize=9223372036854775807, maxMergeSizeForForcedMerge=9223372036854775807, calibrateSizeByDeletes=true, maxMergeDocs=2147483647, maxCFSSegmentSizeMB=8.796093022207999E12, noCFSRatio=0.0]
   [junit4]   2> 500141 WARN  (qtp1227828404-6006) [n:127.0.0.1:41415_d%2Fd c:collection1 s:shard1  x:collection1_shard1_replica_t1] o.a.s.c.RequestHandlers INVALID paramSet a in requestHandler {type = requestHandler,name = /dump,class = DumpRequestHandler,attributes = {initParams=a, name=/dump, class=DumpRequestHandler},args = {defaults={a=A,b=B}}}
   [junit4]   2> 500191 INFO  (qtp1227828404-6006) [n:127.0.0.1:41415_d%2Fd c:collection1 s:shard1  x:collection1_shard1_replica_t1] o.a.s.u.UpdateHandler Using UpdateLog implementation: org.apache.solr.update.UpdateLog
   [junit4]   2> 500191 INFO  (qtp1227828404-6006) [n:127.0.0.1:41415_d%2Fd c:collection1 s:shard1  x:collection1_shard1_replica_t1] o.a.s.u.UpdateLog Initializing UpdateLog: dataDir= defaultSyncLevel=FLUSH numRecordsToKeep=100 maxNumLogsToKeep=10 numVersionBuckets=65536
   [junit4]   2> 500192 INFO  (qtp1227828404-6006) [n:127.0.0.1:41415_d%2Fd c:collection1 s:shard1  x:collection1_shard1_replica_t1] o.a.s.u.CommitTracker Hard AutoCommit: if uncommited for 15000ms; 
   [junit4]   2> 500192 INFO  (qtp1227828404-6006) [n:127.0.0.1:41415_d%2Fd c:collection1 s:shard1  x:collection1_shard1_replica_t1] o.a.s.u.CommitTracker Soft AutoCommit: disabled
   [junit4]   2> 500194 INFO  (qtp1227828404-6006) [n:127.0.0.1:41415_d%2Fd c:collection1 s:shard1  x:collection1_shard1_replica_t1] o.a.s.u.RandomMergePolicy RandomMergePolicy wrapping class org.apache.lucene.index.TieredMergePolicy: [TieredMergePolicy: maxMergeAtOnce=13, maxMergeAtOnceExplicit=44, maxMergedSegmentMB=49.30078125, floorSegmentMB=0.4638671875, forceMergeDeletesPctAllowed=4.699991737354454, segmentsPerTier=31.0, maxCFSSegmentSizeMB=8.796093022207999E12, noCFSRatio=1.0
   [junit4]   2> 500195 INFO  (qtp1227828404-6006) [n:127.0.0.1:41415_d%2Fd c:collection1 s:shard1  x:collection1_shard1_replica_t1] o.a.s.s.SolrIndexSearcher Opening [Searcher@432ab3e6[collection1_shard1_replica_t1] main]
   [junit4]   2> 500196 INFO  (qtp1227828404-6006) [n:127.0.0.1:41415_d%2Fd c:collection1 s:shard1  x:collection1_shard1_replica_t1] o.a.s.r.ManagedResourceStorage Configured ZooKeeperStorageIO with znodeBase: /configs/conf1
   [junit4]   2> 500196 INFO  (qtp1227828404-6006) [n:127.0.0.1:41415_d%2Fd c:collection1 s:shard1  x:collection1_shard1_replica_t1] o.a.s.r.ManagedResourceStorage Loaded null at path _rest_managed.json using ZooKeeperStorageIO:path=/configs/conf1
   [junit4]   2> 500197 INFO  (qtp1227828404-6006) [n:127.0.0.1:41415_d%2Fd c:collection1 s:shard1  x:collection1_shard1_replica_t1] o.a.s.h.ReplicationHandler Commits will be reserved for  10000
   [junit4]   2> 500199 INFO  (searcherExecutor-2194-thread-1-processing-n:127.0.0.1:41415_d%2Fd x:collection1_shard1_replica_t1 s:shard1 c:collection1) [n:127.0.0.1:41415_d%2Fd c:collection1 s:shard1  x:collection1_shard1_replica_t1] o.a.s.c.SolrCore [collection1_shard1_replica_t1] Registered new searcher Searcher@432ab3e6[collection1_shard1_replica_t1] main{ExitableDirectoryReader(UninvertingDirectoryReader())}
   [junit4]   2> 500199 INFO  (qtp1227828404-6006) [n:127.0.0.1:41415_d%2Fd c:collection1 s:shard1  x:collection1_shard1_replica_t1] o.a.s.u.UpdateLog Could not find max version in index or recent updates, using new clock 1572112864952451072
   [junit4]   2> 500203 INFO  (qtp1227828404-6006) [n:127.0.0.1:41415_d%2Fd c:collection1 s:shard1  x:collection1_shard1_replica_t1] o.a.s.c.ZkController Core needs to recover:collection1_shard1_replica_t1
   [junit4]   2> 500203 INFO  (updateExecutor-1718-thread-1-processing-n:127.0.0.1:41415_d%2Fd x:collection1_shard1_replica_t1 s:shard1 c:collection1) [n:127.0.0.1:41415_d%2Fd c:collection1 s:shard1 r:core_node2 x:collection1_shard1_replica_t1] o.a.s.u.DefaultSolrCoreState Running recovery
   [junit4]   2> 500203 INFO  (recoveryExecutor-1719-thread-1-processing-n:127.0.0.1:41415_d%2Fd x:collection1_shard1_replica_t1 s:shard1 c:collection1 r:core_node2) [n:127.0.0.1:41415_d%2Fd c:collection1 s:shard1 r:core_node2 x:collection1_shard1_replica_t1] o.a.s.c.RecoveryStrategy Starting recovery process. recoveringAfterStartup=true
   [junit4]   2> 500204 INFO  (recoveryExecutor-1719-thread-1-processing-n:127.0.0.1:41415_d%2Fd x:collection1_shard1_replica_t1 s:shard1 c:collection1 r:core_node2) [n:127.0.0.1:41415_d%2Fd c:collection1 s:shard1 r:core_node2 x:collection1_shard1_replica_t1] o.a.s.c.RecoveryStrategy ###### startupVersions=[[]]
   [junit4]   2> 500204 INFO  (recoveryExecutor-1719-thread-1-processing-n:127.0.0.1:41415_d%2Fd x:collection1_shard1_replica_t1 s:shard1 c:collection1 r:core_node2) [n:127.0.0.1:41415_d%2Fd c:collection1 s:shard1 r:core_node2 x:collection1_shard1_replica_t1] o.a.s.c.ZkController collection1_shard1_replica_t1 stopping background replication from leader
   [junit4]   2> 500204 INFO  (recoveryExecutor-1719-thread-1-processing-n:127.0.0.1:41415_d%2Fd x:collection1_shard1_replica_t1 s:shard1 c:collection1 r:core_node2) [n:127.0.0.1:41415_d%2Fd c:collection1 s:shard1 r:core_node2 x:collection1_shard1_replica_t1] o.a.s.c.RecoveryStrategy Begin buffering updates. core=[collection1_shard1_replica_t1]
   [junit4]   2> 500204 INFO  (recoveryExecutor-1719-thread-1-processing-n:127.0.0.1:41415_d%2Fd x:collection1_shard1_replica_t1 s:shard1 c:collection1 r:core_node2) [n:127.0.0.1:41415_d%2Fd c:collection1 s:shard1 r:core_node2 x:collection1_shard1_replica_t1] o.a.s.u.UpdateLog Starting to buffer updates. FSUpdateLog{state=ACTIVE, tlog=null}
   [junit4]   2> 500204 INFO  (recoveryExecutor-1719-thread-1-processing-n:127.0.0.1:41415_d%2Fd x:collection1_shard1_replica_t1 s:shard1 c:collection1 r:core_node2) [n:127.0.0.1:41415_d%2Fd c:collection1 s:shard1 r:core_node2 x:collection1_shard1_replica_t1] o.a.s.c.RecoveryStrategy Publishing state of core [collection1_shard1_replica_t1] as recovering, leader is [http://127.0.0.1:35634/d/d/collection1_shard1_replica_t0/] and I am [http://127.0.0.1:41415/d/d/collection1_shard1_replica_t1/]
   [junit4]   2> 500204 INFO  (qtp1227828404-6006) [n:127.0.0.1:41415_d%2Fd c:collection1 s:shard1  x:collection1_shard1_replica_t1] o.a.s.s.HttpSolrCall [admin] webapp=null path=/admin/cores params={qt=/admin/cores&collection.configName=conf1&name=collection1_shard1_replica_t1&action=CREATE&collection=collection1&shard=shard1&wt=javabin&version=2&replicaType=TLOG} status=0 QTime=1212
   [junit4]   2> 500207 INFO  (recoveryExecutor-1719-thread-1-processing-n:127.0.0.1:41415_d%2Fd x:collection1_shard1_replica_t1 s:shard1 c:collection1 r:core_node2) [n:127.0.0.1:41415_d%2Fd c:collection1 s:shard1 r:core_node2 x:collection1_shard1_replica_t1] o.a.s.c.RecoveryStrategy Sending prep recovery command to [http://127.0.0.1:35634/d/d]; [WaitForState: action=PREPRECOVERY&core=collection1_shard1_replica_t0&nodeName=127.0.0.1:41415_d%252Fd&coreNodeName=core_node2&state=recovering&checkLive=true&onlyIfLeader=true&onlyIfLeaderActive=true]
   [junit4]   2> 500208 INFO  (qtp1900972421-5977) [n:127.0.0.1:35634_d%2Fd    ] o.a.s.s.HttpSolrCall [admin] webapp=null path=/admin/collections params={node=127.0.0.1:41415_d%252Fd&action=ADDREPLICA&collection=collection1&shard=shard1&type=TLOG&wt=javabin&version=2} status=0 QTime=1222
   [junit4]   2> 500209 INFO  (qtp1900972421-5979) [n:127.0.0.1:35634_d%2Fd    ] o.a.s.h.a.PrepRecoveryOp Going to wait for coreNodeName: core_node2, state: recovering, checkLive: true, onlyIfLeader: true, onlyIfLeaderActive: true, maxTime: 183 s
   [junit4]   2> 500209 INFO  (qtp1900972421-5979) [n:127.0.0.1:35634_d%2Fd    ] o.a.s.h.a.PrepRecoveryOp In WaitForState(recovering): collection=collection1, shard=shard1, thisCore=collection1_shard1_replica_t0, leaderDoesNotNeedRecovery=false, isLeader? true, live=true, checkLive=true, currentState=down, localState=active, nodeName=127.0.0.1:41415_d%2Fd, coreNodeName=core_node2, onlyIfActiveCheckResult=false, nodeProps: core_node2:{"core":"collection1_shard1_replica_t1","base_url":"http://127.0.0.1:41415/d/d","node_name":"127.0.0.1:41415_d%2Fd","state":"down","type":"TLOG"}
   [junit4]   2> 500309 INFO  (zkCallback-1721-thread-1-processing-n:127.0.0.1:41415_d%2Fd) [n:127.0.0.1:41415_d%2Fd    ] o.a.s.c.c.ZkStateReader A cluster state change: [WatchedEvent state:SyncConnected type:NodeDataChanged path:/collections/collection1/state.json] for collection [collection1] has occurred - updating... (live nodes size: [3])
   [junit4]   2> 500309 INFO  (zkCallback-1715-thread-1-processing-n:127.0.0.1:35634_d%2Fd) [n:127.0.0.1:35634_d%2Fd    ] o.a.s.c.c.ZkStateReader A cluster state change: [WatchedEvent state:SyncConnected type:NodeDataChanged path:/collections/collection1/state.json] for collection [collection1] has occurred - updating... (live nodes size: [3])
   [junit4]   2> 500337 INFO  (TEST-ChaosMonkeyNothingIsSafeWithPullReplicasTest.test-seed#[FFF3B976A4923FDD]) [    ] o.a.s.c.AbstractFullDistribZkTestBase create jetty 3 in directory /x1/jenkins/jenkins-slave/workspace/Lucene-Solr-Tests-master/solr/build/solr-core/test/J2/temp/solr.cloud.ChaosMonkeyNothingIsSafeWithPullReplicasTest_FFF3B976A4923FDD-001/shard-3-001 of type TLOG
   [junit4]   2> 500337 INFO  (TEST-ChaosMonkeyNothingIsSafeWithPullReplicasTest.test-seed#[FFF3B976A4923FDD]) [    ] o.e.j.s.Server jetty-9.3.14.v20161028
   [junit4]   2> 500339 INFO  (TEST-ChaosMonkeyNothingIsSafeWithPullReplicasTest.test-seed#[FFF3B976A4923FDD]) [    ] o.e.j.s.h.ContextHandler Started o.e.j.s.ServletContextHandler@b927e43{/d/d,null,AVAILABLE}
   [junit4]   2> 500339 INFO  (TEST-ChaosMonkeyNothingIsSafeWithPullReplicasTest.test-seed#[FFF3B976A4923FDD]) [    ] o.e.j.s.AbstractConnector Started ServerConnector@78b5edc1{HTTP/1.1,[http/1.1]}{127.0.0.1:49651}
   [junit4]   2> 500340 INFO  (TEST-ChaosMonkeyNothingIsSafeWithPullReplicasTest.test-seed#[FFF3B976A4923FDD]) [    ] o.e.j.s.Server Started @503260ms
   [junit4]   2> 500341 INFO  (TEST-ChaosMonkeyNothingIsSafeWithPullReplicasTest.test-seed#[FFF3B976A4923FDD]) [    ] o.a.s.c.s.e.JettySolrRunner Jetty properties: {solr.data.dir=/x1/jenkins/jenkins-slave/workspace/Lucene-Solr-Tests-master/solr/build/solr-core/test/J2/temp/solr.cloud.ChaosMonkeyNothingIsSafeWithPullReplicasTest_FFF3B976A4923FDD-001/tempDir-001/jetty3, replicaType=TLOG, solrconfig=solrconfig.xml, hostContext=/d/d, hostPort=49651, coreRootDirectory=/x1/jenkins/jenkins-slave/workspace/Lucene-Solr-Tests-master/solr/build/solr-core/test/J2/../../../../../../../../../../x1/jenkins/jenkins-slave/workspace/Lucene-Solr-Tests-master/solr/build/solr-core/test/J2/temp/solr.cloud.ChaosMonkeyNothingIsSafeWithPullReplicasTest_FFF3B976A4923FDD-001/shard-3-001/cores}
   [junit4]   2> 500341 ERROR (TEST-ChaosMonkeyNothingIsSafeWithPullReplicasTest.test-seed#[FFF3B976A4923FDD]) [    ] o.a.s.s.StartupLoggingUtils Missing Java Option solr.log.dir. Logging may be missing or incomplete.
   [junit4]   2> 500341 INFO  (TEST-ChaosMonkeyNothingIsSafeWithPullReplicasTest.test-seed#[FFF3B976A4923FDD]) [    ] o.a.s.s.SolrDispatchFilter  ___      _       Welcome to Apache Solr™ version 8.0.0
   [junit4]   2> 500341 INFO  (TEST-ChaosMonkeyNothingIsSafeWithPullReplicasTest.test-seed#[FFF3B976A4923FDD]) [    ] o.a.s.s.SolrDispatchFilter / __| ___| |_ _   Starting in cloud mode on port null
   [junit4]   2> 500341 INFO  (TEST-ChaosMonkeyNothingIsSafeWithPullReplicasTest.test-seed#[FFF3B976A4923FDD]) [    ] o.a.s.s.SolrDispatchFilter \__ \/ _ \ | '_|  Install dir: null, Default config dir: null
   [junit4]   2> 500341 INFO  (TEST-ChaosMonkeyNothingIsSafeWithPullReplicasTest.test-seed#[FFF3B976A4923FDD]) [    ] o.a.s.s.SolrDispatchFilter |___/\___/_|_|    Start time: 2017-07-05T19:41:01.939Z
   [junit4]   2> 500348 INFO  (TEST-ChaosMonkeyNothingIsSafeWithPullReplicasTest.test-seed#[FFF3B976A4923FDD]) [    ] o.a.s.s.SolrDispatchFilter Loading solr.xml from SolrHome (not found in ZooKeeper)
   [junit4]   2> 500348 INFO  (TEST-ChaosMonkeyNothingIsSafeWithPullReplicasTest.test-seed#[FFF3B976A4923FDD]) [    ] o.a.s.c.SolrXmlConfig Loading container configuration from /x1/jenkins/jenkins-slave/workspace/Lucene-Solr-Tests-master/solr/build/solr-core/test/J2/temp/solr.cloud.ChaosMonkeyNothingIsSafeWithPullReplicasTest_FFF3B976A4923FDD-001/shard-3-001/solr.xml
   [junit4]   2> 500353 INFO  (TEST-ChaosMonkeyNothingIsSafeWithPullReplicasTest.test-seed#[FFF3B976A4923FDD]) [    ] o.a.s.c.SolrXmlConfig MBean server found: com.sun.jmx.mbeanserver.JmxMBeanServer@7eeda257, but no JMX reporters were configured - adding default JMX reporter.
   [junit4]   2> 500356 INFO  (TEST-ChaosMonkeyNothingIsSafeWithPullReplicasTest.test-seed#[FFF3B976A4923FDD]) [    ] o.a.s.c.ZkContainer Zookeeper client=127.0.0.1:50117/solr
   [junit4]   2> 500375 INFO  (TEST-ChaosMonkeyNothingIsSafeWithPullReplicasTest.test-seed#[FFF3B976A4923FDD]) [n:127.0.0.1:49651_d%2Fd    ] o.a.s.c.c.ZkStateReader Updated live nodes from ZooKeeper... (0) -> (3)
   [junit4]   2> 500377 INFO  (TEST-ChaosMonkeyNothingIsSafeWithPullReplicasTest.test-seed#[FFF3B976A4923FDD]) [n:127.0.0.1:49651_d%2Fd    ] o.a.s.c.Overseer Overseer (id=null) closing
   [junit4]   2> 500379 INFO  (TEST-ChaosMonkeyNothingIsSafeWithPullReplicasTest.test-seed#[FFF3B976A4923FDD]) [n:127.0.0.1:49651_d%2Fd    ] o.a.s.c.ZkController Register node as live in ZooKeeper:/live_nodes/127.0.0.1:49651_d%2Fd
   [junit4]   2> 500381 INFO  (zkCallback-1721-thread-1-processing-n:127.0.0.1:41415_d%2Fd) [n:127.0.0.1:41415_d%2Fd    ] o.a.s.c.c.ZkStateReader Updated live nodes from ZooKeeper... (3) -> (4)
   [junit4]   2> 500381 INFO  (zkCallback-1715-thread-1-processing-n:127.0.0.1:35634_d%2Fd) [n:127.0.0.1:35634_d%2Fd    ] o.a.s.c.c.ZkStateReader Updated live nodes from ZooKeeper... (3) -> (4)
   [junit4]   2> 500381 INFO  (zkCallback-1710-thread-1) [    ] o.a.s.c.c.ZkStateReader Updated live nodes from ZooKeeper... (3) -> (4)
   [junit4]   2> 500382 INFO  (zkCallback-1703-thread-2-processing-n:127.0.0.1:42957_d%2Fd) [n:127.0.0.1:42957_d%2Fd    ] o.a.s.c.c.ZkStateReader Updated live nodes from ZooKeeper... (3) -> (4)
   [junit4]   2> 500382 INFO  (zkCallback-1728-thread-1-processing-n:127.0.0.1:49651_d%2Fd) [n:127.0.0.1:49651_d%2Fd    ] o.a.s.c.c.ZkStateReader Updated live nodes from ZooKeeper... (3) -> (4)
   [junit4]   2> 500457 INFO  (TEST-ChaosMonkeyNothingIsSafeWithPullReplicasTest.test-seed#[FFF3B976A4923FDD]) [n:127.0.0.1:49651_d%2Fd    ] o.a.s.m.r.SolrJmxReporter JMX monitoring for 'solr.node' (registry 'solr.node') enabled at server: com.sun.jmx.mbeanserver.JmxMBeanServer@7eeda257
   [junit4]   2> 500471 INFO  (TEST-ChaosMonkeyNothingIsSafeWithPullReplicasTest.test-seed#[FFF3B976A4923FDD]) [n:127.0.0.1:49651_d%2Fd    ] o.a.s.m.r.SolrJmxReporter JMX monitoring for 'solr.jvm' (registry 'solr.jvm') enabled at server: com.sun.jmx.mbeanserver.JmxMBeanServer@7eeda257
   [junit4]   2> 500471 INFO  (TEST-ChaosMonkeyNothingIsSafeWithPullReplicasTest.test-seed#[FFF3B976A4923FDD]) [n:127.0.0.1:49651_d%2Fd    ] o.a.s.m.r.SolrJmxReporter JMX monitoring for 'solr.jetty' (registry 'solr.jetty') enabled at server: com.sun.jmx.mbeanserver.JmxMBeanServer@7eeda257
   [junit4]   2> 500473 INFO  (TEST-ChaosMonkeyNothingIsSafeWithPullReplicasTest.test-seed#[FFF3B976A4923FDD]) [n:127.0.0.1:49651_d%2Fd    ] o.a.s.c.CorePropertiesLocator Found 0 core definitions underneath /x1/jenkins/jenkins-slave/workspace/Lucene-Solr-Tests-master/solr/build/solr-core/test/J2/../../../../../../../../../../x1/jenkins/jenkins-slave/workspace/Lucene-Solr-Tests-master/solr/build/solr-core/test/J2/temp/solr.cloud.ChaosMonkeyNothingIsSafeWithPullReplicasTest_FFF3B976A4923FDD-001/shard-3-001/cores
   [junit4]   2> 500514 INFO  (qtp1900972421-5980) [n:127.0.0.1:35634_d%2Fd    ] o.a.s.h.a.CollectionsHandler Invoked Collection Action :addreplica with params node=127.0.0.1:49651_d%252Fd&action=ADDREPLICA&collection=collection1&shard=shard1&type=TLOG&wt=javabin&version=2 and sendToOCPQueue=true
   [junit4]   2> 500529 INFO  (OverseerCollectionConfigSetProcessor-98257053637476356-127.0.0.1:42957_d%2Fd-n_0000000000) [n:127.0.0.1:42957_d%2Fd    ] o.a.s.c.OverseerTaskQueue Response ZK path: /overseer/collection-queue-work/qnr-0000000006 doesn't exist.  Requestor may have disconnected from ZooKeeper
   [junit4]   2> 500531 INFO  (OverseerThreadFactory-2169-thread-5-processing-n:127.0.0.1:42957_d%2Fd) [n:127.0.0.1:42957_d%2Fd    ] o.a.s.c.AddReplicaCmd Node Identified 127.0.0.1:49651_d%2Fd for creating new replica
   [junit4]   2> 500541 INFO  (qtp2129965845-6039) [n:127.0.0.1:49651_d%2Fd    ] o.a.s.h.a.CoreAdminOperation core create command qt=/admin/cores&collection.configName=conf1&name=collection1_shard1_replica_t2&action=CREATE&collection=collection1&shard=shard1&wt=javabin&version=2&replicaType=TLOG
   [junit4]   2> 500542 INFO  (qtp2129965845-6039) [n:127.0.0.1:49651_d%2Fd    ] o.a.s.c.TransientSolrCoreCacheDefault Allocating transient cache for 4 transient cores
   [junit4]   2> 500646 INFO  (zkCallback-1715-thread-1-processing-n:127.0.0.1:35634_d%2Fd) [n:127.0.0.1:35634_d%2Fd    ] o.a.s.c.c.ZkStateReader A cluster state change: [WatchedEvent state:SyncConnected type:NodeDataChanged path:/collections/collection1/state.json] for collection [collection1] has occurred - updating... (live nodes size: [4])
   [junit4]   2> 500646 INFO  (zkCallback-1721-thread-1-processing-n:127.0.0.1:41415_d%2Fd) [n:127.0.0.1:41415_d%2Fd    ] o.a.s.c.c.ZkStateReader A cluster state change: [WatchedEvent state:SyncConnected type:NodeDataChanged path:/collections/collection1/state.json] for collection [collection1] has occurred - updating... (live nodes size: [4])
   [junit4]   2> 500646 INFO  (zkCallback-1728-thread-1-processing-n:127.0.0.1:49651_d%2Fd) [n:127.0.0.1:49651_d%2Fd    ] o.a.s.c.c.ZkStateReader A cluster state change: [WatchedEvent state:SyncConnected type:NodeDataChanged path:/collections/collection1/state.json] for collection [collection1] has occurred - updating... (live nodes size: [4])
   [junit4]   2> 501209 INFO  (qtp1900972421-5979) [n:127.0.0.1:35634_d%2Fd    ] o.a.s.h.a.PrepRecoveryOp In WaitForState(recovering): collection=collection1, shard=shard1, thisCore=collection1_shard1_replica_t0, leaderDoesNotNeedRecovery=false, isLeader? true, live=true, checkLive=true, currentState=recovering, localState=active, nodeName=127.0.0.1:41415_d%2Fd, coreNodeName=core_node2, onlyIfActiveCheckResult=false, nodeProps: core_node2:{"core":"collection1_shard1_replica_t1","base_url":"http://127.0.0.1:41415/d/d","node_name":"127.0.0.1:41415_d%2Fd","state":"recovering","type":"TLOG"}
   [junit4]   2> 501209 INFO  (qtp1900972421-5979) [n:127.0.0.1:35634_d%2Fd    ] o.a.s.h.a.PrepRecoveryOp Waited coreNodeName: core_node2, state: recovering, checkLive: true, onlyIfLeader: true for: 1 seconds.
   [junit4]   2> 501209 INFO  (qtp1900972421-5979) [n:127.0.0.1:35634_d%2Fd    ] o.a.s.s.HttpSolrCall [admin] webapp=null path=/admin/cores params={nodeName=127.0.0.1:41415_d%252Fd&onlyIfLeaderActive=true&core=collection1_shard1_replica_t0&coreNodeName=core_node2&action=PREPRECOVERY&checkLive=true&state=recovering&onlyIfLeader=true&wt=javabin&version=2} status=0 QTime=1000
   [junit4]   2> 501563 INFO  (qtp2129965845-6039) [n:127.0.0.1:49651_d%2Fd c:collection1 s:shard1  x:collection1_shard1_replica_t2] o.a.s.c.SolrConfig Using Lucene MatchVersion: 8.0.0
   [junit4]   2> 501577 INFO  (qtp2129965845-6039) [n:127.0.0.1:49651_d%2Fd c:collection1 s:shard1  x:collection1_shard1_replica_t2] o.a.s.s.IndexSchema [collection1_shard1_replica_t2] Schema name=test
   [junit4]   2> 501663 INFO  (qtp2129965845-6039) [n:127.0.0.1:49651_d%2Fd c:collection1 s:shard1  x:collection1_shard1_replica_t2] o.a.s.s.IndexSchema Loaded schema test/1.6 with uniqueid field id
   [junit4]   2> 501679 INFO  (qtp2129965845-6039) [n:127.0.0.1:49651_d%2Fd c:collection1 s:shard1  x:collection1_shard1_replica_t2] o.a.s.c.CoreContainer Creating SolrCore 'collection1_shard1_replica_t2' using configuration from collection collection1, trusted=true
   [junit4]   2> 501680 INFO  (qtp2129965845-6039) [n:127.0.0.1:49651_d%2Fd c:collection1 s:shard1  x:collection1_shard1_replica_t2] o.a.s.m.r.SolrJmxReporter JMX monitoring for 'solr.core.collection1.shard1.replica_t2' (registry 'solr.core.collection1.shard1.replica_t2') enabled at server: com.sun.jmx.mbeanserver.JmxMBeanServer@7eeda257
   [junit4]   2> 501680 INFO  (qtp2129965845-6039) [n:127.0.0.1:49651_d%2Fd c:collection1 s:shard1  x:collection1_shard1_replica_t2] o.a.s.c.SolrCore solr.RecoveryStrategy.Builder
   [junit4]   2> 501680 INFO  (qtp2129965845-6039) [n:127.0.0.1:49651_d%2Fd c:collection1 s:shard1  x:collection1_shard1_replica_t2] o.a.s.c.SolrCore [[collection1_shard1_replica_t2] ] Opening new SolrCore at [/x1/jenkins/jenkins-slave/workspace/Lucene-Solr-Tests-master/solr/build/solr-core/test/J2/temp/solr.cloud.ChaosMonkeyNothingIsSafeWithPullReplicasTest_FFF3B976A4923FDD-001/shard-3-001/cores/collection1_shard1_replica_t2], dataDir=[/x1/jenkins/jenkins-slave/workspace/Lucene-Solr-Tests-master/solr/build/solr-core/test/J2/../../../../../../../../../../x1/jenkins/jenkins-slave/workspace/Lucene-Solr-Tests-master/solr/build/solr-core/test/J2/temp/solr.cloud.ChaosMonkeyNothingIsSafeWithPullReplicasTest_FFF3B976A4923FDD-001/shard-3-001/cores/collection1_shard1_replica_t2/data/]
   [junit4]   2> 501688 INFO  (qtp2129965845-6039) [n:127.0.0.1:49651_d%2Fd c:collection1 s:shard1  x:collection1_shard1_replica_t2] o.a.s.u.RandomMergePolicy RandomMergePolicy wrapping class org.apache.lucene.index.LogDocMergePolicy: [LogDocMergePolicy: minMergeSize=1000, mergeFactor=39, maxMergeSize=9223372036854775807, maxMergeSizeForForcedMerge=9223372036854775807, calibrateSizeByDeletes=true, maxMergeDocs=2147483647, maxCFSSegmentSizeMB=8.796093022207999E12, noCFSRatio=0.0]
   [junit4]   2> 501698 WARN  (qtp2129965845-6039) [n:127.0.0.1:49651_d%2Fd c:collection1 s:shard1  x:collection1_shard1_replica_t2] o.a.s.c.RequestHandlers INVALID paramSet a in requestHandler {type = requestHandler,name = /dump,class = DumpRequestHandler,attributes = {initParams=a, name=/dump, class=DumpRequestHandler},args = {defaults={a=A,b=B}}}
   [junit4]   2> 501711 INFO  (recoveryExecutor-1719-thread-1-processing-n:127.0.0.1:41415_d%2Fd x:collection1_shard1_replica_t1 s:shard1 c:collection1 r:core_node2) [n:127.0.0.1:41415_d%2Fd c:collection1 s:shard1 r:core_node2 x:collection1_shard1_replica_t1] o.a.s.c.RecoveryStrategy Starting Replication Recovery.
   [junit4]   2> 501711 INFO  (recoveryExecutor-1719-thread-1-processing-n:127.0.0.1:41415_d%2Fd x:collection1_shard1_replica_t1 s:shard1 c:collection1 r:core_node2) [n:127.0.0.1:41415_d%2Fd c:collection1 s:shard1 r:core_node2 x:collection1_shard1_replica_t1] o.a.s.c.RecoveryStrategy Attempting to replicate from [http://127.0.0.1:35634/d/d/collection1_shard1_replica_t0/].
   [junit4]   2> 501713 INFO  (qtp1900972421-5976) [n:127.0.0.1:35634_d%2Fd c:collection1 s:shard1 r:core_node1 x:collection1_shard1_replica_t0] o.a.s.u.DirectUpdateHandler2 start commit{_version_=1572112866539995136,optimize=false,openSearcher=false,waitSearcher=true,expungeDeletes=false,softCommit=false,prepareCommit=false}
   [junit4]   2> 501714 INFO  (qtp1900972421-5976) [n:127.0.0.1:35634_d%2Fd c:collection1 s:shard1 r:core_node1 x:collection1_shard1_replica_t0] o.a.s.u.DirectUpdateHandler2 No uncommitted changes. Skipping IW.commit.
   [junit4]   2> 501715 INFO  (qtp1900972421-5976) [n:127.0.0.1:35634_d%2Fd c:collection1 s:shard1 r:core_node1 x:collection1_shard1_replica_t0] o.a.s.u.DirectUpdateHandler2 end_commit_flush
   [junit4]   2> 501715 INFO  (qtp1900972421-5976) [n:127.0.0.1:35634_d%2Fd c:collection1 s:shard1 r:core_node1 x:collection1_shard1_replica_t0] o.a.s.u.p.LogUpdateProcessorFactory [collection1_shard1_replica_t0]  webapp=/d/d path=/update params={waitSearcher=true&openSearcher=false&commit=true&softCommit=false&commit_end_point=true&wt=javabin&version=2}{commit=} 0 2
   [junit4]   2> 501717 INFO  (qtp1900972421-5974) [n:127.0.0.1:35634_d%2Fd c:collection1 s:shard1 r:core_node1 x:collection1_shard1_replica_t0] o.a.s.c.S.Request [collection1_shard1_replica_t0]  webapp=/d/d path=/replication params={qt=/replication&wt=javabin&version=2&command=indexversion} status=0 QTime=0
   [junit4]   2> 501717 INFO  (recoveryExecutor-1719-thread-1-processing-n:127.0.0.1:41415_d%2Fd x:collection1_shard1_replica_t1 s:shard1 c:collection1 r:core_node2) [n:127.0.0.1:41415_d%2Fd c:collection1 s:shard1 r

[...truncated too long message...]

nterruptedException: sleep interrupted
   [junit4]   2> 	at java.lang.Thread.sleep(Native Method)
   [junit4]   2> 	at org.apache.zookeeper.ClientCnxn$SendThread.run(ClientCnxn.java:1051)
   [junit4]   2> 616377 WARN  (TEST-ChaosMonkeyNothingIsSafeWithPullReplicasTest.test-seed#[FFF3B976A4923FDD]-SendThread(127.0.0.1:50117)) [    ] o.a.z.c.StaticHostProvider Unexpected exception
   [junit4]   2> java.lang.InterruptedException: sleep interrupted
   [junit4]   2> 	at java.lang.Thread.sleep(Native Method)
   [junit4]   2> 	at org.apache.zookeeper.client.StaticHostProvider.next(StaticHostProvider.java:101)
   [junit4]   2> 	at org.apache.zookeeper.ClientCnxn$SendThread.startConnect(ClientCnxn.java:997)
   [junit4]   2> 	at org.apache.zookeeper.ClientCnxn$SendThread.run(ClientCnxn.java:1060)
   [junit4]   2> 616377 WARN  (TEST-ChaosMonkeyNothingIsSafeWithPullReplicasTest.test-seed#[FFF3B976A4923FDD]-SendThread(127.0.0.1:50117)) [    ] o.a.z.ClientCnxn Session 0x15d14450abd0006 for server null, unexpected error, closing socket connection and attempting reconnect
   [junit4]   2> java.net.ConnectException: Connection refused
   [junit4]   2> 	at sun.nio.ch.SocketChannelImpl.checkConnect(Native Method)
   [junit4]   2> 	at sun.nio.ch.SocketChannelImpl.finishConnect(SocketChannelImpl.java:717)
   [junit4]   2> 	at org.apache.zookeeper.ClientCnxnSocketNIO.doTransport(ClientCnxnSocketNIO.java:361)
   [junit4]   2> 	at org.apache.zookeeper.ClientCnxn$SendThread.run(ClientCnxn.java:1141)
   [junit4]   2> 616877 WARN  (TEST-ChaosMonkeyNothingIsSafeWithPullReplicasTest.test-seed#[FFF3B976A4923FDD]-SendThread(127.0.0.1:50117)) [    ] o.a.z.ClientCnxn Unexpected exception
   [junit4]   2> java.lang.InterruptedException: sleep interrupted
   [junit4]   2> 	at java.lang.Thread.sleep(Native Method)
   [junit4]   2> 	at org.apache.zookeeper.ClientCnxn$SendThread.run(ClientCnxn.java:1051)
   [junit4]   2> 617377 WARN  (TEST-ChaosMonkeyNothingIsSafeWithPullReplicasTest.test-seed#[FFF3B976A4923FDD]-SendThread(127.0.0.1:50117)) [    ] o.a.z.c.StaticHostProvider Unexpected exception
   [junit4]   2> java.lang.InterruptedException: sleep interrupted
   [junit4]   2> 	at java.lang.Thread.sleep(Native Method)
   [junit4]   2> 	at org.apache.zookeeper.client.StaticHostProvider.next(StaticHostProvider.java:101)
   [junit4]   2> 	at org.apache.zookeeper.ClientCnxn$SendThread.startConnect(ClientCnxn.java:997)
   [junit4]   2> 	at org.apache.zookeeper.ClientCnxn$SendThread.run(ClientCnxn.java:1060)
   [junit4]   2> 617378 WARN  (TEST-ChaosMonkeyNothingIsSafeWithPullReplicasTest.test-seed#[FFF3B976A4923FDD]-SendThread(127.0.0.1:50117)) [    ] o.a.z.ClientCnxn Session 0x15d14450abd0006 for server null, unexpected error, closing socket connection and attempting reconnect
   [junit4]   2> java.net.ConnectException: Connection refused
   [junit4]   2> 	at sun.nio.ch.SocketChannelImpl.checkConnect(Native Method)
   [junit4]   2> 	at sun.nio.ch.SocketChannelImpl.finishConnect(SocketChannelImpl.java:717)
   [junit4]   2> 	at org.apache.zookeeper.ClientCnxnSocketNIO.doTransport(ClientCnxnSocketNIO.java:361)
   [junit4]   2> 	at org.apache.zookeeper.ClientCnxn$SendThread.run(ClientCnxn.java:1141)
   [junit4]   2> 617877 WARN  (TEST-ChaosMonkeyNothingIsSafeWithPullReplicasTest.test-seed#[FFF3B976A4923FDD]-SendThread(127.0.0.1:50117)) [    ] o.a.z.ClientCnxn Unexpected exception
   [junit4]   2> java.lang.InterruptedException: sleep interrupted
   [junit4]   2> 	at java.lang.Thread.sleep(Native Method)
   [junit4]   2> 	at org.apache.zookeeper.ClientCnxn$SendThread.run(ClientCnxn.java:1051)
   [junit4]   2> Jul 05, 2017 7:42:59 PM com.carrotsearch.randomizedtesting.ThreadLeakControl tryToInterruptAll
   [junit4]   2> SEVERE: There are still zombie threads that couldn't be terminated:
   [junit4]   2>    1) Thread[id=5969, name=TEST-ChaosMonkeyNothingIsSafeWithPullReplicasTest.test-seed#[FFF3B976A4923FDD]-SendThread(127.0.0.1:50117), state=TIMED_WAITING, group=TGRP-ChaosMonkeyNothingIsSafeWithPullReplicasTest]
   [junit4]   2>         at java.lang.Thread.sleep(Native Method)
   [junit4]   2>         at org.apache.zookeeper.client.StaticHostProvider.next(StaticHostProvider.java:101)
   [junit4]   2>         at org.apache.zookeeper.ClientCnxn$SendThread.startConnect(ClientCnxn.java:997)
   [junit4]   2>         at org.apache.zookeeper.ClientCnxn$SendThread.run(ClientCnxn.java:1060)
   [junit4]   2> NOTE: test params are: codec=Asserting(Lucene70): {rnd_b=PostingsFormat(name=Direct), a_t=PostingsFormat(name=Asserting), a_i=PostingsFormat(name=Direct), id=PostingsFormat(name=Direct)}, docValues:{rnd_b=DocValuesFormat(name=Memory), _version_=DocValuesFormat(name=Lucene70), a_t=DocValuesFormat(name=Lucene70), a_i=DocValuesFormat(name=Memory), id=DocValuesFormat(name=Memory)}, maxPointsInLeafNode=2043, maxMBSortInHeap=6.634503989827078, sim=RandomSimilarity(queryNorm=false): {}, locale=nl, timezone=Asia/Aqtau
   [junit4]   2> NOTE: Linux 3.13.0-88-generic amd64/Oracle Corporation 1.8.0_131 (64-bit)/cpus=4,threads=2,free=23168016,total=504889344
   [junit4]   2> NOTE: All tests run in this JVM: [SolrCloudReportersTest, TestZkChroot, TestLocalFSCloudBackupRestore, TestManagedSynonymFilterFactory, TestFieldSortValues, RecoveryAfterSoftCommitTest, TestSurroundQueryParser, TestSmileRequest, V2StandaloneTest, TestSolrConfigHandler, ResponseLogComponentTest, TestSuggestSpellingConverter, ConjunctionSolrSpellCheckerTest, OverseerTest, TestRecovery, ParsingFieldUpdateProcessorsTest, XsltUpdateRequestHandlerTest, HdfsChaosMonkeySafeLeaderTest, TestOrdValues, TestLMJelinekMercerSimilarityFactory, SignatureUpdateProcessorFactoryTest, StatsReloadRaceTest, ClusterStateTest, TestTolerantUpdateProcessorRandomCloud, TestCodecSupport, TestTolerantSearch, DistributedSuggestComponentTest, TestInfoStreamLogging, TestConfigSetsAPI, TestSSLRandomization, SolrTestCaseJ4Test, TestClusterStateMutator, ClassificationUpdateProcessorFactoryTest, CircularListTest, ExplicitHLLTest, TestReplicaProperties, TestNoOpRegenerator, StatsComponentTest, PreAnalyzedFieldTest, TestTestInjection, DeleteReplicaTest, TestReloadAndDeleteDocs, SortByFunctionTest, TestSubQueryTransformerCrossCore, DeleteInactiveReplicaTest, BooleanFieldTest, DateMathParserTest, TestMaxScoreQueryParser, TestJmxIntegration, SimpleFacetsTest, SpellPossibilityIteratorTest, LargeFieldTest, TimeZoneUtilsTest, SuggesterFSTTest, TestSchemalessBufferedUpdates, ReturnFieldsTest, GraphQueryTest, NumericFieldsTest, TestAnalyzedSuggestions, TestConfigsApi, WrapperMergePolicyFactoryTest, SolrCLIZkUtilsTest, TestSQLHandler, CoreMergeIndexesAdminHandlerTest, FastVectorHighlighterTest, ShowFileRequestHandlerTest, ChaosMonkeyNothingIsSafeWithPullReplicasTest]
   [junit4]   2> NOTE: reproduce with: ant test  -Dtestcase=ChaosMonkeyNothingIsSafeWithPullReplicasTest -Dtests.seed=FFF3B976A4923FDD -Dtests.multiplier=2 -Dtests.slow=true -Dtests.locale=nl -Dtests.timezone=Asia/Aqtau -Dtests.asserts=true -Dtests.file.encoding=UTF-8
   [junit4] ERROR   0.00s J2 | ChaosMonkeyNothingIsSafeWithPullReplicasTest (suite) <<<
   [junit4]    > Throwable #1: com.carrotsearch.randomizedtesting.ThreadLeakError: 3 threads leaked from SUITE scope at org.apache.solr.cloud.ChaosMonkeyNothingIsSafeWithPullReplicasTest: 
   [junit4]    >    1) Thread[id=5969, name=TEST-ChaosMonkeyNothingIsSafeWithPullReplicasTest.test-seed#[FFF3B976A4923FDD]-SendThread(127.0.0.1:50117), state=TIMED_WAITING, group=TGRP-ChaosMonkeyNothingIsSafeWithPullReplicasTest]
   [junit4]    >         at java.lang.Thread.sleep(Native Method)
   [junit4]    >         at org.apache.zookeeper.ClientCnxnSocketNIO.cleanup(ClientCnxnSocketNIO.java:230)
   [junit4]    >         at org.apache.zookeeper.ClientCnxn$SendThread.cleanup(ClientCnxn.java:1246)
   [junit4]    >         at org.apache.zookeeper.ClientCnxn$SendThread.run(ClientCnxn.java:1170)
   [junit4]    >    2) Thread[id=5968, name=Connection evictor, state=TIMED_WAITING, group=TGRP-ChaosMonkeyNothingIsSafeWithPullReplicasTest]
   [junit4]    >         at java.lang.Thread.sleep(Native Method)
   [junit4]    >         at org.apache.http.impl.client.IdleConnectionEvictor$1.run(IdleConnectionEvictor.java:66)
   [junit4]    >         at java.lang.Thread.run(Thread.java:748)
   [junit4]    >    3) Thread[id=5970, name=TEST-ChaosMonkeyNothingIsSafeWithPullReplicasTest.test-seed#[FFF3B976A4923FDD]-EventThread, state=WAITING, group=TGRP-ChaosMonkeyNothingIsSafeWithPullReplicasTest]
   [junit4]    >         at sun.misc.Unsafe.park(Native Method)
   [junit4]    >         at java.util.concurrent.locks.LockSupport.park(LockSupport.java:175)
   [junit4]    >         at java.util.concurrent.locks.AbstractQueuedSynchronizer$ConditionObject.await(AbstractQueuedSynchronizer.java:2039)
   [junit4]    >         at java.util.concurrent.LinkedBlockingQueue.take(LinkedBlockingQueue.java:442)
   [junit4]    >         at org.apache.zookeeper.ClientCnxn$EventThread.run(ClientCnxn.java:501)
   [junit4]    > 	at __randomizedtesting.SeedInfo.seed([FFF3B976A4923FDD]:0)Throwable #2: com.carrotsearch.randomizedtesting.ThreadLeakError: There are still zombie threads that couldn't be terminated:
   [junit4]    >    1) Thread[id=5969, name=TEST-ChaosMonkeyNothingIsSafeWithPullReplicasTest.test-seed#[FFF3B976A4923FDD]-SendThread(127.0.0.1:50117), state=TIMED_WAITING, group=TGRP-ChaosMonkeyNothingIsSafeWithPullReplicasTest]
   [junit4]    >         at java.lang.Thread.sleep(Native Method)
   [junit4]    >         at org.apache.zookeeper.client.StaticHostProvider.next(StaticHostProvider.java:101)
   [junit4]    >         at org.apache.zookeeper.ClientCnxn$SendThread.startConnect(ClientCnxn.java:997)
   [junit4]    >         at org.apache.zookeeper.ClientCnxn$SendThread.run(ClientCnxn.java:1060)
   [junit4]    > 	at __randomizedtesting.SeedInfo.seed([FFF3B976A4923FDD]:0)
   [junit4] Completed [194/726 (1!)] on J2 in 124.66s, 1 test, 3 errors <<< FAILURES!

[...truncated 44992 lines...]

Mime
View raw message