lucene-dev mailing list archives

Site index · List index
Message view « Date » · « Thread »
Top « Date » · « Thread »
From Policeman Jenkins Server <jenk...@thetaphi.de>
Subject [JENKINS-EA] Lucene-Solr-master-Windows (64bit/jdk-9-ea+173) - Build # 6710 - Still Unstable!
Date Wed, 05 Jul 2017 17:07:52 GMT
Build: https://jenkins.thetaphi.de/job/Lucene-Solr-master-Windows/6710/
Java: 64bit/jdk-9-ea+173 -XX:-UseCompressedOops -XX:+UseG1GC

3 tests failed.
FAILED:  org.apache.solr.cloud.ChaosMonkeyNothingIsSafeTest.test

Error Message:
Timeout occured while waiting response from server at: http://127.0.0.1:52640/_jd/ml

Stack Trace:
org.apache.solr.client.solrj.SolrServerException: Timeout occured while waiting response from server at: http://127.0.0.1:52640/_jd/ml
	at __randomizedtesting.SeedInfo.seed([9BDAEAA95EBDCA83:138ED573F041A77B]:0)
	at org.apache.solr.client.solrj.impl.HttpSolrClient.executeMethod(HttpSolrClient.java:637)
	at org.apache.solr.client.solrj.impl.HttpSolrClient.request(HttpSolrClient.java:252)
	at org.apache.solr.client.solrj.impl.HttpSolrClient.request(HttpSolrClient.java:241)
	at org.apache.solr.client.solrj.impl.LBHttpSolrClient.doRequest(LBHttpSolrClient.java:483)
	at org.apache.solr.client.solrj.impl.LBHttpSolrClient.request(LBHttpSolrClient.java:413)
	at org.apache.solr.client.solrj.impl.CloudSolrClient.sendRequest(CloudSolrClient.java:1121)
	at org.apache.solr.client.solrj.impl.CloudSolrClient.requestWithRetryOnStaleState(CloudSolrClient.java:862)
	at org.apache.solr.client.solrj.impl.CloudSolrClient.request(CloudSolrClient.java:793)
	at org.apache.solr.client.solrj.SolrClient.request(SolrClient.java:1219)
	at org.apache.solr.cloud.AbstractFullDistribZkTestBase.createCollection(AbstractFullDistribZkTestBase.java:1667)
	at org.apache.solr.cloud.AbstractFullDistribZkTestBase.createCollection(AbstractFullDistribZkTestBase.java:1694)
	at org.apache.solr.cloud.ChaosMonkeyNothingIsSafeTest.test(ChaosMonkeyNothingIsSafeTest.java:254)
	at java.base/jdk.internal.reflect.NativeMethodAccessorImpl.invoke0(Native Method)
	at java.base/jdk.internal.reflect.NativeMethodAccessorImpl.invoke(NativeMethodAccessorImpl.java:62)
	at java.base/jdk.internal.reflect.DelegatingMethodAccessorImpl.invoke(DelegatingMethodAccessorImpl.java:43)
	at java.base/java.lang.reflect.Method.invoke(Method.java:564)
	at com.carrotsearch.randomizedtesting.RandomizedRunner.invoke(RandomizedRunner.java:1713)
	at com.carrotsearch.randomizedtesting.RandomizedRunner$8.evaluate(RandomizedRunner.java:907)
	at com.carrotsearch.randomizedtesting.RandomizedRunner$9.evaluate(RandomizedRunner.java:943)
	at com.carrotsearch.randomizedtesting.RandomizedRunner$10.evaluate(RandomizedRunner.java:957)
	at org.apache.solr.BaseDistributedSearchTestCase$ShardsRepeatRule$ShardsFixedStatement.callStatement(BaseDistributedSearchTestCase.java:985)
	at org.apache.solr.BaseDistributedSearchTestCase$ShardsRepeatRule$ShardsStatement.evaluate(BaseDistributedSearchTestCase.java:960)
	at com.carrotsearch.randomizedtesting.rules.SystemPropertiesRestoreRule$1.evaluate(SystemPropertiesRestoreRule.java:57)
	at org.apache.lucene.util.TestRuleSetupTeardownChained$1.evaluate(TestRuleSetupTeardownChained.java:49)
	at org.apache.lucene.util.AbstractBeforeAfterRule$1.evaluate(AbstractBeforeAfterRule.java:45)
	at org.apache.lucene.util.TestRuleThreadAndTestName$1.evaluate(TestRuleThreadAndTestName.java:48)
	at org.apache.lucene.util.TestRuleIgnoreAfterMaxFailures$1.evaluate(TestRuleIgnoreAfterMaxFailures.java:64)
	at org.apache.lucene.util.TestRuleMarkFailure$1.evaluate(TestRuleMarkFailure.java:47)
	at com.carrotsearch.randomizedtesting.rules.StatementAdapter.evaluate(StatementAdapter.java:36)
	at com.carrotsearch.randomizedtesting.ThreadLeakControl$StatementRunner.run(ThreadLeakControl.java:368)
	at com.carrotsearch.randomizedtesting.ThreadLeakControl.forkTimeoutingTask(ThreadLeakControl.java:817)
	at com.carrotsearch.randomizedtesting.ThreadLeakControl$3.evaluate(ThreadLeakControl.java:468)
	at com.carrotsearch.randomizedtesting.RandomizedRunner.runSingleTest(RandomizedRunner.java:916)
	at com.carrotsearch.randomizedtesting.RandomizedRunner$5.evaluate(RandomizedRunner.java:802)
	at com.carrotsearch.randomizedtesting.RandomizedRunner$6.evaluate(RandomizedRunner.java:852)
	at com.carrotsearch.randomizedtesting.RandomizedRunner$7.evaluate(RandomizedRunner.java:863)
	at com.carrotsearch.randomizedtesting.rules.StatementAdapter.evaluate(StatementAdapter.java:36)
	at com.carrotsearch.randomizedtesting.rules.SystemPropertiesRestoreRule$1.evaluate(SystemPropertiesRestoreRule.java:57)
	at org.apache.lucene.util.AbstractBeforeAfterRule$1.evaluate(AbstractBeforeAfterRule.java:45)
	at com.carrotsearch.randomizedtesting.rules.StatementAdapter.evaluate(StatementAdapter.java:36)
	at org.apache.lucene.util.TestRuleStoreClassName$1.evaluate(TestRuleStoreClassName.java:41)
	at com.carrotsearch.randomizedtesting.rules.NoShadowingOrOverridesOnMethodsRule$1.evaluate(NoShadowingOrOverridesOnMethodsRule.java:40)
	at com.carrotsearch.randomizedtesting.rules.NoShadowingOrOverridesOnMethodsRule$1.evaluate(NoShadowingOrOverridesOnMethodsRule.java:40)
	at com.carrotsearch.randomizedtesting.rules.StatementAdapter.evaluate(StatementAdapter.java:36)
	at com.carrotsearch.randomizedtesting.rules.StatementAdapter.evaluate(StatementAdapter.java:36)
	at org.apache.lucene.util.TestRuleAssertionsRequired$1.evaluate(TestRuleAssertionsRequired.java:53)
	at org.apache.lucene.util.TestRuleMarkFailure$1.evaluate(TestRuleMarkFailure.java:47)
	at org.apache.lucene.util.TestRuleIgnoreAfterMaxFailures$1.evaluate(TestRuleIgnoreAfterMaxFailures.java:64)
	at org.apache.lucene.util.TestRuleIgnoreTestSuites$1.evaluate(TestRuleIgnoreTestSuites.java:54)
	at com.carrotsearch.randomizedtesting.rules.StatementAdapter.evaluate(StatementAdapter.java:36)
	at com.carrotsearch.randomizedtesting.ThreadLeakControl$StatementRunner.run(ThreadLeakControl.java:368)
	at java.base/java.lang.Thread.run(Thread.java:844)
Caused by: java.net.SocketTimeoutException: Read timed out
	at java.base/java.net.SocketInputStream.socketRead0(Native Method)
	at java.base/java.net.SocketInputStream.socketRead(SocketInputStream.java:116)
	at java.base/java.net.SocketInputStream.read(SocketInputStream.java:171)
	at java.base/java.net.SocketInputStream.read(SocketInputStream.java:141)
	at org.apache.http.impl.io.SessionInputBufferImpl.streamRead(SessionInputBufferImpl.java:139)
	at org.apache.http.impl.io.SessionInputBufferImpl.fillBuffer(SessionInputBufferImpl.java:155)
	at org.apache.http.impl.io.SessionInputBufferImpl.readLine(SessionInputBufferImpl.java:284)
	at org.apache.http.impl.conn.DefaultHttpResponseParser.parseHead(DefaultHttpResponseParser.java:140)
	at org.apache.http.impl.conn.DefaultHttpResponseParser.parseHead(DefaultHttpResponseParser.java:57)
	at org.apache.http.impl.io.AbstractMessageParser.parse(AbstractMessageParser.java:261)
	at org.apache.http.impl.DefaultBHttpClientConnection.receiveResponseHeader(DefaultBHttpClientConnection.java:165)
	at org.apache.http.impl.conn.CPoolProxy.receiveResponseHeader(CPoolProxy.java:167)
	at org.apache.http.protocol.HttpRequestExecutor.doReceiveResponse(HttpRequestExecutor.java:272)
	at org.apache.http.protocol.HttpRequestExecutor.execute(HttpRequestExecutor.java:124)
	at org.apache.http.impl.execchain.MainClientExec.execute(MainClientExec.java:271)
	at org.apache.http.impl.execchain.ProtocolExec.execute(ProtocolExec.java:184)
	at org.apache.http.impl.execchain.RetryExec.execute(RetryExec.java:88)
	at org.apache.http.impl.execchain.RedirectExec.execute(RedirectExec.java:110)
	at org.apache.http.impl.client.InternalHttpClient.doExecute(InternalHttpClient.java:184)
	at org.apache.http.impl.client.CloseableHttpClient.execute(CloseableHttpClient.java:82)
	at org.apache.http.impl.client.CloseableHttpClient.execute(CloseableHttpClient.java:55)
	at org.apache.solr.client.solrj.impl.HttpSolrClient.executeMethod(HttpSolrClient.java:523)
	... 51 more


FAILED:  junit.framework.TestSuite.org.apache.solr.cloud.ChaosMonkeyNothingIsSafeTest

Error Message:
9 threads leaked from SUITE scope at org.apache.solr.cloud.ChaosMonkeyNothingIsSafeTest:     1) Thread[id=9851, name=zkCallback-1516-thread-5, state=TIMED_WAITING, group=TGRP-ChaosMonkeyNothingIsSafeTest]         at java.base@9-ea/jdk.internal.misc.Unsafe.park(Native Method)         at java.base@9-ea/java.util.concurrent.locks.LockSupport.parkNanos(LockSupport.java:234)         at java.base@9-ea/java.util.concurrent.SynchronousQueue$TransferStack.awaitFulfill(SynchronousQueue.java:462)         at java.base@9-ea/java.util.concurrent.SynchronousQueue$TransferStack.transfer(SynchronousQueue.java:361)         at java.base@9-ea/java.util.concurrent.SynchronousQueue.poll(SynchronousQueue.java:937)         at java.base@9-ea/java.util.concurrent.ThreadPoolExecutor.getTask(ThreadPoolExecutor.java:1085)         at java.base@9-ea/java.util.concurrent.ThreadPoolExecutor.runWorker(ThreadPoolExecutor.java:1146)         at java.base@9-ea/java.util.concurrent.ThreadPoolExecutor$Worker.run(ThreadPoolExecutor.java:635)         at java.base@9-ea/java.lang.Thread.run(Thread.java:844)    2) Thread[id=9632, name=TEST-ChaosMonkeyNothingIsSafeTest.test-seed#[9BDAEAA95EBDCA83]-EventThread, state=WAITING, group=TGRP-ChaosMonkeyNothingIsSafeTest]         at java.base@9-ea/jdk.internal.misc.Unsafe.park(Native Method)         at java.base@9-ea/java.util.concurrent.locks.LockSupport.park(LockSupport.java:194)         at java.base@9-ea/java.util.concurrent.locks.AbstractQueuedSynchronizer$ConditionObject.await(AbstractQueuedSynchronizer.java:2062)         at java.base@9-ea/java.util.concurrent.LinkedBlockingQueue.take(LinkedBlockingQueue.java:435)         at app//org.apache.zookeeper.ClientCnxn$EventThread.run(ClientCnxn.java:501)    3) Thread[id=9852, name=zkCallback-1516-thread-6, state=TIMED_WAITING, group=TGRP-ChaosMonkeyNothingIsSafeTest]         at java.base@9-ea/jdk.internal.misc.Unsafe.park(Native Method)         at java.base@9-ea/java.util.concurrent.locks.LockSupport.parkNanos(LockSupport.java:234)         at java.base@9-ea/java.util.concurrent.SynchronousQueue$TransferStack.awaitFulfill(SynchronousQueue.java:462)         at java.base@9-ea/java.util.concurrent.SynchronousQueue$TransferStack.transfer(SynchronousQueue.java:361)         at java.base@9-ea/java.util.concurrent.SynchronousQueue.poll(SynchronousQueue.java:937)         at java.base@9-ea/java.util.concurrent.ThreadPoolExecutor.getTask(ThreadPoolExecutor.java:1085)         at java.base@9-ea/java.util.concurrent.ThreadPoolExecutor.runWorker(ThreadPoolExecutor.java:1146)         at java.base@9-ea/java.util.concurrent.ThreadPoolExecutor$Worker.run(ThreadPoolExecutor.java:635)         at java.base@9-ea/java.lang.Thread.run(Thread.java:844)    4) Thread[id=9805, name=zkCallback-1516-thread-4, state=TIMED_WAITING, group=TGRP-ChaosMonkeyNothingIsSafeTest]         at java.base@9-ea/jdk.internal.misc.Unsafe.park(Native Method)         at java.base@9-ea/java.util.concurrent.locks.LockSupport.parkNanos(LockSupport.java:234)         at java.base@9-ea/java.util.concurrent.SynchronousQueue$TransferStack.awaitFulfill(SynchronousQueue.java:462)         at java.base@9-ea/java.util.concurrent.SynchronousQueue$TransferStack.transfer(SynchronousQueue.java:361)         at java.base@9-ea/java.util.concurrent.SynchronousQueue.poll(SynchronousQueue.java:937)         at java.base@9-ea/java.util.concurrent.ThreadPoolExecutor.getTask(ThreadPoolExecutor.java:1085)         at java.base@9-ea/java.util.concurrent.ThreadPoolExecutor.runWorker(ThreadPoolExecutor.java:1146)         at java.base@9-ea/java.util.concurrent.ThreadPoolExecutor$Worker.run(ThreadPoolExecutor.java:635)         at java.base@9-ea/java.lang.Thread.run(Thread.java:844)    5) Thread[id=9630, name=Connection evictor, state=TIMED_WAITING, group=TGRP-ChaosMonkeyNothingIsSafeTest]         at java.base@9-ea/java.lang.Thread.sleep(Native Method)         at app//org.apache.http.impl.client.IdleConnectionEvictor$1.run(IdleConnectionEvictor.java:66)         at java.base@9-ea/java.lang.Thread.run(Thread.java:844)    6) Thread[id=9803, name=zkCallback-1516-thread-2, state=TIMED_WAITING, group=TGRP-ChaosMonkeyNothingIsSafeTest]         at java.base@9-ea/jdk.internal.misc.Unsafe.park(Native Method)         at java.base@9-ea/java.util.concurrent.locks.LockSupport.parkNanos(LockSupport.java:234)         at java.base@9-ea/java.util.concurrent.SynchronousQueue$TransferStack.awaitFulfill(SynchronousQueue.java:462)         at java.base@9-ea/java.util.concurrent.SynchronousQueue$TransferStack.transfer(SynchronousQueue.java:361)         at java.base@9-ea/java.util.concurrent.SynchronousQueue.poll(SynchronousQueue.java:937)         at java.base@9-ea/java.util.concurrent.ThreadPoolExecutor.getTask(ThreadPoolExecutor.java:1085)         at java.base@9-ea/java.util.concurrent.ThreadPoolExecutor.runWorker(ThreadPoolExecutor.java:1146)         at java.base@9-ea/java.util.concurrent.ThreadPoolExecutor$Worker.run(ThreadPoolExecutor.java:635)         at java.base@9-ea/java.lang.Thread.run(Thread.java:844)    7) Thread[id=9804, name=zkCallback-1516-thread-3, state=TIMED_WAITING, group=TGRP-ChaosMonkeyNothingIsSafeTest]         at java.base@9-ea/jdk.internal.misc.Unsafe.park(Native Method)         at java.base@9-ea/java.util.concurrent.locks.LockSupport.parkNanos(LockSupport.java:234)         at java.base@9-ea/java.util.concurrent.SynchronousQueue$TransferStack.awaitFulfill(SynchronousQueue.java:462)         at java.base@9-ea/java.util.concurrent.SynchronousQueue$TransferStack.transfer(SynchronousQueue.java:361)         at java.base@9-ea/java.util.concurrent.SynchronousQueue.poll(SynchronousQueue.java:937)         at java.base@9-ea/java.util.concurrent.ThreadPoolExecutor.getTask(ThreadPoolExecutor.java:1085)         at java.base@9-ea/java.util.concurrent.ThreadPoolExecutor.runWorker(ThreadPoolExecutor.java:1146)         at java.base@9-ea/java.util.concurrent.ThreadPoolExecutor$Worker.run(ThreadPoolExecutor.java:635)         at java.base@9-ea/java.lang.Thread.run(Thread.java:844)    8) Thread[id=9631, name=TEST-ChaosMonkeyNothingIsSafeTest.test-seed#[9BDAEAA95EBDCA83]-SendThread(127.0.0.1:52600), state=RUNNABLE, group=TGRP-ChaosMonkeyNothingIsSafeTest]         at java.base@9-ea/sun.nio.ch.WindowsSelectorImpl$SubSelector.poll0(Native Method)         at java.base@9-ea/sun.nio.ch.WindowsSelectorImpl$SubSelector.poll(WindowsSelectorImpl.java:296)         at java.base@9-ea/sun.nio.ch.WindowsSelectorImpl$SubSelector.access$400(WindowsSelectorImpl.java:278)         at java.base@9-ea/sun.nio.ch.WindowsSelectorImpl.doSelect(WindowsSelectorImpl.java:159)         at java.base@9-ea/sun.nio.ch.SelectorImpl.lockAndDoSelect(SelectorImpl.java:86)         at java.base@9-ea/sun.nio.ch.SelectorImpl.select(SelectorImpl.java:97)         at app//org.apache.zookeeper.ClientCnxnSocketNIO.doTransport(ClientCnxnSocketNIO.java:349)         at app//org.apache.zookeeper.ClientCnxn$SendThread.run(ClientCnxn.java:1141)    9) Thread[id=9633, name=zkCallback-1516-thread-1, state=TIMED_WAITING, group=TGRP-ChaosMonkeyNothingIsSafeTest]         at java.base@9-ea/jdk.internal.misc.Unsafe.park(Native Method)         at java.base@9-ea/java.util.concurrent.locks.LockSupport.parkNanos(LockSupport.java:234)         at java.base@9-ea/java.util.concurrent.SynchronousQueue$TransferStack.awaitFulfill(SynchronousQueue.java:462)         at java.base@9-ea/java.util.concurrent.SynchronousQueue$TransferStack.transfer(SynchronousQueue.java:361)         at java.base@9-ea/java.util.concurrent.SynchronousQueue.poll(SynchronousQueue.java:937)         at java.base@9-ea/java.util.concurrent.ThreadPoolExecutor.getTask(ThreadPoolExecutor.java:1085)         at java.base@9-ea/java.util.concurrent.ThreadPoolExecutor.runWorker(ThreadPoolExecutor.java:1146)         at java.base@9-ea/java.util.concurrent.ThreadPoolExecutor$Worker.run(ThreadPoolExecutor.java:635)         at java.base@9-ea/java.lang.Thread.run(Thread.java:844)

Stack Trace:
com.carrotsearch.randomizedtesting.ThreadLeakError: 9 threads leaked from SUITE scope at org.apache.solr.cloud.ChaosMonkeyNothingIsSafeTest: 
   1) Thread[id=9851, name=zkCallback-1516-thread-5, state=TIMED_WAITING, group=TGRP-ChaosMonkeyNothingIsSafeTest]
        at java.base@9-ea/jdk.internal.misc.Unsafe.park(Native Method)
        at java.base@9-ea/java.util.concurrent.locks.LockSupport.parkNanos(LockSupport.java:234)
        at java.base@9-ea/java.util.concurrent.SynchronousQueue$TransferStack.awaitFulfill(SynchronousQueue.java:462)
        at java.base@9-ea/java.util.concurrent.SynchronousQueue$TransferStack.transfer(SynchronousQueue.java:361)
        at java.base@9-ea/java.util.concurrent.SynchronousQueue.poll(SynchronousQueue.java:937)
        at java.base@9-ea/java.util.concurrent.ThreadPoolExecutor.getTask(ThreadPoolExecutor.java:1085)
        at java.base@9-ea/java.util.concurrent.ThreadPoolExecutor.runWorker(ThreadPoolExecutor.java:1146)
        at java.base@9-ea/java.util.concurrent.ThreadPoolExecutor$Worker.run(ThreadPoolExecutor.java:635)
        at java.base@9-ea/java.lang.Thread.run(Thread.java:844)
   2) Thread[id=9632, name=TEST-ChaosMonkeyNothingIsSafeTest.test-seed#[9BDAEAA95EBDCA83]-EventThread, state=WAITING, group=TGRP-ChaosMonkeyNothingIsSafeTest]
        at java.base@9-ea/jdk.internal.misc.Unsafe.park(Native Method)
        at java.base@9-ea/java.util.concurrent.locks.LockSupport.park(LockSupport.java:194)
        at java.base@9-ea/java.util.concurrent.locks.AbstractQueuedSynchronizer$ConditionObject.await(AbstractQueuedSynchronizer.java:2062)
        at java.base@9-ea/java.util.concurrent.LinkedBlockingQueue.take(LinkedBlockingQueue.java:435)
        at app//org.apache.zookeeper.ClientCnxn$EventThread.run(ClientCnxn.java:501)
   3) Thread[id=9852, name=zkCallback-1516-thread-6, state=TIMED_WAITING, group=TGRP-ChaosMonkeyNothingIsSafeTest]
        at java.base@9-ea/jdk.internal.misc.Unsafe.park(Native Method)
        at java.base@9-ea/java.util.concurrent.locks.LockSupport.parkNanos(LockSupport.java:234)
        at java.base@9-ea/java.util.concurrent.SynchronousQueue$TransferStack.awaitFulfill(SynchronousQueue.java:462)
        at java.base@9-ea/java.util.concurrent.SynchronousQueue$TransferStack.transfer(SynchronousQueue.java:361)
        at java.base@9-ea/java.util.concurrent.SynchronousQueue.poll(SynchronousQueue.java:937)
        at java.base@9-ea/java.util.concurrent.ThreadPoolExecutor.getTask(ThreadPoolExecutor.java:1085)
        at java.base@9-ea/java.util.concurrent.ThreadPoolExecutor.runWorker(ThreadPoolExecutor.java:1146)
        at java.base@9-ea/java.util.concurrent.ThreadPoolExecutor$Worker.run(ThreadPoolExecutor.java:635)
        at java.base@9-ea/java.lang.Thread.run(Thread.java:844)
   4) Thread[id=9805, name=zkCallback-1516-thread-4, state=TIMED_WAITING, group=TGRP-ChaosMonkeyNothingIsSafeTest]
        at java.base@9-ea/jdk.internal.misc.Unsafe.park(Native Method)
        at java.base@9-ea/java.util.concurrent.locks.LockSupport.parkNanos(LockSupport.java:234)
        at java.base@9-ea/java.util.concurrent.SynchronousQueue$TransferStack.awaitFulfill(SynchronousQueue.java:462)
        at java.base@9-ea/java.util.concurrent.SynchronousQueue$TransferStack.transfer(SynchronousQueue.java:361)
        at java.base@9-ea/java.util.concurrent.SynchronousQueue.poll(SynchronousQueue.java:937)
        at java.base@9-ea/java.util.concurrent.ThreadPoolExecutor.getTask(ThreadPoolExecutor.java:1085)
        at java.base@9-ea/java.util.concurrent.ThreadPoolExecutor.runWorker(ThreadPoolExecutor.java:1146)
        at java.base@9-ea/java.util.concurrent.ThreadPoolExecutor$Worker.run(ThreadPoolExecutor.java:635)
        at java.base@9-ea/java.lang.Thread.run(Thread.java:844)
   5) Thread[id=9630, name=Connection evictor, state=TIMED_WAITING, group=TGRP-ChaosMonkeyNothingIsSafeTest]
        at java.base@9-ea/java.lang.Thread.sleep(Native Method)
        at app//org.apache.http.impl.client.IdleConnectionEvictor$1.run(IdleConnectionEvictor.java:66)
        at java.base@9-ea/java.lang.Thread.run(Thread.java:844)
   6) Thread[id=9803, name=zkCallback-1516-thread-2, state=TIMED_WAITING, group=TGRP-ChaosMonkeyNothingIsSafeTest]
        at java.base@9-ea/jdk.internal.misc.Unsafe.park(Native Method)
        at java.base@9-ea/java.util.concurrent.locks.LockSupport.parkNanos(LockSupport.java:234)
        at java.base@9-ea/java.util.concurrent.SynchronousQueue$TransferStack.awaitFulfill(SynchronousQueue.java:462)
        at java.base@9-ea/java.util.concurrent.SynchronousQueue$TransferStack.transfer(SynchronousQueue.java:361)
        at java.base@9-ea/java.util.concurrent.SynchronousQueue.poll(SynchronousQueue.java:937)
        at java.base@9-ea/java.util.concurrent.ThreadPoolExecutor.getTask(ThreadPoolExecutor.java:1085)
        at java.base@9-ea/java.util.concurrent.ThreadPoolExecutor.runWorker(ThreadPoolExecutor.java:1146)
        at java.base@9-ea/java.util.concurrent.ThreadPoolExecutor$Worker.run(ThreadPoolExecutor.java:635)
        at java.base@9-ea/java.lang.Thread.run(Thread.java:844)
   7) Thread[id=9804, name=zkCallback-1516-thread-3, state=TIMED_WAITING, group=TGRP-ChaosMonkeyNothingIsSafeTest]
        at java.base@9-ea/jdk.internal.misc.Unsafe.park(Native Method)
        at java.base@9-ea/java.util.concurrent.locks.LockSupport.parkNanos(LockSupport.java:234)
        at java.base@9-ea/java.util.concurrent.SynchronousQueue$TransferStack.awaitFulfill(SynchronousQueue.java:462)
        at java.base@9-ea/java.util.concurrent.SynchronousQueue$TransferStack.transfer(SynchronousQueue.java:361)
        at java.base@9-ea/java.util.concurrent.SynchronousQueue.poll(SynchronousQueue.java:937)
        at java.base@9-ea/java.util.concurrent.ThreadPoolExecutor.getTask(ThreadPoolExecutor.java:1085)
        at java.base@9-ea/java.util.concurrent.ThreadPoolExecutor.runWorker(ThreadPoolExecutor.java:1146)
        at java.base@9-ea/java.util.concurrent.ThreadPoolExecutor$Worker.run(ThreadPoolExecutor.java:635)
        at java.base@9-ea/java.lang.Thread.run(Thread.java:844)
   8) Thread[id=9631, name=TEST-ChaosMonkeyNothingIsSafeTest.test-seed#[9BDAEAA95EBDCA83]-SendThread(127.0.0.1:52600), state=RUNNABLE, group=TGRP-ChaosMonkeyNothingIsSafeTest]
        at java.base@9-ea/sun.nio.ch.WindowsSelectorImpl$SubSelector.poll0(Native Method)
        at java.base@9-ea/sun.nio.ch.WindowsSelectorImpl$SubSelector.poll(WindowsSelectorImpl.java:296)
        at java.base@9-ea/sun.nio.ch.WindowsSelectorImpl$SubSelector.access$400(WindowsSelectorImpl.java:278)
        at java.base@9-ea/sun.nio.ch.WindowsSelectorImpl.doSelect(WindowsSelectorImpl.java:159)
        at java.base@9-ea/sun.nio.ch.SelectorImpl.lockAndDoSelect(SelectorImpl.java:86)
        at java.base@9-ea/sun.nio.ch.SelectorImpl.select(SelectorImpl.java:97)
        at app//org.apache.zookeeper.ClientCnxnSocketNIO.doTransport(ClientCnxnSocketNIO.java:349)
        at app//org.apache.zookeeper.ClientCnxn$SendThread.run(ClientCnxn.java:1141)
   9) Thread[id=9633, name=zkCallback-1516-thread-1, state=TIMED_WAITING, group=TGRP-ChaosMonkeyNothingIsSafeTest]
        at java.base@9-ea/jdk.internal.misc.Unsafe.park(Native Method)
        at java.base@9-ea/java.util.concurrent.locks.LockSupport.parkNanos(LockSupport.java:234)
        at java.base@9-ea/java.util.concurrent.SynchronousQueue$TransferStack.awaitFulfill(SynchronousQueue.java:462)
        at java.base@9-ea/java.util.concurrent.SynchronousQueue$TransferStack.transfer(SynchronousQueue.java:361)
        at java.base@9-ea/java.util.concurrent.SynchronousQueue.poll(SynchronousQueue.java:937)
        at java.base@9-ea/java.util.concurrent.ThreadPoolExecutor.getTask(ThreadPoolExecutor.java:1085)
        at java.base@9-ea/java.util.concurrent.ThreadPoolExecutor.runWorker(ThreadPoolExecutor.java:1146)
        at java.base@9-ea/java.util.concurrent.ThreadPoolExecutor$Worker.run(ThreadPoolExecutor.java:635)
        at java.base@9-ea/java.lang.Thread.run(Thread.java:844)
	at __randomizedtesting.SeedInfo.seed([9BDAEAA95EBDCA83]:0)


FAILED:  junit.framework.TestSuite.org.apache.solr.cloud.ChaosMonkeyNothingIsSafeTest

Error Message:
There are still zombie threads that couldn't be terminated:    1) Thread[id=9851, name=zkCallback-1516-thread-5, state=TIMED_WAITING, group=TGRP-ChaosMonkeyNothingIsSafeTest]         at java.base@9-ea/jdk.internal.misc.Unsafe.park(Native Method)         at java.base@9-ea/java.util.concurrent.locks.LockSupport.parkNanos(LockSupport.java:234)         at java.base@9-ea/java.util.concurrent.SynchronousQueue$TransferStack.awaitFulfill(SynchronousQueue.java:462)         at java.base@9-ea/java.util.concurrent.SynchronousQueue$TransferStack.transfer(SynchronousQueue.java:361)         at java.base@9-ea/java.util.concurrent.SynchronousQueue.poll(SynchronousQueue.java:937)         at java.base@9-ea/java.util.concurrent.ThreadPoolExecutor.getTask(ThreadPoolExecutor.java:1085)         at java.base@9-ea/java.util.concurrent.ThreadPoolExecutor.runWorker(ThreadPoolExecutor.java:1146)         at java.base@9-ea/java.util.concurrent.ThreadPoolExecutor$Worker.run(ThreadPoolExecutor.java:635)         at java.base@9-ea/java.lang.Thread.run(Thread.java:844)    2) Thread[id=9852, name=zkCallback-1516-thread-6, state=TIMED_WAITING, group=TGRP-ChaosMonkeyNothingIsSafeTest]         at java.base@9-ea/jdk.internal.misc.Unsafe.park(Native Method)         at java.base@9-ea/java.util.concurrent.locks.LockSupport.parkNanos(LockSupport.java:234)         at java.base@9-ea/java.util.concurrent.SynchronousQueue$TransferStack.awaitFulfill(SynchronousQueue.java:462)         at java.base@9-ea/java.util.concurrent.SynchronousQueue$TransferStack.transfer(SynchronousQueue.java:361)         at java.base@9-ea/java.util.concurrent.SynchronousQueue.poll(SynchronousQueue.java:937)         at java.base@9-ea/java.util.concurrent.ThreadPoolExecutor.getTask(ThreadPoolExecutor.java:1085)         at java.base@9-ea/java.util.concurrent.ThreadPoolExecutor.runWorker(ThreadPoolExecutor.java:1146)         at java.base@9-ea/java.util.concurrent.ThreadPoolExecutor$Worker.run(ThreadPoolExecutor.java:635)         at java.base@9-ea/java.lang.Thread.run(Thread.java:844)    3) Thread[id=9805, name=zkCallback-1516-thread-4, state=TIMED_WAITING, group=TGRP-ChaosMonkeyNothingIsSafeTest]         at java.base@9-ea/jdk.internal.misc.Unsafe.park(Native Method)         at java.base@9-ea/java.util.concurrent.locks.LockSupport.parkNanos(LockSupport.java:234)         at java.base@9-ea/java.util.concurrent.SynchronousQueue$TransferStack.awaitFulfill(SynchronousQueue.java:462)         at java.base@9-ea/java.util.concurrent.SynchronousQueue$TransferStack.transfer(SynchronousQueue.java:361)         at java.base@9-ea/java.util.concurrent.SynchronousQueue.poll(SynchronousQueue.java:937)         at java.base@9-ea/java.util.concurrent.ThreadPoolExecutor.getTask(ThreadPoolExecutor.java:1085)         at java.base@9-ea/java.util.concurrent.ThreadPoolExecutor.runWorker(ThreadPoolExecutor.java:1146)         at java.base@9-ea/java.util.concurrent.ThreadPoolExecutor$Worker.run(ThreadPoolExecutor.java:635)         at java.base@9-ea/java.lang.Thread.run(Thread.java:844)    4) Thread[id=9803, name=zkCallback-1516-thread-2, state=TIMED_WAITING, group=TGRP-ChaosMonkeyNothingIsSafeTest]         at java.base@9-ea/jdk.internal.misc.Unsafe.park(Native Method)         at java.base@9-ea/java.util.concurrent.locks.LockSupport.parkNanos(LockSupport.java:234)         at java.base@9-ea/java.util.concurrent.SynchronousQueue$TransferStack.awaitFulfill(SynchronousQueue.java:462)         at java.base@9-ea/java.util.concurrent.SynchronousQueue$TransferStack.transfer(SynchronousQueue.java:361)         at java.base@9-ea/java.util.concurrent.SynchronousQueue.poll(SynchronousQueue.java:937)         at java.base@9-ea/java.util.concurrent.ThreadPoolExecutor.getTask(ThreadPoolExecutor.java:1085)         at java.base@9-ea/java.util.concurrent.ThreadPoolExecutor.runWorker(ThreadPoolExecutor.java:1146)         at java.base@9-ea/java.util.concurrent.ThreadPoolExecutor$Worker.run(ThreadPoolExecutor.java:635)         at java.base@9-ea/java.lang.Thread.run(Thread.java:844)    5) Thread[id=9804, name=zkCallback-1516-thread-3, state=TIMED_WAITING, group=TGRP-ChaosMonkeyNothingIsSafeTest]         at java.base@9-ea/jdk.internal.misc.Unsafe.park(Native Method)         at java.base@9-ea/java.util.concurrent.locks.LockSupport.parkNanos(LockSupport.java:234)         at java.base@9-ea/java.util.concurrent.SynchronousQueue$TransferStack.awaitFulfill(SynchronousQueue.java:462)         at java.base@9-ea/java.util.concurrent.SynchronousQueue$TransferStack.transfer(SynchronousQueue.java:361)         at java.base@9-ea/java.util.concurrent.SynchronousQueue.poll(SynchronousQueue.java:937)         at java.base@9-ea/java.util.concurrent.ThreadPoolExecutor.getTask(ThreadPoolExecutor.java:1085)         at java.base@9-ea/java.util.concurrent.ThreadPoolExecutor.runWorker(ThreadPoolExecutor.java:1146)         at java.base@9-ea/java.util.concurrent.ThreadPoolExecutor$Worker.run(ThreadPoolExecutor.java:635)         at java.base@9-ea/java.lang.Thread.run(Thread.java:844)    6) Thread[id=9631, name=TEST-ChaosMonkeyNothingIsSafeTest.test-seed#[9BDAEAA95EBDCA83]-SendThread(127.0.0.1:52600), state=RUNNABLE, group=TGRP-ChaosMonkeyNothingIsSafeTest]         at java.base@9-ea/sun.nio.ch.WindowsSelectorImpl$SubSelector.poll0(Native Method)         at java.base@9-ea/sun.nio.ch.WindowsSelectorImpl$SubSelector.poll(WindowsSelectorImpl.java:296)         at java.base@9-ea/sun.nio.ch.WindowsSelectorImpl$SubSelector.access$400(WindowsSelectorImpl.java:278)         at java.base@9-ea/sun.nio.ch.WindowsSelectorImpl.doSelect(WindowsSelectorImpl.java:159)         at java.base@9-ea/sun.nio.ch.SelectorImpl.lockAndDoSelect(SelectorImpl.java:86)         at java.base@9-ea/sun.nio.ch.SelectorImpl.select(SelectorImpl.java:97)         at app//org.apache.zookeeper.ClientCnxnSocketNIO.doTransport(ClientCnxnSocketNIO.java:349)         at app//org.apache.zookeeper.ClientCnxn$SendThread.run(ClientCnxn.java:1141)    7) Thread[id=9633, name=zkCallback-1516-thread-1, state=TIMED_WAITING, group=TGRP-ChaosMonkeyNothingIsSafeTest]         at java.base@9-ea/jdk.internal.misc.Unsafe.park(Native Method)         at java.base@9-ea/java.util.concurrent.locks.LockSupport.parkNanos(LockSupport.java:234)         at java.base@9-ea/java.util.concurrent.SynchronousQueue$TransferStack.awaitFulfill(SynchronousQueue.java:462)         at java.base@9-ea/java.util.concurrent.SynchronousQueue$TransferStack.transfer(SynchronousQueue.java:361)         at java.base@9-ea/java.util.concurrent.SynchronousQueue.poll(SynchronousQueue.java:937)         at java.base@9-ea/java.util.concurrent.ThreadPoolExecutor.getTask(ThreadPoolExecutor.java:1085)         at java.base@9-ea/java.util.concurrent.ThreadPoolExecutor.runWorker(ThreadPoolExecutor.java:1146)         at java.base@9-ea/java.util.concurrent.ThreadPoolExecutor$Worker.run(ThreadPoolExecutor.java:635)         at java.base@9-ea/java.lang.Thread.run(Thread.java:844)

Stack Trace:
com.carrotsearch.randomizedtesting.ThreadLeakError: There are still zombie threads that couldn't be terminated:
   1) Thread[id=9851, name=zkCallback-1516-thread-5, state=TIMED_WAITING, group=TGRP-ChaosMonkeyNothingIsSafeTest]
        at java.base@9-ea/jdk.internal.misc.Unsafe.park(Native Method)
        at java.base@9-ea/java.util.concurrent.locks.LockSupport.parkNanos(LockSupport.java:234)
        at java.base@9-ea/java.util.concurrent.SynchronousQueue$TransferStack.awaitFulfill(SynchronousQueue.java:462)
        at java.base@9-ea/java.util.concurrent.SynchronousQueue$TransferStack.transfer(SynchronousQueue.java:361)
        at java.base@9-ea/java.util.concurrent.SynchronousQueue.poll(SynchronousQueue.java:937)
        at java.base@9-ea/java.util.concurrent.ThreadPoolExecutor.getTask(ThreadPoolExecutor.java:1085)
        at java.base@9-ea/java.util.concurrent.ThreadPoolExecutor.runWorker(ThreadPoolExecutor.java:1146)
        at java.base@9-ea/java.util.concurrent.ThreadPoolExecutor$Worker.run(ThreadPoolExecutor.java:635)
        at java.base@9-ea/java.lang.Thread.run(Thread.java:844)
   2) Thread[id=9852, name=zkCallback-1516-thread-6, state=TIMED_WAITING, group=TGRP-ChaosMonkeyNothingIsSafeTest]
        at java.base@9-ea/jdk.internal.misc.Unsafe.park(Native Method)
        at java.base@9-ea/java.util.concurrent.locks.LockSupport.parkNanos(LockSupport.java:234)
        at java.base@9-ea/java.util.concurrent.SynchronousQueue$TransferStack.awaitFulfill(SynchronousQueue.java:462)
        at java.base@9-ea/java.util.concurrent.SynchronousQueue$TransferStack.transfer(SynchronousQueue.java:361)
        at java.base@9-ea/java.util.concurrent.SynchronousQueue.poll(SynchronousQueue.java:937)
        at java.base@9-ea/java.util.concurrent.ThreadPoolExecutor.getTask(ThreadPoolExecutor.java:1085)
        at java.base@9-ea/java.util.concurrent.ThreadPoolExecutor.runWorker(ThreadPoolExecutor.java:1146)
        at java.base@9-ea/java.util.concurrent.ThreadPoolExecutor$Worker.run(ThreadPoolExecutor.java:635)
        at java.base@9-ea/java.lang.Thread.run(Thread.java:844)
   3) Thread[id=9805, name=zkCallback-1516-thread-4, state=TIMED_WAITING, group=TGRP-ChaosMonkeyNothingIsSafeTest]
        at java.base@9-ea/jdk.internal.misc.Unsafe.park(Native Method)
        at java.base@9-ea/java.util.concurrent.locks.LockSupport.parkNanos(LockSupport.java:234)
        at java.base@9-ea/java.util.concurrent.SynchronousQueue$TransferStack.awaitFulfill(SynchronousQueue.java:462)
        at java.base@9-ea/java.util.concurrent.SynchronousQueue$TransferStack.transfer(SynchronousQueue.java:361)
        at java.base@9-ea/java.util.concurrent.SynchronousQueue.poll(SynchronousQueue.java:937)
        at java.base@9-ea/java.util.concurrent.ThreadPoolExecutor.getTask(ThreadPoolExecutor.java:1085)
        at java.base@9-ea/java.util.concurrent.ThreadPoolExecutor.runWorker(ThreadPoolExecutor.java:1146)
        at java.base@9-ea/java.util.concurrent.ThreadPoolExecutor$Worker.run(ThreadPoolExecutor.java:635)
        at java.base@9-ea/java.lang.Thread.run(Thread.java:844)
   4) Thread[id=9803, name=zkCallback-1516-thread-2, state=TIMED_WAITING, group=TGRP-ChaosMonkeyNothingIsSafeTest]
        at java.base@9-ea/jdk.internal.misc.Unsafe.park(Native Method)
        at java.base@9-ea/java.util.concurrent.locks.LockSupport.parkNanos(LockSupport.java:234)
        at java.base@9-ea/java.util.concurrent.SynchronousQueue$TransferStack.awaitFulfill(SynchronousQueue.java:462)
        at java.base@9-ea/java.util.concurrent.SynchronousQueue$TransferStack.transfer(SynchronousQueue.java:361)
        at java.base@9-ea/java.util.concurrent.SynchronousQueue.poll(SynchronousQueue.java:937)
        at java.base@9-ea/java.util.concurrent.ThreadPoolExecutor.getTask(ThreadPoolExecutor.java:1085)
        at java.base@9-ea/java.util.concurrent.ThreadPoolExecutor.runWorker(ThreadPoolExecutor.java:1146)
        at java.base@9-ea/java.util.concurrent.ThreadPoolExecutor$Worker.run(ThreadPoolExecutor.java:635)
        at java.base@9-ea/java.lang.Thread.run(Thread.java:844)
   5) Thread[id=9804, name=zkCallback-1516-thread-3, state=TIMED_WAITING, group=TGRP-ChaosMonkeyNothingIsSafeTest]
        at java.base@9-ea/jdk.internal.misc.Unsafe.park(Native Method)
        at java.base@9-ea/java.util.concurrent.locks.LockSupport.parkNanos(LockSupport.java:234)
        at java.base@9-ea/java.util.concurrent.SynchronousQueue$TransferStack.awaitFulfill(SynchronousQueue.java:462)
        at java.base@9-ea/java.util.concurrent.SynchronousQueue$TransferStack.transfer(SynchronousQueue.java:361)
        at java.base@9-ea/java.util.concurrent.SynchronousQueue.poll(SynchronousQueue.java:937)
        at java.base@9-ea/java.util.concurrent.ThreadPoolExecutor.getTask(ThreadPoolExecutor.java:1085)
        at java.base@9-ea/java.util.concurrent.ThreadPoolExecutor.runWorker(ThreadPoolExecutor.java:1146)
        at java.base@9-ea/java.util.concurrent.ThreadPoolExecutor$Worker.run(ThreadPoolExecutor.java:635)
        at java.base@9-ea/java.lang.Thread.run(Thread.java:844)
   6) Thread[id=9631, name=TEST-ChaosMonkeyNothingIsSafeTest.test-seed#[9BDAEAA95EBDCA83]-SendThread(127.0.0.1:52600), state=RUNNABLE, group=TGRP-ChaosMonkeyNothingIsSafeTest]
        at java.base@9-ea/sun.nio.ch.WindowsSelectorImpl$SubSelector.poll0(Native Method)
        at java.base@9-ea/sun.nio.ch.WindowsSelectorImpl$SubSelector.poll(WindowsSelectorImpl.java:296)
        at java.base@9-ea/sun.nio.ch.WindowsSelectorImpl$SubSelector.access$400(WindowsSelectorImpl.java:278)
        at java.base@9-ea/sun.nio.ch.WindowsSelectorImpl.doSelect(WindowsSelectorImpl.java:159)
        at java.base@9-ea/sun.nio.ch.SelectorImpl.lockAndDoSelect(SelectorImpl.java:86)
        at java.base@9-ea/sun.nio.ch.SelectorImpl.select(SelectorImpl.java:97)
        at app//org.apache.zookeeper.ClientCnxnSocketNIO.doTransport(ClientCnxnSocketNIO.java:349)
        at app//org.apache.zookeeper.ClientCnxn$SendThread.run(ClientCnxn.java:1141)
   7) Thread[id=9633, name=zkCallback-1516-thread-1, state=TIMED_WAITING, group=TGRP-ChaosMonkeyNothingIsSafeTest]
        at java.base@9-ea/jdk.internal.misc.Unsafe.park(Native Method)
        at java.base@9-ea/java.util.concurrent.locks.LockSupport.parkNanos(LockSupport.java:234)
        at java.base@9-ea/java.util.concurrent.SynchronousQueue$TransferStack.awaitFulfill(SynchronousQueue.java:462)
        at java.base@9-ea/java.util.concurrent.SynchronousQueue$TransferStack.transfer(SynchronousQueue.java:361)
        at java.base@9-ea/java.util.concurrent.SynchronousQueue.poll(SynchronousQueue.java:937)
        at java.base@9-ea/java.util.concurrent.ThreadPoolExecutor.getTask(ThreadPoolExecutor.java:1085)
        at java.base@9-ea/java.util.concurrent.ThreadPoolExecutor.runWorker(ThreadPoolExecutor.java:1146)
        at java.base@9-ea/java.util.concurrent.ThreadPoolExecutor$Worker.run(ThreadPoolExecutor.java:635)
        at java.base@9-ea/java.lang.Thread.run(Thread.java:844)
	at __randomizedtesting.SeedInfo.seed([9BDAEAA95EBDCA83]:0)




Build Log:
[...truncated 11541 lines...]
   [junit4] Suite: org.apache.solr.cloud.ChaosMonkeyNothingIsSafeTest
   [junit4]   2> Creating dataDir: C:\Users\jenkins\workspace\Lucene-Solr-master-Windows\solr\build\solr-core\test\J0\temp\solr.cloud.ChaosMonkeyNothingIsSafeTest_9BDAEAA95EBDCA83-001\init-core-data-001
   [junit4]   2> 985607 INFO  (SUITE-ChaosMonkeyNothingIsSafeTest-seed#[9BDAEAA95EBDCA83]-worker) [    ] o.a.s.SolrTestCaseJ4 Using TrieFields (NUMERIC_POINTS_SYSPROP=false) w/NUMERIC_DOCVALUES_SYSPROP=false
   [junit4]   2> 985608 INFO  (SUITE-ChaosMonkeyNothingIsSafeTest-seed#[9BDAEAA95EBDCA83]-worker) [    ] o.a.s.SolrTestCaseJ4 Randomized ssl (false) and clientAuth (false) via: @org.apache.solr.SolrTestCaseJ4$SuppressSSL(bugUrl="https://issues.apache.org/jira/browse/SOLR-5776")
   [junit4]   2> 985609 INFO  (SUITE-ChaosMonkeyNothingIsSafeTest-seed#[9BDAEAA95EBDCA83]-worker) [    ] o.a.s.BaseDistributedSearchTestCase Setting hostContext system property: /_jd/ml
   [junit4]   2> 985611 INFO  (TEST-ChaosMonkeyNothingIsSafeTest.test-seed#[9BDAEAA95EBDCA83]) [    ] o.a.s.c.ZkTestServer STARTING ZK TEST SERVER
   [junit4]   2> 985611 INFO  (Thread-2626) [    ] o.a.s.c.ZkTestServer client port:0.0.0.0/0.0.0.0:0
   [junit4]   2> 985611 INFO  (Thread-2626) [    ] o.a.s.c.ZkTestServer Starting server
   [junit4]   2> 985616 ERROR (Thread-2626) [    ] o.a.z.s.ZooKeeperServer ZKShutdownHandler is not registered, so ZooKeeper server won't take any action on ERROR or SHUTDOWN server state changes
   [junit4]   2> 985711 INFO  (TEST-ChaosMonkeyNothingIsSafeTest.test-seed#[9BDAEAA95EBDCA83]) [    ] o.a.s.c.ZkTestServer start zk server on port:52600
   [junit4]   2> 985724 INFO  (TEST-ChaosMonkeyNothingIsSafeTest.test-seed#[9BDAEAA95EBDCA83]) [    ] o.a.s.c.AbstractZkTestCase put C:\Users\jenkins\workspace\Lucene-Solr-master-Windows\solr\core\src\test-files\solr\collection1\conf\solrconfig-tlog.xml to /configs/conf1/solrconfig.xml
   [junit4]   2> 985728 INFO  (TEST-ChaosMonkeyNothingIsSafeTest.test-seed#[9BDAEAA95EBDCA83]) [    ] o.a.s.c.AbstractZkTestCase put C:\Users\jenkins\workspace\Lucene-Solr-master-Windows\solr\core\src\test-files\solr\collection1\conf\schema15.xml to /configs/conf1/schema.xml
   [junit4]   2> 985729 INFO  (TEST-ChaosMonkeyNothingIsSafeTest.test-seed#[9BDAEAA95EBDCA83]) [    ] o.a.s.c.AbstractZkTestCase put C:\Users\jenkins\workspace\Lucene-Solr-master-Windows\solr\core\src\test-files\solr\collection1\conf\solrconfig.snippet.randomindexconfig.xml to /configs/conf1/solrconfig.snippet.randomindexconfig.xml
   [junit4]   2> 985731 INFO  (TEST-ChaosMonkeyNothingIsSafeTest.test-seed#[9BDAEAA95EBDCA83]) [    ] o.a.s.c.AbstractZkTestCase put C:\Users\jenkins\workspace\Lucene-Solr-master-Windows\solr\core\src\test-files\solr\collection1\conf\stopwords.txt to /configs/conf1/stopwords.txt
   [junit4]   2> 985733 INFO  (TEST-ChaosMonkeyNothingIsSafeTest.test-seed#[9BDAEAA95EBDCA83]) [    ] o.a.s.c.AbstractZkTestCase put C:\Users\jenkins\workspace\Lucene-Solr-master-Windows\solr\core\src\test-files\solr\collection1\conf\protwords.txt to /configs/conf1/protwords.txt
   [junit4]   2> 985735 INFO  (TEST-ChaosMonkeyNothingIsSafeTest.test-seed#[9BDAEAA95EBDCA83]) [    ] o.a.s.c.AbstractZkTestCase put C:\Users\jenkins\workspace\Lucene-Solr-master-Windows\solr\core\src\test-files\solr\collection1\conf\currency.xml to /configs/conf1/currency.xml
   [junit4]   2> 985736 INFO  (TEST-ChaosMonkeyNothingIsSafeTest.test-seed#[9BDAEAA95EBDCA83]) [    ] o.a.s.c.AbstractZkTestCase put C:\Users\jenkins\workspace\Lucene-Solr-master-Windows\solr\core\src\test-files\solr\collection1\conf\enumsConfig.xml to /configs/conf1/enumsConfig.xml
   [junit4]   2> 985738 INFO  (TEST-ChaosMonkeyNothingIsSafeTest.test-seed#[9BDAEAA95EBDCA83]) [    ] o.a.s.c.AbstractZkTestCase put C:\Users\jenkins\workspace\Lucene-Solr-master-Windows\solr\core\src\test-files\solr\collection1\conf\open-exchange-rates.json to /configs/conf1/open-exchange-rates.json
   [junit4]   2> 985739 INFO  (TEST-ChaosMonkeyNothingIsSafeTest.test-seed#[9BDAEAA95EBDCA83]) [    ] o.a.s.c.AbstractZkTestCase put C:\Users\jenkins\workspace\Lucene-Solr-master-Windows\solr\core\src\test-files\solr\collection1\conf\mapping-ISOLatin1Accent.txt to /configs/conf1/mapping-ISOLatin1Accent.txt
   [junit4]   2> 985741 INFO  (TEST-ChaosMonkeyNothingIsSafeTest.test-seed#[9BDAEAA95EBDCA83]) [    ] o.a.s.c.AbstractZkTestCase put C:\Users\jenkins\workspace\Lucene-Solr-master-Windows\solr\core\src\test-files\solr\collection1\conf\old_synonyms.txt to /configs/conf1/old_synonyms.txt
   [junit4]   2> 985742 INFO  (TEST-ChaosMonkeyNothingIsSafeTest.test-seed#[9BDAEAA95EBDCA83]) [    ] o.a.s.c.AbstractZkTestCase put C:\Users\jenkins\workspace\Lucene-Solr-master-Windows\solr\core\src\test-files\solr\collection1\conf\synonyms.txt to /configs/conf1/synonyms.txt
   [junit4]   2> 985744 INFO  (TEST-ChaosMonkeyNothingIsSafeTest.test-seed#[9BDAEAA95EBDCA83]) [    ] o.a.s.c.AbstractFullDistribZkTestBase Will use NRT replicas unless explicitly asked otherwise
   [junit4]   2> 986085 INFO  (TEST-ChaosMonkeyNothingIsSafeTest.test-seed#[9BDAEAA95EBDCA83]) [    ] o.e.j.s.Server jetty-9.3.14.v20161028
   [junit4]   2> 986086 INFO  (TEST-ChaosMonkeyNothingIsSafeTest.test-seed#[9BDAEAA95EBDCA83]) [    ] o.e.j.s.h.ContextHandler Started o.e.j.s.ServletContextHandler@33c7d580{/_jd/ml,null,AVAILABLE}
   [junit4]   2> 986088 INFO  (TEST-ChaosMonkeyNothingIsSafeTest.test-seed#[9BDAEAA95EBDCA83]) [    ] o.e.j.s.AbstractConnector Started ServerConnector@21cdc20d{HTTP/1.1,[http/1.1]}{127.0.0.1:52607}
   [junit4]   2> 986088 INFO  (TEST-ChaosMonkeyNothingIsSafeTest.test-seed#[9BDAEAA95EBDCA83]) [    ] o.e.j.s.Server Started @988050ms
   [junit4]   2> 986088 INFO  (TEST-ChaosMonkeyNothingIsSafeTest.test-seed#[9BDAEAA95EBDCA83]) [    ] o.a.s.c.s.e.JettySolrRunner Jetty properties: {hostContext=/_jd/ml, solr.data.dir=C:\Users\jenkins\workspace\Lucene-Solr-master-Windows\solr\build\solr-core\test\J0\temp\solr.cloud.ChaosMonkeyNothingIsSafeTest_9BDAEAA95EBDCA83-001\tempDir-001/control/data, hostPort=52607, coreRootDirectory=C:\Users\jenkins\workspace\Lucene-Solr-master-Windows\solr\build\solr-core\test\J0\..\..\..\..\..\..\..\..\..\Users\jenkins\workspace\Lucene-Solr-master-Windows\solr\build\solr-core\test\J0\temp\solr.cloud.ChaosMonkeyNothingIsSafeTest_9BDAEAA95EBDCA83-001\control-001\cores}
   [junit4]   2> 986088 ERROR (TEST-ChaosMonkeyNothingIsSafeTest.test-seed#[9BDAEAA95EBDCA83]) [    ] o.a.s.s.StartupLoggingUtils Missing Java Option solr.log.dir. Logging may be missing or incomplete.
   [junit4]   2> 986088 INFO  (TEST-ChaosMonkeyNothingIsSafeTest.test-seed#[9BDAEAA95EBDCA83]) [    ] o.a.s.s.SolrDispatchFilter  ___      _       Welcome to Apache Solr? version 8.0.0
   [junit4]   2> 986088 INFO  (TEST-ChaosMonkeyNothingIsSafeTest.test-seed#[9BDAEAA95EBDCA83]) [    ] o.a.s.s.SolrDispatchFilter / __| ___| |_ _   Starting in cloud mode on port null
   [junit4]   2> 986088 INFO  (TEST-ChaosMonkeyNothingIsSafeTest.test-seed#[9BDAEAA95EBDCA83]) [    ] o.a.s.s.SolrDispatchFilter \__ \/ _ \ | '_|  Install dir: null, Default config dir: null
   [junit4]   2> 986088 INFO  (TEST-ChaosMonkeyNothingIsSafeTest.test-seed#[9BDAEAA95EBDCA83]) [    ] o.a.s.s.SolrDispatchFilter |___/\___/_|_|    Start time: 2017-07-05T16:45:01.667230900Z
   [junit4]   2> 986092 INFO  (TEST-ChaosMonkeyNothingIsSafeTest.test-seed#[9BDAEAA95EBDCA83]) [    ] o.a.s.s.SolrDispatchFilter Loading solr.xml from SolrHome (not found in ZooKeeper)
   [junit4]   2> 986092 INFO  (TEST-ChaosMonkeyNothingIsSafeTest.test-seed#[9BDAEAA95EBDCA83]) [    ] o.a.s.c.SolrXmlConfig Loading container configuration from C:\Users\jenkins\workspace\Lucene-Solr-master-Windows\solr\build\solr-core\test\J0\temp\solr.cloud.ChaosMonkeyNothingIsSafeTest_9BDAEAA95EBDCA83-001\control-001\solr.xml
   [junit4]   2> 986095 INFO  (TEST-ChaosMonkeyNothingIsSafeTest.test-seed#[9BDAEAA95EBDCA83]) [    ] o.a.s.c.SolrXmlConfig MBean server found: com.sun.jmx.mbeanserver.JmxMBeanServer@535121cc, but no JMX reporters were configured - adding default JMX reporter.
   [junit4]   2> 986098 INFO  (TEST-ChaosMonkeyNothingIsSafeTest.test-seed#[9BDAEAA95EBDCA83]) [    ] o.a.s.c.ZkContainer Zookeeper client=127.0.0.1:52600/solr
   [junit4]   2> 986198 INFO  (TEST-ChaosMonkeyNothingIsSafeTest.test-seed#[9BDAEAA95EBDCA83]) [    ] o.a.s.c.Overseer Overseer (id=null) closing
   [junit4]   2> 986199 INFO  (TEST-ChaosMonkeyNothingIsSafeTest.test-seed#[9BDAEAA95EBDCA83]) [    ] o.a.s.c.OverseerElectionContext I am going to be the leader 127.0.0.1:52607__jd%2Fml
   [junit4]   2> 986200 INFO  (TEST-ChaosMonkeyNothingIsSafeTest.test-seed#[9BDAEAA95EBDCA83]) [    ] o.a.s.c.Overseer Overseer (id=98256361959915524-127.0.0.1:52607__jd%2Fml-n_0000000000) starting
   [junit4]   2> 986207 INFO  (TEST-ChaosMonkeyNothingIsSafeTest.test-seed#[9BDAEAA95EBDCA83]) [    ] o.a.s.c.ZkController Register node as live in ZooKeeper:/live_nodes/127.0.0.1:52607__jd%2Fml
   [junit4]   2> 986209 INFO  (zkCallback-1509-thread-1) [    ] o.a.s.c.c.ZkStateReader Updated live nodes from ZooKeeper... (0) -> (1)
   [junit4]   2> 986260 INFO  (TEST-ChaosMonkeyNothingIsSafeTest.test-seed#[9BDAEAA95EBDCA83]) [    ] o.a.s.m.r.SolrJmxReporter JMX monitoring for 'solr.node' (registry 'solr.node') enabled at server: com.sun.jmx.mbeanserver.JmxMBeanServer@535121cc
   [junit4]   2> 986264 INFO  (TEST-ChaosMonkeyNothingIsSafeTest.test-seed#[9BDAEAA95EBDCA83]) [    ] o.a.s.m.r.SolrJmxReporter JMX monitoring for 'solr.jvm' (registry 'solr.jvm') enabled at server: com.sun.jmx.mbeanserver.JmxMBeanServer@535121cc
   [junit4]   2> 986265 INFO  (TEST-ChaosMonkeyNothingIsSafeTest.test-seed#[9BDAEAA95EBDCA83]) [    ] o.a.s.m.r.SolrJmxReporter JMX monitoring for 'solr.jetty' (registry 'solr.jetty') enabled at server: com.sun.jmx.mbeanserver.JmxMBeanServer@535121cc
   [junit4]   2> 986265 INFO  (TEST-ChaosMonkeyNothingIsSafeTest.test-seed#[9BDAEAA95EBDCA83]) [    ] o.a.s.c.CorePropertiesLocator Found 0 core definitions underneath C:\Users\jenkins\workspace\Lucene-Solr-master-Windows\solr\build\solr-core\test\J0\..\..\..\..\..\..\..\..\..\Users\jenkins\workspace\Lucene-Solr-master-Windows\solr\build\solr-core\test\J0\temp\solr.cloud.ChaosMonkeyNothingIsSafeTest_9BDAEAA95EBDCA83-001\control-001\cores
   [junit4]   2> 986281 INFO  (TEST-ChaosMonkeyNothingIsSafeTest.test-seed#[9BDAEAA95EBDCA83]) [    ] o.a.s.c.c.ZkStateReader Updated live nodes from ZooKeeper... (0) -> (1)
   [junit4]   2> 986282 INFO  (TEST-ChaosMonkeyNothingIsSafeTest.test-seed#[9BDAEAA95EBDCA83]) [    ] o.a.s.c.s.i.ZkClientClusterStateProvider Cluster at 127.0.0.1:52600/solr ready
   [junit4]   2> 986284 INFO  (qtp844015238-9601) [    ] o.a.s.h.a.CollectionsHandler Invoked Collection Action :create with params replicationFactor=1&collection.configName=conf1&name=control_collection&nrtReplicas=1&action=CREATE&numShards=1&createNodeSet=127.0.0.1:52607__jd%252Fml&wt=javabin&version=2 and sendToOCPQueue=true
   [junit4]   2> 986287 INFO  (OverseerThreadFactory-4498-thread-1) [    ] o.a.s.c.CreateCollectionCmd Create collection control_collection
   [junit4]   2> 986391 INFO  (qtp844015238-9596) [    ] o.a.s.h.a.CoreAdminOperation core create command qt=/admin/cores&collection.configName=conf1&newCollection=true&name=control_collection_shard1_replica_n1&action=CREATE&numShards=1&collection=control_collection&shard=shard1&wt=javabin&version=2&replicaType=NRT
   [junit4]   2> 986392 INFO  (qtp844015238-9596) [    ] o.a.s.c.TransientSolrCoreCacheDefault Allocating transient cache for 4 transient cores
   [junit4]   2> 986496 INFO  (zkCallback-1509-thread-1) [    ] o.a.s.c.c.ZkStateReader A cluster state change: [WatchedEvent state:SyncConnected type:NodeDataChanged path:/collections/control_collection/state.json] for collection [control_collection] has occurred - updating... (live nodes size: [1])
   [junit4]   2> 987402 INFO  (qtp844015238-9596) [    ] o.a.s.c.SolrConfig Using Lucene MatchVersion: 8.0.0
   [junit4]   2> 987411 INFO  (qtp844015238-9596) [    ] o.a.s.s.IndexSchema [control_collection_shard1_replica_n1] Schema name=test
   [junit4]   2> 987463 INFO  (qtp844015238-9596) [    ] o.a.s.s.IndexSchema Loaded schema test/1.6 with uniqueid field id
   [junit4]   2> 987480 INFO  (qtp844015238-9596) [    ] o.a.s.c.CoreContainer Creating SolrCore 'control_collection_shard1_replica_n1' using configuration from collection control_collection, trusted=true
   [junit4]   2> 987481 INFO  (qtp844015238-9596) [    ] o.a.s.m.r.SolrJmxReporter JMX monitoring for 'solr.core.control_collection.shard1.replica_n1' (registry 'solr.core.control_collection.shard1.replica_n1') enabled at server: com.sun.jmx.mbeanserver.JmxMBeanServer@535121cc
   [junit4]   2> 987481 INFO  (qtp844015238-9596) [    ] o.a.s.c.SolrCore solr.RecoveryStrategy.Builder
   [junit4]   2> 987481 INFO  (qtp844015238-9596) [    ] o.a.s.c.SolrCore [[control_collection_shard1_replica_n1] ] Opening new SolrCore at [C:\Users\jenkins\workspace\Lucene-Solr-master-Windows\solr\build\solr-core\test\J0\temp\solr.cloud.ChaosMonkeyNothingIsSafeTest_9BDAEAA95EBDCA83-001\control-001\cores\control_collection_shard1_replica_n1], dataDir=[C:\Users\jenkins\workspace\Lucene-Solr-master-Windows\solr\build\solr-core\test\J0\..\..\..\..\..\..\..\..\..\Users\jenkins\workspace\Lucene-Solr-master-Windows\solr\build\solr-core\test\J0\temp\solr.cloud.ChaosMonkeyNothingIsSafeTest_9BDAEAA95EBDCA83-001\control-001\cores\control_collection_shard1_replica_n1\data\]
   [junit4]   2> 987488 INFO  (qtp844015238-9596) [    ] o.a.s.u.RandomMergePolicy RandomMergePolicy wrapping class org.apache.lucene.index.TieredMergePolicy: [TieredMergePolicy: maxMergeAtOnce=38, maxMergeAtOnceExplicit=48, maxMergedSegmentMB=72.0400390625, floorSegmentMB=1.9609375, forceMergeDeletesPctAllowed=0.11404885888174454, segmentsPerTier=23.0, maxCFSSegmentSizeMB=8.796093022207999E12, noCFSRatio=0.7358929892625931
   [junit4]   2> 987493 WARN  (qtp844015238-9596) [    ] o.a.s.c.RequestHandlers INVALID paramSet a in requestHandler {type = requestHandler,name = /dump,class = DumpRequestHandler,attributes = {initParams=a, name=/dump, class=DumpRequestHandler},args = {defaults={a=A,b=B}}}
   [junit4]   2> 987542 INFO  (qtp844015238-9596) [    ] o.a.s.u.UpdateHandler Using UpdateLog implementation: org.apache.solr.update.UpdateLog
   [junit4]   2> 987542 INFO  (qtp844015238-9596) [    ] o.a.s.u.UpdateLog Initializing UpdateLog: dataDir= defaultSyncLevel=FLUSH numRecordsToKeep=100 maxNumLogsToKeep=10 numVersionBuckets=65536
   [junit4]   2> 987544 INFO  (qtp844015238-9596) [    ] o.a.s.u.CommitTracker Hard AutoCommit: if uncommited for 15000ms; 
   [junit4]   2> 987544 INFO  (qtp844015238-9596) [    ] o.a.s.u.CommitTracker Soft AutoCommit: disabled
   [junit4]   2> 987545 INFO  (qtp844015238-9596) [    ] o.a.s.u.RandomMergePolicy RandomMergePolicy wrapping class org.apache.lucene.index.LogDocMergePolicy: [LogDocMergePolicy: minMergeSize=1000, mergeFactor=15, maxMergeSize=9223372036854775807, maxMergeSizeForForcedMerge=9223372036854775807, calibrateSizeByDeletes=false, maxMergeDocs=2147483647, maxCFSSegmentSizeMB=8.796093022207999E12, noCFSRatio=0.6796872469980504]
   [junit4]   2> 987545 INFO  (qtp844015238-9596) [    ] o.a.s.s.SolrIndexSearcher Opening [Searcher@712a9c8a[control_collection_shard1_replica_n1] main]
   [junit4]   2> 987547 INFO  (qtp844015238-9596) [    ] o.a.s.r.ManagedResourceStorage Configured ZooKeeperStorageIO with znodeBase: /configs/conf1
   [junit4]   2> 987547 INFO  (qtp844015238-9596) [    ] o.a.s.r.ManagedResourceStorage Loaded null at path _rest_managed.json using ZooKeeperStorageIO:path=/configs/conf1
   [junit4]   2> 987548 INFO  (qtp844015238-9596) [    ] o.a.s.h.ReplicationHandler Commits will be reserved for  10000
   [junit4]   2> 987548 INFO  (searcherExecutor-4501-thread-1) [    ] o.a.s.c.SolrCore [control_collection_shard1_replica_n1] Registered new searcher Searcher@712a9c8a[control_collection_shard1_replica_n1] main{ExitableDirectoryReader(UninvertingDirectoryReader())}
   [junit4]   2> 987549 INFO  (qtp844015238-9596) [    ] o.a.s.u.UpdateLog Could not find max version in index or recent updates, using new clock 1572101793385545728
   [junit4]   2> 987555 INFO  (qtp844015238-9596) [    ] o.a.s.c.ShardLeaderElectionContext Enough replicas found to continue.
   [junit4]   2> 987555 INFO  (qtp844015238-9596) [    ] o.a.s.c.ShardLeaderElectionContext I may be the new leader - try and sync
   [junit4]   2> 987555 INFO  (qtp844015238-9596) [    ] o.a.s.c.SyncStrategy Sync replicas to http://127.0.0.1:52607/_jd/ml/control_collection_shard1_replica_n1/
   [junit4]   2> 987555 INFO  (qtp844015238-9596) [    ] o.a.s.c.SyncStrategy Sync Success - now sync replicas to me
   [junit4]   2> 987555 INFO  (qtp844015238-9596) [    ] o.a.s.c.SyncStrategy http://127.0.0.1:52607/_jd/ml/control_collection_shard1_replica_n1/ has no replicas
   [junit4]   2> 987555 INFO  (qtp844015238-9596) [    ] o.a.s.c.ShardLeaderElectionContext Found all replicas participating in election, clear LIR
   [junit4]   2> 987561 INFO  (qtp844015238-9596) [    ] o.a.s.c.ShardLeaderElectionContext I am the new leader: http://127.0.0.1:52607/_jd/ml/control_collection_shard1_replica_n1/ shard1
   [junit4]   2> 987665 INFO  (zkCallback-1509-thread-1) [    ] o.a.s.c.c.ZkStateReader A cluster state change: [WatchedEvent state:SyncConnected type:NodeDataChanged path:/collections/control_collection/state.json] for collection [control_collection] has occurred - updating... (live nodes size: [1])
   [junit4]   2> 987714 INFO  (qtp844015238-9596) [    ] o.a.s.c.ZkController I am the leader, no recovery necessary
   [junit4]   2> 987716 INFO  (qtp844015238-9596) [    ] o.a.s.s.HttpSolrCall [admin] webapp=null path=/admin/cores params={qt=/admin/cores&collection.configName=conf1&newCollection=true&name=control_collection_shard1_replica_n1&action=CREATE&numShards=1&collection=control_collection&shard=shard1&wt=javabin&version=2&replicaType=NRT} status=0 QTime=1325
   [junit4]   2> 987719 INFO  (qtp844015238-9601) [    ] o.a.s.h.a.CollectionsHandler Wait for new collection to be active for at most 30 seconds. Check all shard replicas
   [junit4]   2> 987818 INFO  (zkCallback-1509-thread-1) [    ] o.a.s.c.c.ZkStateReader A cluster state change: [WatchedEvent state:SyncConnected type:NodeDataChanged path:/collections/control_collection/state.json] for collection [control_collection] has occurred - updating... (live nodes size: [1])
   [junit4]   2> 988288 INFO  (OverseerCollectionConfigSetProcessor-98256361959915524-127.0.0.1:52607__jd%2Fml-n_0000000000) [    ] o.a.s.c.OverseerTaskQueue Response ZK path: /overseer/collection-queue-work/qnr-0000000000 doesn't exist.  Requestor may have disconnected from ZooKeeper
   [junit4]   2> 988720 INFO  (qtp844015238-9601) [    ] o.a.s.s.HttpSolrCall [admin] webapp=null path=/admin/collections params={replicationFactor=1&collection.configName=conf1&name=control_collection&nrtReplicas=1&action=CREATE&numShards=1&createNodeSet=127.0.0.1:52607__jd%252Fml&wt=javabin&version=2} status=0 QTime=2435
   [junit4]   2> 988725 INFO  (TEST-ChaosMonkeyNothingIsSafeTest.test-seed#[9BDAEAA95EBDCA83]) [    ] o.a.s.c.c.ZkStateReader Updated live nodes from ZooKeeper... (0) -> (1)
   [junit4]   2> 988726 INFO  (TEST-ChaosMonkeyNothingIsSafeTest.test-seed#[9BDAEAA95EBDCA83]) [    ] o.a.s.c.s.i.ZkClientClusterStateProvider Cluster at 127.0.0.1:52600/solr ready
   [junit4]   2> 988726 INFO  (TEST-ChaosMonkeyNothingIsSafeTest.test-seed#[9BDAEAA95EBDCA83]) [    ] o.a.s.c.ChaosMonkey monkey: init - expire sessions:false cause connection loss:false
   [junit4]   2> 988727 INFO  (qtp844015238-9597) [    ] o.a.s.h.a.CollectionsHandler Invoked Collection Action :create with params replicationFactor=1&collection.configName=conf1&name=collection1&nrtReplicas=1&action=CREATE&numShards=3&createNodeSet=&stateFormat=1&wt=javabin&version=2 and sendToOCPQueue=true
   [junit4]   2> 988728 INFO  (OverseerThreadFactory-4498-thread-2) [    ] o.a.s.c.CreateCollectionCmd Create collection collection1
   [junit4]   2> 988730 WARN  (OverseerThreadFactory-4498-thread-2) [    ] o.a.s.c.CreateCollectionCmd It is unusual to create a collection (collection1) without cores.
   [junit4]   2> 988935 INFO  (qtp844015238-9597) [    ] o.a.s.h.a.CollectionsHandler Wait for new collection to be active for at most 30 seconds. Check all shard replicas
   [junit4]   2> 988935 INFO  (qtp844015238-9597) [    ] o.a.s.s.HttpSolrCall [admin] webapp=null path=/admin/collections params={replicationFactor=1&collection.configName=conf1&name=collection1&nrtReplicas=1&action=CREATE&numShards=3&createNodeSet=&stateFormat=1&wt=javabin&version=2} status=0 QTime=207
   [junit4]   2> 989315 INFO  (TEST-ChaosMonkeyNothingIsSafeTest.test-seed#[9BDAEAA95EBDCA83]) [    ] o.a.s.c.AbstractFullDistribZkTestBase create jetty 1 in directory C:\Users\jenkins\workspace\Lucene-Solr-master-Windows\solr\build\solr-core\test\J0\temp\solr.cloud.ChaosMonkeyNothingIsSafeTest_9BDAEAA95EBDCA83-001\shard-1-001 of type NRT
   [junit4]   2> 989316 INFO  (TEST-ChaosMonkeyNothingIsSafeTest.test-seed#[9BDAEAA95EBDCA83]) [    ] o.e.j.s.Server jetty-9.3.14.v20161028
   [junit4]   2> 989317 INFO  (TEST-ChaosMonkeyNothingIsSafeTest.test-seed#[9BDAEAA95EBDCA83]) [    ] o.e.j.s.h.ContextHandler Started o.e.j.s.ServletContextHandler@583e73ba{/_jd/ml,null,AVAILABLE}
   [junit4]   2> 989318 INFO  (TEST-ChaosMonkeyNothingIsSafeTest.test-seed#[9BDAEAA95EBDCA83]) [    ] o.e.j.s.AbstractConnector Started ServerConnector@9691cea{HTTP/1.1,[http/1.1]}{127.0.0.1:52640}
   [junit4]   2> 989318 INFO  (TEST-ChaosMonkeyNothingIsSafeTest.test-seed#[9BDAEAA95EBDCA83]) [    ] o.e.j.s.Server Started @991280ms
   [junit4]   2> 989318 INFO  (TEST-ChaosMonkeyNothingIsSafeTest.test-seed#[9BDAEAA95EBDCA83]) [    ] o.a.s.c.s.e.JettySolrRunner Jetty properties: {hostContext=/_jd/ml, solrconfig=solrconfig.xml, solr.data.dir=C:\Users\jenkins\workspace\Lucene-Solr-master-Windows\solr\build\solr-core\test\J0\temp\solr.cloud.ChaosMonkeyNothingIsSafeTest_9BDAEAA95EBDCA83-001\tempDir-001/jetty1, hostPort=52640, coreRootDirectory=C:\Users\jenkins\workspace\Lucene-Solr-master-Windows\solr\build\solr-core\test\J0\temp\solr.cloud.ChaosMonkeyNothingIsSafeTest_9BDAEAA95EBDCA83-001\shard-1-001\cores}
   [junit4]   2> 989318 ERROR (TEST-ChaosMonkeyNothingIsSafeTest.test-seed#[9BDAEAA95EBDCA83]) [    ] o.a.s.s.StartupLoggingUtils Missing Java Option solr.log.dir. Logging may be missing or incomplete.
   [junit4]   2> 989318 INFO  (TEST-ChaosMonkeyNothingIsSafeTest.test-seed#[9BDAEAA95EBDCA83]) [    ] o.a.s.s.SolrDispatchFilter  ___      _       Welcome to Apache Solr? version 8.0.0
   [junit4]   2> 989318 INFO  (TEST-ChaosMonkeyNothingIsSafeTest.test-seed#[9BDAEAA95EBDCA83]) [    ] o.a.s.s.SolrDispatchFilter / __| ___| |_ _   Starting in cloud mode on port null
   [junit4]   2> 989318 INFO  (TEST-ChaosMonkeyNothingIsSafeTest.test-seed#[9BDAEAA95EBDCA83]) [    ] o.a.s.s.SolrDispatchFilter \__ \/ _ \ | '_|  Install dir: null, Default config dir: null
   [junit4]   2> 989318 INFO  (TEST-ChaosMonkeyNothingIsSafeTest.test-seed#[9BDAEAA95EBDCA83]) [    ] o.a.s.s.SolrDispatchFilter |___/\___/_|_|    Start time: 2017-07-05T16:45:04.897074300Z
   [junit4]   2> 989322 INFO  (TEST-ChaosMonkeyNothingIsSafeTest.test-seed#[9BDAEAA95EBDCA83]) [    ] o.a.s.s.SolrDispatchFilter Loading solr.xml from SolrHome (not found in ZooKeeper)
   [junit4]   2> 989322 INFO  (TEST-ChaosMonkeyNothingIsSafeTest.test-seed#[9BDAEAA95EBDCA83]) [    ] o.a.s.c.SolrXmlConfig Loading container configuration from C:\Users\jenkins\workspace\Lucene-Solr-master-Windows\solr\build\solr-core\test\J0\temp\solr.cloud.ChaosMonkeyNothingIsSafeTest_9BDAEAA95EBDCA83-001\shard-1-001\solr.xml
   [junit4]   2> 989325 INFO  (TEST-ChaosMonkeyNothingIsSafeTest.test-seed#[9BDAEAA95EBDCA83]) [    ] o.a.s.c.SolrXmlConfig MBean server found: com.sun.jmx.mbeanserver.JmxMBeanServer@535121cc, but no JMX reporters were configured - adding default JMX reporter.
   [junit4]   2> 989328 INFO  (TEST-ChaosMonkeyNothingIsSafeTest.test-seed#[9BDAEAA95EBDCA83]) [    ] o.a.s.c.ZkContainer Zookeeper client=127.0.0.1:52600/solr
   [junit4]   2> 989331 WARN  (NIOServerCxn.Factory:0.0.0.0/0.0.0.0:0) [    ] o.a.z.s.NIOServerCnxn caught end of stream exception
   [junit4]   2> EndOfStreamException: Unable to read additional data from client sessionid 0x15d13a3ff8b0008, likely client has closed socket
   [junit4]   2> 	at org.apache.zookeeper.server.NIOServerCnxn.doIO(NIOServerCnxn.java:239)
   [junit4]   2> 	at org.apache.zookeeper.server.NIOServerCnxnFactory.run(NIOServerCnxnFactory.java:203)
   [junit4]   2> 	at java.base/java.lang.Thread.run(Thread.java:844)
   [junit4]   2> 989337 INFO  (TEST-ChaosMonkeyNothingIsSafeTest.test-seed#[9BDAEAA95EBDCA83]) [    ] o.a.s.c.c.ZkStateReader Updated live nodes from ZooKeeper... (0) -> (1)
   [junit4]   2> 989339 INFO  (TEST-ChaosMonkeyNothingIsSafeTest.test-seed#[9BDAEAA95EBDCA83]) [    ] o.a.s.c.Overseer Overseer (id=null) closing
   [junit4]   2> 989341 INFO  (TEST-ChaosMonkeyNothingIsSafeTest.test-seed#[9BDAEAA95EBDCA83]) [    ] o.a.s.c.ZkController Register node as live in ZooKeeper:/live_nodes/127.0.0.1:52640__jd%2Fml
   [junit4]   2> 989342 INFO  (zkCallback-1509-thread-1) [    ] o.a.s.c.c.ZkStateReader Updated live nodes from ZooKeeper... (1) -> (2)
   [junit4]   2> 989342 INFO  (zkCallback-1516-thread-1) [    ] o.a.s.c.c.ZkStateReader Updated live nodes from ZooKeeper... (1) -> (2)
   [junit4]   2> 989343 INFO  (zkCallback-1521-thread-1) [    ] o.a.s.c.c.ZkStateReader Updated live nodes from ZooKeeper... (1) -> (2)
   [junit4]   2> 989392 INFO  (TEST-ChaosMonkeyNothingIsSafeTest.test-seed#[9BDAEAA95EBDCA83]) [    ] o.a.s.m.r.SolrJmxReporter JMX monitoring for 'solr.node' (registry 'solr.node') enabled at server: com.sun.jmx.mbeanserver.JmxMBeanServer@535121cc
   [junit4]   2> 989396 INFO  (TEST-ChaosMonkeyNothingIsSafeTest.test-seed#[9BDAEAA95EBDCA83]) [    ] o.a.s.m.r.SolrJmxReporter JMX monitoring for 'solr.jvm' (registry 'solr.jvm') enabled at server: com.sun.jmx.mbeanserver.JmxMBeanServer@535121cc
   [junit4]   2> 989396 INFO  (TEST-ChaosMonkeyNothingIsSafeTest.test-seed#[9BDAEAA95EBDCA83]) [    ] o.a.s.m.r.SolrJmxReporter JMX monitoring for 'solr.jetty' (registry 'solr.jetty') enabled at server: com.sun.jmx.mbeanserver.JmxMBeanServer@535121cc
   [junit4]   2> 989397 INFO  (TEST-ChaosMonkeyNothingIsSafeTest.test-seed#[9BDAEAA95EBDCA83]) [    ] o.a.s.c.CorePropertiesLocator Found 0 core definitions underneath C:\Users\jenkins\workspace\Lucene-Solr-master-Windows\solr\build\solr-core\test\J0\temp\solr.cloud.ChaosMonkeyNothingIsSafeTest_9BDAEAA95EBDCA83-001\shard-1-001\cores
   [junit4]   2> 989412 INFO  (qtp844015238-9602) [    ] o.a.s.h.a.CollectionsHandler Invoked Collection Action :addreplica with params node=127.0.0.1:52640__jd%252Fml&action=ADDREPLICA&collection=collection1&shard=shard2&type=NRT&wt=javabin&version=2 and sendToOCPQueue=true
   [junit4]   2> 989414 INFO  (OverseerCollectionConfigSetProcessor-98256361959915524-127.0.0.1:52607__jd%2Fml-n_0000000000) [    ] o.a.s.c.OverseerTaskQueue Response ZK path: /overseer/collection-queue-work/qnr-0000000002 doesn't exist.  Requestor may have disconnected from ZooKeeper
   [junit4]   2> 989414 INFO  (OverseerThreadFactory-4498-thread-3) [    ] o.a.s.c.AddReplicaCmd Node Identified 127.0.0.1:52640__jd%2Fml for creating new replica
   [junit4]   2> 989417 INFO  (qtp527546751-9637) [    ] o.a.s.h.a.CoreAdminOperation core create command qt=/admin/cores&collection.configName=conf1&name=collection1_shard2_replica_n0&action=CREATE&collection=collection1&shard=shard2&wt=javabin&version=2&replicaType=NRT
   [junit4]   2> 989417 INFO  (qtp527546751-9637) [    ] o.a.s.c.TransientSolrCoreCacheDefault Allocating transient cache for 4 transient cores
   [junit4]   2> 990429 INFO  (qtp527546751-9637) [    ] o.a.s.c.SolrConfig Using Lucene MatchVersion: 8.0.0
   [junit4]   2> 990453 INFO  (qtp527546751-9637) [    ] o.a.s.s.IndexSchema [collection1_shard2_replica_n0] Schema name=test
   [junit4]   2> 990513 INFO  (qtp527546751-9637) [    ] o.a.s.s.IndexSchema Loaded schema test/1.6 with uniqueid field id
   [junit4]   2> 990539 INFO  (qtp527546751-9637) [    ] o.a.s.c.CoreContainer Creating SolrCore 'collection1_shard2_replica_n0' using configuration from collection collection1, trusted=true
   [junit4]   2> 990540 INFO  (qtp527546751-9637) [    ] o.a.s.m.r.SolrJmxReporter JMX monitoring for 'solr.core.collection1.shard2.replica_n0' (registry 'solr.core.collection1.shard2.replica_n0') enabled at server: com.sun.jmx.mbeanserver.JmxMBeanServer@535121cc
   [junit4]   2> 990540 INFO  (qtp527546751-9637) [    ] o.a.s.c.SolrCore solr.RecoveryStrategy.Builder
   [junit4]   2> 990540 INFO  (qtp527546751-9637) [    ] o.a.s.c.SolrCore [[collection1_shard2_replica_n0] ] Opening new SolrCore at [C:\Users\jenkins\workspace\Lucene-Solr-master-Windows\solr\build\solr-core\test\J0\temp\solr.cloud.ChaosMonkeyNothingIsSafeTest_9BDAEAA95EBDCA83-001\shard-1-001\cores\collection1_shard2_replica_n0], dataDir=[C:\Users\jenkins\workspace\Lucene-Solr-master-Windows\solr\build\solr-core\test\J0\temp\solr.cloud.ChaosMonkeyNothingIsSafeTest_9BDAEAA95EBDCA83-001\shard-1-001\cores\collection1_shard2_replica_n0\data\]
   [junit4]   2> 990550 INFO  (qtp527546751-9637) [    ] o.a.s.u.RandomMergePolicy RandomMergePolicy wrapping class org.apache.lucene.index.TieredMergePolicy: [TieredMergePolicy: maxMergeAtOnce=38, maxMergeAtOnceExplicit=48, maxMergedSegmentMB=72.0400390625, floorSegmentMB=1.9609375, forceMergeDeletesPctAllowed=0.11404885888174454, segmentsPerTier=23.0, maxCFSSegmentSizeMB=8.796093022207999E12, noCFSRatio=0.7358929892625931
   [junit4]   2> 990555 WARN  (qtp527546751-9637) [    ] o.a.s.c.RequestHandlers INVALID paramSet a in requestHandler {type = requestHandler,name = /dump,class = DumpRequestHandler,attributes = {initParams=a, name=/dump, class=DumpRequestHandler},args = {defaults={a=A,b=B}}}
   [junit4]   2> 990612 INFO  (qtp527546751-9637) [    ] o.a.s.u.UpdateHandler Using UpdateLog implementation: org.apache.solr.update.UpdateLog
   [junit4]   2> 990612 INFO  (qtp527546751-9637) [    ] o.a.s.u.UpdateLog Initializing UpdateLog: dataDir= defaultSyncLevel=FLUSH numRecordsToKeep=100 maxNumLogsToKeep=10 numVersionBuckets=65536
   [junit4]   2> 990614 INFO  (qtp527546751-9637) [    ] o.a.s.u.CommitTracker Hard AutoCommit: if uncommited for 15000ms; 
   [junit4]   2> 990614 INFO  (qtp527546751-9637) [    ] o.a.s.u.CommitTracker Soft AutoCommit: disabled
   [junit4]   2> 990616 INFO  (qtp527546751-9637) [    ] o.a.s.u.RandomMergePolicy RandomMergePolicy wrapping class org.apache.lucene.index.LogDocMergePolicy: [LogDocMergePolicy: minMergeSize=1000, mergeFactor=15, maxMergeSize=9223372036854775807, maxMergeSizeForForcedMerge=9223372036854775807, calibrateSizeByDeletes=false, maxMergeDocs=2147483647, maxCFSSegmentSizeMB=8.796093022207999E12, noCFSRatio=0.6796872469980504]
   [junit4]   2> 990617 INFO  (qtp527546751-9637) [    ] o.a.s.s.SolrIndexSearcher Opening [Searcher@326d6e73[collection1_shard2_replica_n0] main]
   [junit4]   2> 990618 INFO  (qtp527546751-9637) [    ] o.a.s.r.ManagedResourceStorage Configured ZooKeeperStorageIO with znodeBase: /configs/conf1
   [junit4]   2> 990618 INFO  (qtp527546751-9637) [    ] o.a.s.r.ManagedResourceStorage Loaded null at path _rest_managed.json using ZooKeeperStorageIO:path=/configs/conf1
   [junit4]   2> 990619 INFO  (qtp527546751-9637) [    ] o.a.s.h.ReplicationHandler Commits will be reserved for  10000
   [junit4]   2> 990619 INFO  (qtp527546751-9637) [    ] o.a.s.u.UpdateLog Could not find max version in index or recent updates, using new clock 1572101796604674048
   [junit4]   2> 990619 INFO  (searcherExecutor-4512-thread-1) [    ] o.a.s.c.SolrCore [collection1_shard2_replica_n0] Registered new searcher Searcher@326d6e73[collection1_shard2_replica_n0] main{ExitableDirectoryReader(UninvertingDirectoryReader())}
   [junit4]   2> 990625 INFO  (qtp527546751-9637) [    ] o.a.s.c.ShardLeaderElectionContext Enough replicas found to continue.
   [junit4]   2> 990625 INFO  (qtp527546751-9637) [    ] o.a.s.c.ShardLeaderElectionContext I may be the new leader - try and sync
   [junit4]   2> 990625 INFO  (qtp527546751-9637) [    ] o.a.s.c.SyncStrategy Sync replicas to http://127.0.0.1:52640/_jd/ml/collection1_shard2_replica_n0/
   [junit4]   2> 990625 INFO  (qtp527546751-9637) [    ] o.a.s.c.SyncStrategy Sync Success - now sync replicas to me
   [junit4]   2> 990625 INFO  (qtp527546751-9637) [    ] o.a.s.c.SyncStrategy http://127.0.0.1:52640/_jd/ml/collection1_shard2_replica_n0/ has no replicas
   [junit4]   2> 990625 INFO  (qtp527546751-9637) [    ] o.a.s.c.ShardLeaderElectionContext Found all replicas participating in election, clear LIR
   [junit4]   2> 990629 INFO  (qtp527546751-9637) [    ] o.a.s.c.ShardLeaderElectionContext I am the new leader: http://127.0.0.1:52640/_jd/ml/collection1_shard2_replica_n0/ shard2
   [junit4]   2> 990781 INFO  (qtp527546751-9637) [    ] o.a.s.c.ZkController I am the leader, no recovery necessary
   [junit4]   2> 990783 INFO  (qtp527546751-9637) [    ] o.a.s.s.HttpSolrCall [admin] webapp=null path=/admin/cores params={qt=/admin/cores&collection.configName=conf1&name=collection1_shard2_replica_n0&action=CREATE&collection=collection1&shard=shard2&wt=javabin&version=2&replicaType=NRT} status=0 QTime=1366
   [junit4]   2> 990785 INFO  (qtp844015238-9602) [    ] o.a.s.s.HttpSolrCall [admin] webapp=null path=/admin/collections params={node=127.0.0.1:52640__jd%252Fml&action=ADDREPLICA&collection=collection1&shard=shard2&type=NRT&wt=javabin&version=2} status=0 QTime=1373
   [junit4]   2> 991186 INFO  (TEST-ChaosMonkeyNothingIsSafeTest.test-seed#[9BDAEAA95EBDCA83]) [    ] o.a.s.c.AbstractFullDistribZkTestBase create jetty 2 in directory C:\Users\jenkins\workspace\Lucene-Solr-master-Windows\solr\build\solr-core\test\J0\temp\solr.cloud.ChaosMonkeyNothingIsSafeTest_9BDAEAA95EBDCA83-001\shard-2-001 of type NRT
   [junit4]   2> 991186 INFO  (TEST-ChaosMonkeyNothingIsSafeTest.test-seed#[9BDAEAA95EBDCA83]) [    ] o.e.j.s.Server jetty-9.3.14.v20161028
   [junit4]   2> 991186 INFO  (TEST-ChaosMonkeyNothingIsSafeTest.test-seed#[9BDAEAA95EBDCA83]) [    ] o.e.j.s.h.ContextHandler Started o.e.j.s.ServletContextHandler@1969755a{/_jd/ml,null,AVAILABLE}
   [junit4]   2> 991187 INFO  (TEST-ChaosMonkeyNothingIsSafeTest.test-seed#[9BDAEAA95EBDCA83]) [    ] o.e.j.s.AbstractConnector Started ServerConnector@47878229{HTTP/1.1,[http/1.1]}{127.0.0.1:52658}
   [junit4]   2> 991187 INFO  (TEST-ChaosMonkeyNothingIsSafeTest.test-seed#[9BDAEAA95EBDCA83]) [    ] o.e.j.s.Server Started @993150ms
   [junit4]   2> 991187 INFO  (TEST-ChaosMonkeyNothingIsSafeTest.test-seed#[9BDAEAA95EBDCA83]) [    ] o.a.s.c.s.e.JettySolrRunner Jetty properties: {hostContext=/_jd/ml, solrconfig=solrconfig.xml, solr.data.dir=C:\Users\jenkins\workspace\Lucene-Solr-master-Windows\solr\build\solr-core\test\J0\temp\solr.cloud.ChaosMonkeyNothingIsSafeTest_9BDAEAA95EBDCA83-001\tempDir-001/jetty2, hostPort=52658, coreRootDirectory=C:\Users\jenkins\workspace\Lucene-Solr-master-Windows\solr\build\solr-core\test\J0\temp\solr.cloud.ChaosMonkeyNothingIsSafeTest_9BDAEAA95EBDCA83-001\shard-2-001\cores}
   [junit4]   2> 991188 ERROR (TEST-ChaosMonkeyNothingIsSafeTest.test-seed#[9BDAEAA95EBDCA83]) [    ] o.a.s.s.StartupLoggingUtils Missing Java Option solr.log.dir. Logging may be missing or incomplete.
   [junit4]   2> 991188 INFO  (TEST-ChaosMonkeyNothingIsSafeTest.test-seed#[9BDAEAA95EBDCA83]) [    ] o.a.s.s.SolrDispatchFilter  ___      _       Welcome to Apache Solr? version 8.0.0
   [junit4]   2> 991188 INFO  (TEST-ChaosMonkeyNothingIsSafeTest.test-seed#[9BDAEAA95EBDCA83]) [    ] o.a.s.s.SolrDispatchFilter / __| ___| |_ _   Starting in cloud mode on port null
   [junit4]   2> 991188 INFO  (TEST-ChaosMonkeyNothingIsSafeTest.test-seed#[9BDAEAA95EBDCA83]) [    ] o.a.s.s.SolrDispatchFilter \__ \/ _ \ | '_|  Install dir: null, Default config dir: null
   [junit4]   2> 991188 INFO  (TEST-ChaosMonkeyNothingIsSafeTest.test-seed#[9BDAEAA95EBDCA83]) [    ] o.a.s.s.SolrDispatchFilter |___/\___/_|_|    Start time: 2017-07-05T16:45:06.767844900Z
   [junit4]   2> 991195 INFO  (TEST-ChaosMonkeyNothingIsSafeTest.test-seed#[9BDAEAA95EBDCA83]) [    ] o.a.s.s.SolrDispatchFilter Loading solr.xml from SolrHome (not found in ZooKeeper)
   [junit4]   2> 991195 INFO  (TEST-ChaosMonkeyNothingIsSafeTest.test-seed#[9BDAEAA95EBDCA83]) [    ] o.a.s.c.SolrXmlConfig Loading container configuration from C:\Users\jenkins\workspace\Lucene-Solr-master-Windows\solr\build\solr-core\test\J0\temp\solr.cloud.ChaosMonkeyNothingIsSafeTest_9BDAEAA95EBDCA83-001\shard-2-001\solr.xml
   [junit4]   2> 991201 INFO  (TEST-ChaosMonkeyNothingIsSafeTest.test-seed#[9BDAEAA95EBDCA83]) [    ] o.a.s.c.SolrXmlConfig MBean server found: com.sun.jmx.mbeanserver.JmxMBeanServer@535121cc, but no JMX reporters were configured - adding default JMX reporter.
   [junit4]   2> 991205 INFO  (TEST-ChaosMonkeyNothingIsSafeTest.test-seed#[9BDAEAA95EBDCA83]) [    ] o.a.s.c.ZkContainer Zookeeper client=127.0.0.1:52600/solr
   [junit4]   2> 991219 INFO  (TEST-ChaosMonkeyNothingIsSafeTest.test-seed#[9BDAEAA95EBDCA83]) [    ] o.a.s.c.c.ZkStateReader Updated live nodes from ZooKeeper... (0) -> (2)
   [junit4]   2> 991221 INFO  (TEST-ChaosMonkeyNothingIsSafeTest.test-seed#[9BDAEAA95EBDCA83]) [    ] o.a.s.c.Overseer Overseer (id=null) closing
   [junit4]   2> 991224 INFO  (TEST-ChaosMonkeyNothingIsSafeTest.test-seed#[9BDAEAA95EBDCA83]) [    ] o.a.s.c.ZkController Register node as live in ZooKeeper:/live_nodes/127.0.0.1:52658__jd%2Fml
   [junit4]   2> 991226 INFO  (zkCallback-1509-thread-1) [    ] o.a.s.c.c.ZkStateReader Updated live nodes from ZooKeeper... (2) -> (3)
   [junit4]   2> 991227 INFO  (zkCallback-1527-thread-1) [    ] o.a.s.c.c.ZkStateReader Updated live nodes from ZooKeeper... (2) -> (3)
   [junit4]   2> 991227 INFO  (zkCallback-1516-thread-1) [    ] o.a.s.c.c.ZkStateReader Updated live nodes from ZooKeeper... (2) -> (3)
   [junit4]   2> 991227 INFO  (zkCallback-1521-thread-1) [    ] o.a.s.c.c.ZkStateReader Updated live nodes from ZooKeeper... (2) -> (3)
   [junit4]   2> 991303 INFO  (TEST-ChaosMonkeyNothingIsSafeTest.test-seed#[9BDAEAA95EBDCA83]) [    ] o.a.s.m.r.SolrJmxReporter JMX monitoring for 'solr.node' (registry 'solr.node') enabled at server: com.sun.jmx.mbeanserver.JmxMBeanServer@535121cc
   [junit4]   2> 991310 INFO  (TEST-ChaosMonkeyNothingIsSafeTest.test-seed#[9BDAEAA95EBDCA83]) [    ] o.a.s.m.r.SolrJmxReporter JMX monitoring for 'solr.jvm' (registry 'solr.jvm') enabled at server: com.sun.jmx.mbeanserver.JmxMBeanServer@535121cc
   [junit4]   2> 991311 INFO  (TEST-ChaosMonkeyNothingIsSafeTest.test-seed#[9BDAEAA95EBDCA83]) [    ] o.a.s.m.r.SolrJmxReporter JMX monitoring for 'solr.jetty' (registry 'solr.jetty') enabled at server: com.sun.jmx.mbeanserver.JmxMBeanServer@535121cc
   [junit4]   2> 991312 INFO  (TEST-ChaosMonkeyNothingIsSafeTest.test-seed#[9BDAEAA95EBDCA83]) [    ] o.a.s.c.CorePropertiesLocator Found 0 core definitions underneath C:\Users\jenkins\workspace\Lucene-Solr-master-Windows\solr\build\solr-core\test\J0\temp\solr.cloud.ChaosMonkeyNothingIsSafeTest_9BDAEAA95EBDCA83-001\shard-2-001\cores
   [junit4]   2> 991342 INFO  (qtp986418496-9667) [    ] o.a.s.h.a.CollectionsHandler Invoked Collection Action :addreplica with params node=127.0.0.1:52658__jd%252Fml&action=ADDREPLICA&collection=collection1&shard=shard3&type=NRT&wt=javabin&version=2 and sendToOCPQueue=true
   [junit4]   2> 991345 INFO  (OverseerCollectionConfigSetProcessor-98256361959915524-127.0.0.1:52607__jd%2Fml-n_0000000000) [    ] o.a.s.c.OverseerTaskQueue Response ZK path: /overseer/collection-queue-work/qnr-0000000004 doesn't exist.  Requestor may have disconnected from ZooKeeper
   [junit4]   2> 991345 INFO  (OverseerThreadFactory-4498-thread-4) [    ] o.a.s.c.AddReplicaCmd Node Identified 127.0.0.1:52658__jd%2Fml for creating new replica
   [junit4]   2> 991347 INFO  (qtp986418496-9670) [    ] o.a.s.h.a.CoreAdminOperation core create command qt=/admin/cores&collection.configName=conf1&name=collection1_shard3_replica_n0&action=CREATE&collection=collection1&shard=shard3&wt=javabin&version=2&replicaType=NRT
   [junit4]   2> 991347 INFO  (qtp986418496-9670) [    ] o.a.s.c.TransientSolrCoreCacheDefault Allocating transient cache for 4 transient cores
   [junit4]   2> 992360 INFO  (qtp986418496-9670) [    ] o.a.s.c.SolrConfig Using Lucene MatchVersion: 8.0.0
   [junit4]   2> 992371 INFO  (qtp986418496-9670) [    ] o.a.s.s.IndexSchema [collection1_shard3_replica_n0] Schema name=test
   [junit4]   2> 992431 INFO  (qtp986418496-9670) [    ] o.a.s.s.IndexSchema Loaded schema test/1.6 with uniqueid field id
   [junit4]   2> 992453 INFO  (qtp986418496-9670) [    ] o.a.s.c.CoreContainer Creating SolrCore 'collection1_shard3_replica_n0' using configuration from collection collection1, trusted=true
   [junit4]   2> 992453 INFO  (qtp986418496-9670) [    ] o.a.s.m.r.SolrJmxReporter JMX monitoring for 'solr.core.collection1.shard3.replica_n0' (registry 'solr.core.collection1.shard3.replica_n0') enabled at server: com.sun.jmx.mbeanserver.JmxMBeanServer@535121cc
   [junit4]   2> 992453 INFO  (qtp986418496-9670) [    ] o.a.s.c.SolrCore solr.RecoveryStrategy.Builder
   [junit4]   2> 992453 INFO  (qtp986418496-9670) [    ] o.a.s.c.SolrCore [[collection1_shard3_replica_n0] ] Opening new SolrCore at [C:\Users\jenkins\workspace\Lucene-Solr-master-Windows\solr\build\solr-core\test\J0\temp\solr.cloud.ChaosMonkeyNothingIsSafeTest_9BDAEAA95EBDCA83-001\shard-2-001\cores\collection1_shard3_replica_n0], dataDir=[C:\Users\jenkins\workspace\Lucene-Solr-master-Windows\solr\build\solr-core\test\J0\temp\solr.cloud.ChaosMonkeyNothingIsSafeTest_9BDAEAA95EBDCA83-001\shard-2-001\cores\collection1_shard3_replica_n0\data\]
   [junit4]   2> 992460 INFO  (qtp986418496-9670) [    ] o.a.s.u.RandomMergePolicy RandomMergePolicy wrapping class org.apache.lucene.index.TieredMergePolicy: [TieredMergePolicy: maxMergeAtOnce=38, maxMergeAtOnceExplicit=48, maxMergedSegmentMB=72.0400390625, floorSegmentMB=1.9609375, forceMergeDeletesPctAllowed=0.11404885888174454, segmentsPerTier=23.0, maxCFSSegmentSizeMB=8.796093022207999E12, noCFSRatio=0.7358929892625931
   [junit4]   2> 992464 WARN  (qtp986418496-9670) [    ] o.a.s.c.RequestHandlers INVALID paramSet a in requestHandler {type = requestHandler,name = /dump,class = DumpRequestHandler,attributes = {initParams=a, name=/dump, class=DumpRequestHandler},args = {defaults={a=A,b=B}}}
   [junit4]   2> 992544 INFO  (qtp986418496-9670) [    ] o.a.s.u.UpdateHandler Using UpdateLog implementation: org.apache.solr.update.UpdateLog
   [junit4]   2> 992544 INFO  (qtp986418496-9670) [    ] o.a.s.u.UpdateLog Initializing UpdateLog: dataDir= defaultSyncLevel=FLUSH numRecordsToKeep=100 maxNumLogsToKeep=10 numVersionBuckets=65536
   [junit4]   2> 992547 INFO  (qtp986418496-9670) [    ] o.a.s.u.CommitTracker Hard AutoCommit: if uncommited for 15000ms; 
   [junit4]   2> 992547 INFO  (qtp986418496-9670) [    ] o.a.s.u.CommitTracker Soft AutoCommit: disabled
   [junit4]   2> 992549 INFO  (qtp986418496-9670) [    ] o.a.s.u.RandomMergePolicy RandomMergePolicy wrapping class org.apache.lucene.index.LogDocMergePolicy: [LogDocMergePolicy: minMergeSize=1000, mergeFactor=15, maxMergeSize=9223372036854775807, maxMergeSizeForForcedMerge=9223372036854775807, calibrateSizeByDeletes=false, maxMergeDocs=2147483647, maxCFSSegmentSizeMB=8.796093022207999E12, noCFSRatio=0.6796872469980504]
   [junit4]   2> 992554 INFO  (qtp986418496-9670) [    ] o.a.s.s.SolrIndexSearcher Opening [Searcher@73c71b2f[collection1_shard3_replica_n0] main]
   [junit4]   2> 992558 INFO  (qtp986418496-9670) [    ] o.a.s.r.ManagedResourceStorage Configured ZooKeeperStorageIO with znodeBase: /configs/conf1
   [junit4]   2> 992558 INFO  (qtp986418496-9670) [    ] o.a.s.r.ManagedResourceStorage Loaded null at path _rest_managed.json using ZooKeeperStorageIO:path=/configs/conf1
   [junit4]   2> 992558 INFO  (qtp986418496-9670) [    ] o.a.s.h.ReplicationHandler Commits will be reserved for  10000
   [junit4]   2> 992561 INFO  (searcherExecutor-4523-thread-1) [    ] o.a.s.c.SolrCore [collection1_shard3_replica_n0] Registered new searcher Searcher@73c71b2f[collection1_shard3_replica_n0] main{ExitableDirectoryReader(UninvertingDirectoryReader())}
   [junit4]   2> 992561 INFO  (qtp986418496-9670) [    ] o.a.s.u.UpdateLog Could not find max version in index or recent updates, using new clock 1572101798641008640
   [junit4]   2> 992568 INFO  (qtp986418496-9670) [    ] o.a.s.c.ShardLeaderElectionContext Enough replicas found to continue.
   [junit4]   2> 992568 INFO  (qtp986418496-9670) [    ] o.a.s.c.ShardLeaderElectionContext I may be the new leader - try and sync
   [junit4]   2> 992568 INFO  (qtp986418496-9670) [    ] o.a.s.c.SyncStrategy Sync replicas to http://127.0.0.1:52658/_jd/ml/collection1_shard3_replica_n0/
   [junit4]   2> 992568 INFO  (qtp986418496-9670) [    ] o.a.s.c.SyncStrategy Sync Success - now sync replicas to me
   [junit4]   2> 992568 INFO  (qtp986418496-9670) [    ] o.a.s.c.SyncStrategy http://127.0.0.1:52658/_jd/ml/collection1_shard3_replica_n0/ has no replicas
   [junit4]   2> 992568 INFO  (qtp986418496-9670) [    ] o.a.s.c.ShardLeaderElectionContext Found all replicas participating in election, clear LIR
   [junit4]   2> 992573 INFO  (qtp986418496-9670) [    ] o.a.s.c.ShardLeaderElectionContext I am the new leader: http://127.0.0.1:52658/_jd/ml/collection1_shard3_replica_n0/ shard3
   [junit4]   2> 992723 INFO  (qtp986418496-9670) [    ] o.a.s.c.ZkController I am the leader, no recovery necessary
   [junit4]   2> 992726 INFO  (qtp986418496-9670) [    ] o.a.s.s.HttpSolrCall [admin] webapp=null path=/admin/cores params={qt=/admin/cores&collection.configName=conf1&name=collection1_shard3_replica_n0&action=CREATE&collection=collection1&shard=shard3&wt=javabin&version=2&replicaType=NRT} status=0 QTime=1378
   [junit4]   2> 992728 INFO  (qtp986418496-9667) [    ] o.a.s.s.HttpSolrCall [admin] webapp=null path=/admin/collections params={node=127.0.0.1:52658__jd%252Fml&action=ADDREPLICA&collection=collection1&shard=shard3&type=NRT&wt=javabin&version=2} status=0 QTime=1385
   [junit4]   2> 993027 INFO  (TEST-ChaosMonkeyNothingIsSafeTest.test-seed#[9BDAEAA95EBDCA83]) [    ] o.a.s.c.AbstractFullDistribZkTestBase create jetty 3 in directory C:\Users\jenkins\workspace\Lucene-Solr-master-Windows\solr\build\solr-core\test\J0\temp\solr.cloud.ChaosMonkeyNothingIsSafeTest_9BDAEAA95EBDCA83-001\shard-3-001 of type NRT
   [junit4]   2> 993029 INFO  (TEST-ChaosMonkeyNothingIsSafeTest.test-seed#[9BDAEAA95EBDCA83]) [    ] o.e.j.s.Server jetty-9.3.14.v20161028
   [junit4]   2> 993029 INFO  (TEST-ChaosMonkeyNothingIsSafeTest.test-seed#[9BDAEAA95EBDCA83]) [    ] o.e.j.s.h.ContextHandler Started o.e.j.s.ServletContextHandler@6512c5d0{/_jd/ml,null,AVAILABLE}
   [junit4]   2> 993030 INFO  (TEST-ChaosMonkeyNothingIsSafeTest.test-seed#[9BDAEAA95EBDCA83]) [    ] o.e.j.s.AbstractConnector Started ServerConnector@21d98755{HTTP/1.1,[http/1.1]}{127.0.0.1:52689}
   [junit4]   2> 993030 INFO  (TEST-ChaosMonkeyNothingIsSafeTest.test-seed#[9BDAEAA95EBDCA83]) [    ] o.e.j.s.Server Started @994992ms
   [junit4]   2> 993030 INFO  (TEST-ChaosMonkeyNothingIsSafeTest.test-seed#[9BDAEAA95EBDCA83]) [    ] o.a.s.c.s.e.JettySolrRunner Jetty properties: {hostContext=/_jd/ml, solrconfig=solrconfig.xml, solr.data.dir=C:\Users\jenkins\workspace\Lucene-Solr-master-Windows\solr\build\solr-core\test\J0\temp\solr.cloud.ChaosMonkeyNothingIsSafeTest_9BDAEAA95EBDCA83-001\tempDir-001/jetty3, hostPort=52689, coreRootDirectory=C:\Users\jenkins\workspace\Lucene-Solr-master-Windows\solr\build\solr-core\test\J0\temp\solr.cloud.ChaosMonkeyNothingIsSafeTest_9BDAEAA95EBDCA83-001\shard-3-001\cores}
   [junit4]   2> 993030 ERROR (TEST-ChaosMonkeyNothingIsSafeTest.test-seed#[9BDAEAA95EBDCA83]) [    ] o.a.s.s.StartupLoggingUtils Missing Java Option solr.log.dir. Logging may be missing or incomplete.
   [junit4]   2> 993030 INFO  (TEST-ChaosMonkeyNothingIsSafeTest.test-seed#[9BDAEAA95EBDCA83]) [    ] o.a.s.s.SolrDispatchFilter  ___      _       Welcome to Apache Solr? version 8.0.0
   [junit4]   2> 993030 INFO  (TEST-ChaosMonkeyNothingIsSafeTest.test-seed#[9BDAEAA95EBDCA83]) [    ] o.a.s.s.SolrDispatchFilter / __| ___| |_ _   Starting in cloud mode on port null
   [junit4]   2> 993030 INFO  (TEST-ChaosMonkeyNothingIsSafeTest.test-seed#[9BDAEAA95EBDCA83]) [    ] o.a.s.s.SolrDispatchFilter \__ \/ _ \ | '_|  Install dir: null, Default config dir: null
   [junit4]   2> 993030 INFO  (TEST-ChaosMonkeyNothingIsSafeTest.test-seed#[9BDAEAA95EBDCA83]) [    ] o.a.s.s.SolrDispatchFilter |___/\___/_|_|    Start time: 2017-07-05T16:45:08.609126200Z
   [junit4]   2> 993033 INFO  (TEST-ChaosMonkeyNothingIsSafeTest.test-seed#[9BDAEAA95EBDCA83]) [    ] o.a.s.s.SolrDispatchFilter Loading solr.xml from SolrHome (not found in ZooKeeper)
   [junit4]   2> 993033 INFO  (TEST-ChaosMonkeyNothingIsSafeTest.test-seed#[9BDAEAA95EBDCA83]) [    ] o.a.s.c.SolrXmlConfig Loading container configuration from C:\Users\jenkins\workspace\Lucene-Solr-master-Windows\solr\build\solr-core\test\J0\temp\solr.cloud.ChaosMonkeyNothingIsSafeTest_9BDAEAA95EBDCA83-001\shard-3-001\solr.xml
   [junit4]   2> 993036 INFO  (TEST-ChaosMonkeyNothingIsSafeTest.test-seed#[9BDAEAA95EBDCA83]) [    ] o.a.s.c.SolrXmlConfig MBean server found: com.sun.jmx.mbeanserver.JmxMBeanServer@535121cc, but no JMX reporters were configured - adding default JMX reporter.
   [junit4]   2> 993039 INFO  (TEST-ChaosMonkeyNothingIsSafeTest.test-seed#[9BDAEAA95EBDCA83]) [    ] o.a.s.c.ZkContainer Zookeeper client=127.0.0.1:52600/solr
   [junit4]   2> 993051 INFO  (TEST-ChaosMonkeyNothingIsSafeTest.test-seed#[9BDAEAA95EBDCA83]) [    ] o.a.s.c.c.ZkStateReader Updated live nodes from ZooKeeper... (0) -> (3)
   [junit4]   2> 993053 INFO  (TEST-ChaosMonkeyNothingIsSafeTest.test-seed#[9BDAEAA95EBDCA83]) [    ] o.a.s.c.Overseer Overseer (id=null) closing
   [junit4]   2> 993055 INFO  (TEST-ChaosMonkeyNothingIsSafeTest.test-seed#[9BDAEAA95EBDCA83]) [    ] o.a.s.c.ZkController Register node as live in ZooKeeper:/live_nodes/127.0.0.1:52689__jd%2Fml
   [junit4]   2> 993057 INFO  (zkCallback-1509-thread-2) [    ] o.a.s.c.c.ZkStateReader Updated live nodes from ZooKeeper... (3) -> (4)
   [junit4]   2> 993057 INFO  (zkCallback-1527-thread-1) [    ] o.a.s.c.c.ZkStateReader Updated live nodes from ZooKeeper... (3) -> (4)
   [junit4]   2> 993058 INFO  (zkCallback-1533-thread-1) [    ] o.a.s.c.c.ZkStateReader Updated live nodes from ZooKeeper... (3) -> (4)
   [junit4]   2> 993058 INFO  (zkCallback-1521-thread-1) [    ] o.a.s.c.c.ZkStateReader Updated live nodes from ZooKeeper... (3) -> (4)
   [junit4]   2> 993058 INFO  (zkCallback-1516-thread-1) [    ] o.a.s.c.c.ZkStateReader Updated live nodes from ZooKeeper... (3) -> (4)
   [junit4]   2> 993146 INFO  (TEST-ChaosMonkeyNothingIsSafeTest.test-seed#[9BDAEAA95EBDCA83]) [    ] o.a.s.m.r.SolrJmxReporter JMX monitoring for 'solr.node' (registry 'solr.node') enabled at server: com.sun.jmx.mbeanserver.JmxMBeanServer@535121cc
   [junit4]   2> 993153 INFO  (TEST-ChaosMonkeyNothingIsSafeTest.test-seed#[9BDAEAA95EBDCA83]) [    ] o.a.s.m.r.SolrJmxReporter JMX monitoring for 'solr.jvm' (registry 'solr.jvm') enabled at server: com.sun.jmx.mbeanserver.JmxMBeanServer@535121cc
   [junit4]   2> 993153 INFO  (TEST-ChaosMonkeyNothingIsSafeTest.test-seed#[9BDAEAA95EBDCA83]) [    ] o.a.s.m.r.SolrJmxReporter JMX monitoring for 'solr

[...truncated too long message...]

   [junit4]    >         at java.base@9-ea/sun.nio.ch.SelectorImpl.select(SelectorImpl.java:97)
   [junit4]    >         at app//org.apache.zookeeper.ClientCnxnSocketNIO.doTransport(ClientCnxnSocketNIO.java:349)
   [junit4]    >         at app//org.apache.zookeeper.ClientCnxn$SendThread.run(ClientCnxn.java:1141)
   [junit4]    >    9) Thread[id=9633, name=zkCallback-1516-thread-1, state=TIMED_WAITING, group=TGRP-ChaosMonkeyNothingIsSafeTest]
   [junit4]    >         at java.base@9-ea/jdk.internal.misc.Unsafe.park(Native Method)
   [junit4]    >         at java.base@9-ea/java.util.concurrent.locks.LockSupport.parkNanos(LockSupport.java:234)
   [junit4]    >         at java.base@9-ea/java.util.concurrent.SynchronousQueue$TransferStack.awaitFulfill(SynchronousQueue.java:462)
   [junit4]    >         at java.base@9-ea/java.util.concurrent.SynchronousQueue$TransferStack.transfer(SynchronousQueue.java:361)
   [junit4]    >         at java.base@9-ea/java.util.concurrent.SynchronousQueue.poll(SynchronousQueue.java:937)
   [junit4]    >         at java.base@9-ea/java.util.concurrent.ThreadPoolExecutor.getTask(ThreadPoolExecutor.java:1085)
   [junit4]    >         at java.base@9-ea/java.util.concurrent.ThreadPoolExecutor.runWorker(ThreadPoolExecutor.java:1146)
   [junit4]    >         at java.base@9-ea/java.util.concurrent.ThreadPoolExecutor$Worker.run(ThreadPoolExecutor.java:635)
   [junit4]    >         at java.base@9-ea/java.lang.Thread.run(Thread.java:844)
   [junit4]    > 	at __randomizedtesting.SeedInfo.seed([9BDAEAA95EBDCA83]:0)Throwable #2: com.carrotsearch.randomizedtesting.ThreadLeakError: There are still zombie threads that couldn't be terminated:
   [junit4]    >    1) Thread[id=9851, name=zkCallback-1516-thread-5, state=TIMED_WAITING, group=TGRP-ChaosMonkeyNothingIsSafeTest]
   [junit4]    >         at java.base@9-ea/jdk.internal.misc.Unsafe.park(Native Method)
   [junit4]    >         at java.base@9-ea/java.util.concurrent.locks.LockSupport.parkNanos(LockSupport.java:234)
   [junit4]    >         at java.base@9-ea/java.util.concurrent.SynchronousQueue$TransferStack.awaitFulfill(SynchronousQueue.java:462)
   [junit4]    >         at java.base@9-ea/java.util.concurrent.SynchronousQueue$TransferStack.transfer(SynchronousQueue.java:361)
   [junit4]    >         at java.base@9-ea/java.util.concurrent.SynchronousQueue.poll(SynchronousQueue.java:937)
   [junit4]    >         at java.base@9-ea/java.util.concurrent.ThreadPoolExecutor.getTask(ThreadPoolExecutor.java:1085)
   [junit4]    >         at java.base@9-ea/java.util.concurrent.ThreadPoolExecutor.runWorker(ThreadPoolExecutor.java:1146)
   [junit4]    >         at java.base@9-ea/java.util.concurrent.ThreadPoolExecutor$Worker.run(ThreadPoolExecutor.java:635)
   [junit4]    >         at java.base@9-ea/java.lang.Thread.run(Thread.java:844)
   [junit4]    >    2) Thread[id=9852, name=zkCallback-1516-thread-6, state=TIMED_WAITING, group=TGRP-ChaosMonkeyNothingIsSafeTest]
   [junit4]    >         at java.base@9-ea/jdk.internal.misc.Unsafe.park(Native Method)
   [junit4]    >         at java.base@9-ea/java.util.concurrent.locks.LockSupport.parkNanos(LockSupport.java:234)
   [junit4]    >         at java.base@9-ea/java.util.concurrent.SynchronousQueue$TransferStack.awaitFulfill(SynchronousQueue.java:462)
   [junit4]    >         at java.base@9-ea/java.util.concurrent.SynchronousQueue$TransferStack.transfer(SynchronousQueue.java:361)
   [junit4]    >         at java.base@9-ea/java.util.concurrent.SynchronousQueue.poll(SynchronousQueue.java:937)
   [junit4]    >         at java.base@9-ea/java.util.concurrent.ThreadPoolExecutor.getTask(ThreadPoolExecutor.java:1085)
   [junit4]    >         at java.base@9-ea/java.util.concurrent.ThreadPoolExecutor.runWorker(ThreadPoolExecutor.java:1146)
   [junit4]    >         at java.base@9-ea/java.util.concurrent.ThreadPoolExecutor$Worker.run(ThreadPoolExecutor.java:635)
   [junit4]    >         at java.base@9-ea/java.lang.Thread.run(Thread.java:844)
   [junit4]    >    3) Thread[id=9805, name=zkCallback-1516-thread-4, state=TIMED_WAITING, group=TGRP-ChaosMonkeyNothingIsSafeTest]
   [junit4]    >         at java.base@9-ea/jdk.internal.misc.Unsafe.park(Native Method)
   [junit4]    >         at java.base@9-ea/java.util.concurrent.locks.LockSupport.parkNanos(LockSupport.java:234)
   [junit4]    >         at java.base@9-ea/java.util.concurrent.SynchronousQueue$TransferStack.awaitFulfill(SynchronousQueue.java:462)
   [junit4]    >         at java.base@9-ea/java.util.concurrent.SynchronousQueue$TransferStack.transfer(SynchronousQueue.java:361)
   [junit4]    >         at java.base@9-ea/java.util.concurrent.SynchronousQueue.poll(SynchronousQueue.java:937)
   [junit4]    >         at java.base@9-ea/java.util.concurrent.ThreadPoolExecutor.getTask(ThreadPoolExecutor.java:1085)
   [junit4]    >         at java.base@9-ea/java.util.concurrent.ThreadPoolExecutor.runWorker(ThreadPoolExecutor.java:1146)
   [junit4]    >         at java.base@9-ea/java.util.concurrent.ThreadPoolExecutor$Worker.run(ThreadPoolExecutor.java:635)
   [junit4]    >         at java.base@9-ea/java.lang.Thread.run(Thread.java:844)
   [junit4]    >    4) Thread[id=9803, name=zkCallback-1516-thread-2, state=TIMED_WAITING, group=TGRP-ChaosMonkeyNothingIsSafeTest]
   [junit4]    >         at java.base@9-ea/jdk.internal.misc.Unsafe.park(Native Method)
   [junit4]    >         at java.base@9-ea/java.util.concurrent.locks.LockSupport.parkNanos(LockSupport.java:234)
   [junit4]    >         at java.base@9-ea/java.util.concurrent.SynchronousQueue$TransferStack.awaitFulfill(SynchronousQueue.java:462)
   [junit4]    >         at java.base@9-ea/java.util.concurrent.SynchronousQueue$TransferStack.transfer(SynchronousQueue.java:361)
   [junit4]    >         at java.base@9-ea/java.util.concurrent.SynchronousQueue.poll(SynchronousQueue.java:937)
   [junit4]    >         at java.base@9-ea/java.util.concurrent.ThreadPoolExecutor.getTask(ThreadPoolExecutor.java:1085)
   [junit4]    >         at java.base@9-ea/java.util.concurrent.ThreadPoolExecutor.runWorker(ThreadPoolExecutor.java:1146)
   [junit4]    >         at java.base@9-ea/java.util.concurrent.ThreadPoolExecutor$Worker.run(ThreadPoolExecutor.java:635)
   [junit4]    >         at java.base@9-ea/java.lang.Thread.run(Thread.java:844)
   [junit4]    >    5) Thread[id=9804, name=zkCallback-1516-thread-3, state=TIMED_WAITING, group=TGRP-ChaosMonkeyNothingIsSafeTest]
   [junit4]    >         at java.base@9-ea/jdk.internal.misc.Unsafe.park(Native Method)
   [junit4]    >         at java.base@9-ea/java.util.concurrent.locks.LockSupport.parkNanos(LockSupport.java:234)
   [junit4]    >         at java.base@9-ea/java.util.concurrent.SynchronousQueue$TransferStack.awaitFulfill(SynchronousQueue.java:462)
   [junit4]    >         at java.base@9-ea/java.util.concurrent.SynchronousQueue$TransferStack.transfer(SynchronousQueue.java:361)
   [junit4]    >         at java.base@9-ea/java.util.concurrent.SynchronousQueue.poll(SynchronousQueue.java:937)
   [junit4]    >         at java.base@9-ea/java.util.concurrent.ThreadPoolExecutor.getTask(ThreadPoolExecutor.java:1085)
   [junit4]    >         at java.base@9-ea/java.util.concurrent.ThreadPoolExecutor.runWorker(ThreadPoolExecutor.java:1146)
   [junit4]    >         at java.base@9-ea/java.util.concurrent.ThreadPoolExecutor$Worker.run(ThreadPoolExecutor.java:635)
   [junit4]    >         at java.base@9-ea/java.lang.Thread.run(Thread.java:844)
   [junit4]    >    6) Thread[id=9631, name=TEST-ChaosMonkeyNothingIsSafeTest.test-seed#[9BDAEAA95EBDCA83]-SendThread(127.0.0.1:52600), state=RUNNABLE, group=TGRP-ChaosMonkeyNothingIsSafeTest]
   [junit4]    >         at java.base@9-ea/sun.nio.ch.WindowsSelectorImpl$SubSelector.poll0(Native Method)
   [junit4]    >         at java.base@9-ea/sun.nio.ch.WindowsSelectorImpl$SubSelector.poll(WindowsSelectorImpl.java:296)
   [junit4]    >         at java.base@9-ea/sun.nio.ch.WindowsSelectorImpl$SubSelector.access$400(WindowsSelectorImpl.java:278)
   [junit4]    >         at java.base@9-ea/sun.nio.ch.WindowsSelectorImpl.doSelect(WindowsSelectorImpl.java:159)
   [junit4]    >         at java.base@9-ea/sun.nio.ch.SelectorImpl.lockAndDoSelect(SelectorImpl.java:86)
   [junit4]    >         at java.base@9-ea/sun.nio.ch.SelectorImpl.select(SelectorImpl.java:97)
   [junit4]    >         at app//org.apache.zookeeper.ClientCnxnSocketNIO.doTransport(ClientCnxnSocketNIO.java:349)
   [junit4]    >         at app//org.apache.zookeeper.ClientCnxn$SendThread.run(ClientCnxn.java:1141)
   [junit4]    >    7) Thread[id=9633, name=zkCallback-1516-thread-1, state=TIMED_WAITING, group=TGRP-ChaosMonkeyNothingIsSafeTest]
   [junit4]    >         at java.base@9-ea/jdk.internal.misc.Unsafe.park(Native Method)
   [junit4]    >         at java.base@9-ea/java.util.concurrent.locks.LockSupport.parkNanos(LockSupport.java:234)
   [junit4]    >         at java.base@9-ea/java.util.concurrent.SynchronousQueue$TransferStack.awaitFulfill(SynchronousQueue.java:462)
   [junit4]    >         at java.base@9-ea/java.util.concurrent.SynchronousQueue$TransferStack.transfer(SynchronousQueue.java:361)
   [junit4]    >         at java.base@9-ea/java.util.concurrent.SynchronousQueue.poll(SynchronousQueue.java:937)
   [junit4]    >         at java.base@9-ea/java.util.concurrent.ThreadPoolExecutor.getTask(ThreadPoolExecutor.java:1085)
   [junit4]    >         at java.base@9-ea/java.util.concurrent.ThreadPoolExecutor.runWorker(ThreadPoolExecutor.java:1146)
   [junit4]    >         at java.base@9-ea/java.util.concurrent.ThreadPoolExecutor$Worker.run(ThreadPoolExecutor.java:635)
   [junit4]    >         at java.base@9-ea/java.lang.Thread.run(Thread.java:844)
   [junit4]    > 	at __randomizedtesting.SeedInfo.seed([9BDAEAA95EBDCA83]:0)
   [junit4] Completed [232/726 (1!)] on J0 in 71.13s, 1 test, 3 errors <<< FAILURES!

[...truncated 38034 lines...]

Mime
View raw message