lucene-dev mailing list archives

Site index · List index
Message view « Date » · « Thread »
Top « Date » · « Thread »
From Policeman Jenkins Server <jenk...@thetaphi.de>
Subject [JENKINS-EA] Lucene-Solr-6.x-Windows (64bit/jdk-9-ea+173) - Build # 1017 - Unstable!
Date Sat, 01 Jul 2017 13:31:04 GMT
Build: https://jenkins.thetaphi.de/job/Lucene-Solr-6.x-Windows/1017/
Java: 64bit/jdk-9-ea+173 -XX:+UseCompressedOops -XX:+UseSerialGC

2 tests failed.
FAILED:  org.apache.solr.cloud.MissingSegmentRecoveryTest.testLeaderRecovery

Error Message:
Expected a collection with one shard and two replicas null Last available state: DocCollection(MissingSegmentRecoveryTest//collections/MissingSegmentRecoveryTest/state.json/7)={   "replicationFactor":"2",   "shards":{"shard1":{       "range":"80000000-7fffffff",       "state":"active",       "replicas":{         "core_node1":{           "core":"MissingSegmentRecoveryTest_shard1_replica2",           "base_url":"http://127.0.0.1:62776/solr",           "node_name":"127.0.0.1:62776_solr",           "state":"down"},         "core_node2":{           "core":"MissingSegmentRecoveryTest_shard1_replica1",           "base_url":"http://127.0.0.1:62774/solr",           "node_name":"127.0.0.1:62774_solr",           "state":"active",           "leader":"true"}}}},   "router":{"name":"compositeId"},   "maxShardsPerNode":"1",   "autoAddReplicas":"false"}

Stack Trace:
java.lang.AssertionError: Expected a collection with one shard and two replicas
null
Last available state: DocCollection(MissingSegmentRecoveryTest//collections/MissingSegmentRecoveryTest/state.json/7)={
  "replicationFactor":"2",
  "shards":{"shard1":{
      "range":"80000000-7fffffff",
      "state":"active",
      "replicas":{
        "core_node1":{
          "core":"MissingSegmentRecoveryTest_shard1_replica2",
          "base_url":"http://127.0.0.1:62776/solr",
          "node_name":"127.0.0.1:62776_solr",
          "state":"down"},
        "core_node2":{
          "core":"MissingSegmentRecoveryTest_shard1_replica1",
          "base_url":"http://127.0.0.1:62774/solr",
          "node_name":"127.0.0.1:62774_solr",
          "state":"active",
          "leader":"true"}}}},
  "router":{"name":"compositeId"},
  "maxShardsPerNode":"1",
  "autoAddReplicas":"false"}
	at __randomizedtesting.SeedInfo.seed([8A6B78939B5D420B:DA3EE090C27CF416]:0)
	at org.junit.Assert.fail(Assert.java:93)
	at org.apache.solr.cloud.SolrCloudTestCase.waitForState(SolrCloudTestCase.java:265)
	at org.apache.solr.cloud.MissingSegmentRecoveryTest.testLeaderRecovery(MissingSegmentRecoveryTest.java:105)
	at java.base/jdk.internal.reflect.NativeMethodAccessorImpl.invoke0(Native Method)
	at java.base/jdk.internal.reflect.NativeMethodAccessorImpl.invoke(NativeMethodAccessorImpl.java:62)
	at java.base/jdk.internal.reflect.DelegatingMethodAccessorImpl.invoke(DelegatingMethodAccessorImpl.java:43)
	at java.base/java.lang.reflect.Method.invoke(Method.java:564)
	at com.carrotsearch.randomizedtesting.RandomizedRunner.invoke(RandomizedRunner.java:1713)
	at com.carrotsearch.randomizedtesting.RandomizedRunner$8.evaluate(RandomizedRunner.java:907)
	at com.carrotsearch.randomizedtesting.RandomizedRunner$9.evaluate(RandomizedRunner.java:943)
	at com.carrotsearch.randomizedtesting.RandomizedRunner$10.evaluate(RandomizedRunner.java:957)
	at com.carrotsearch.randomizedtesting.rules.SystemPropertiesRestoreRule$1.evaluate(SystemPropertiesRestoreRule.java:57)
	at org.apache.lucene.util.TestRuleSetupTeardownChained$1.evaluate(TestRuleSetupTeardownChained.java:49)
	at org.apache.lucene.util.AbstractBeforeAfterRule$1.evaluate(AbstractBeforeAfterRule.java:45)
	at org.apache.lucene.util.TestRuleThreadAndTestName$1.evaluate(TestRuleThreadAndTestName.java:48)
	at org.apache.lucene.util.TestRuleIgnoreAfterMaxFailures$1.evaluate(TestRuleIgnoreAfterMaxFailures.java:64)
	at org.apache.lucene.util.TestRuleMarkFailure$1.evaluate(TestRuleMarkFailure.java:47)
	at com.carrotsearch.randomizedtesting.rules.StatementAdapter.evaluate(StatementAdapter.java:36)
	at com.carrotsearch.randomizedtesting.ThreadLeakControl$StatementRunner.run(ThreadLeakControl.java:368)
	at com.carrotsearch.randomizedtesting.ThreadLeakControl.forkTimeoutingTask(ThreadLeakControl.java:817)
	at com.carrotsearch.randomizedtesting.ThreadLeakControl$3.evaluate(ThreadLeakControl.java:468)
	at com.carrotsearch.randomizedtesting.RandomizedRunner.runSingleTest(RandomizedRunner.java:916)
	at com.carrotsearch.randomizedtesting.RandomizedRunner$5.evaluate(RandomizedRunner.java:802)
	at com.carrotsearch.randomizedtesting.RandomizedRunner$6.evaluate(RandomizedRunner.java:852)
	at com.carrotsearch.randomizedtesting.RandomizedRunner$7.evaluate(RandomizedRunner.java:863)
	at com.carrotsearch.randomizedtesting.rules.StatementAdapter.evaluate(StatementAdapter.java:36)
	at com.carrotsearch.randomizedtesting.rules.SystemPropertiesRestoreRule$1.evaluate(SystemPropertiesRestoreRule.java:57)
	at org.apache.lucene.util.AbstractBeforeAfterRule$1.evaluate(AbstractBeforeAfterRule.java:45)
	at com.carrotsearch.randomizedtesting.rules.StatementAdapter.evaluate(StatementAdapter.java:36)
	at org.apache.lucene.util.TestRuleStoreClassName$1.evaluate(TestRuleStoreClassName.java:41)
	at com.carrotsearch.randomizedtesting.rules.NoShadowingOrOverridesOnMethodsRule$1.evaluate(NoShadowingOrOverridesOnMethodsRule.java:40)
	at com.carrotsearch.randomizedtesting.rules.NoShadowingOrOverridesOnMethodsRule$1.evaluate(NoShadowingOrOverridesOnMethodsRule.java:40)
	at com.carrotsearch.randomizedtesting.rules.StatementAdapter.evaluate(StatementAdapter.java:36)
	at com.carrotsearch.randomizedtesting.rules.StatementAdapter.evaluate(StatementAdapter.java:36)
	at org.apache.lucene.util.TestRuleAssertionsRequired$1.evaluate(TestRuleAssertionsRequired.java:53)
	at org.apache.lucene.util.TestRuleMarkFailure$1.evaluate(TestRuleMarkFailure.java:47)
	at org.apache.lucene.util.TestRuleIgnoreAfterMaxFailures$1.evaluate(TestRuleIgnoreAfterMaxFailures.java:64)
	at org.apache.lucene.util.TestRuleIgnoreTestSuites$1.evaluate(TestRuleIgnoreTestSuites.java:54)
	at com.carrotsearch.randomizedtesting.rules.StatementAdapter.evaluate(StatementAdapter.java:36)
	at com.carrotsearch.randomizedtesting.ThreadLeakControl$StatementRunner.run(ThreadLeakControl.java:368)
	at java.base/java.lang.Thread.run(Thread.java:844)


FAILED:  junit.framework.TestSuite.org.apache.solr.cloud.TestCloudRecovery

Error Message:
Could not remove the following files (in the order of attempts):    C:\Users\jenkins\workspace\Lucene-Solr-6.x-Windows\solr\build\solr-core\test\J0\temp\solr.cloud.TestCloudRecovery_8A6B78939B5D420B-001\tempDir-001\node2\collection1_shard2_replica2\data\tlog\tlog.0000000000000000001: java.nio.file.FileSystemException: C:\Users\jenkins\workspace\Lucene-Solr-6.x-Windows\solr\build\solr-core\test\J0\temp\solr.cloud.TestCloudRecovery_8A6B78939B5D420B-001\tempDir-001\node2\collection1_shard2_replica2\data\tlog\tlog.0000000000000000001: The process cannot access the file because it is being used by another process.     C:\Users\jenkins\workspace\Lucene-Solr-6.x-Windows\solr\build\solr-core\test\J0\temp\solr.cloud.TestCloudRecovery_8A6B78939B5D420B-001\tempDir-001\node2\collection1_shard2_replica2\data\tlog: java.nio.file.DirectoryNotEmptyException: C:\Users\jenkins\workspace\Lucene-Solr-6.x-Windows\solr\build\solr-core\test\J0\temp\solr.cloud.TestCloudRecovery_8A6B78939B5D420B-001\tempDir-001\node2\collection1_shard2_replica2\data\tlog    C:\Users\jenkins\workspace\Lucene-Solr-6.x-Windows\solr\build\solr-core\test\J0\temp\solr.cloud.TestCloudRecovery_8A6B78939B5D420B-001\tempDir-001\node2\collection1_shard2_replica2\data: java.nio.file.DirectoryNotEmptyException: C:\Users\jenkins\workspace\Lucene-Solr-6.x-Windows\solr\build\solr-core\test\J0\temp\solr.cloud.TestCloudRecovery_8A6B78939B5D420B-001\tempDir-001\node2\collection1_shard2_replica2\data    C:\Users\jenkins\workspace\Lucene-Solr-6.x-Windows\solr\build\solr-core\test\J0\temp\solr.cloud.TestCloudRecovery_8A6B78939B5D420B-001\tempDir-001\node2\collection1_shard2_replica2: java.nio.file.DirectoryNotEmptyException: C:\Users\jenkins\workspace\Lucene-Solr-6.x-Windows\solr\build\solr-core\test\J0\temp\solr.cloud.TestCloudRecovery_8A6B78939B5D420B-001\tempDir-001\node2\collection1_shard2_replica2    C:\Users\jenkins\workspace\Lucene-Solr-6.x-Windows\solr\build\solr-core\test\J0\temp\solr.cloud.TestCloudRecovery_8A6B78939B5D420B-001\tempDir-001\node2\collection1_shard1_replica2\data\tlog\tlog.0000000000000000001: java.nio.file.FileSystemException: C:\Users\jenkins\workspace\Lucene-Solr-6.x-Windows\solr\build\solr-core\test\J0\temp\solr.cloud.TestCloudRecovery_8A6B78939B5D420B-001\tempDir-001\node2\collection1_shard1_replica2\data\tlog\tlog.0000000000000000001: The process cannot access the file because it is being used by another process.     C:\Users\jenkins\workspace\Lucene-Solr-6.x-Windows\solr\build\solr-core\test\J0\temp\solr.cloud.TestCloudRecovery_8A6B78939B5D420B-001\tempDir-001\node2\collection1_shard1_replica2\data\tlog: java.nio.file.DirectoryNotEmptyException: C:\Users\jenkins\workspace\Lucene-Solr-6.x-Windows\solr\build\solr-core\test\J0\temp\solr.cloud.TestCloudRecovery_8A6B78939B5D420B-001\tempDir-001\node2\collection1_shard1_replica2\data\tlog    C:\Users\jenkins\workspace\Lucene-Solr-6.x-Windows\solr\build\solr-core\test\J0\temp\solr.cloud.TestCloudRecovery_8A6B78939B5D420B-001\tempDir-001\node2\collection1_shard1_replica2\data: java.nio.file.DirectoryNotEmptyException: C:\Users\jenkins\workspace\Lucene-Solr-6.x-Windows\solr\build\solr-core\test\J0\temp\solr.cloud.TestCloudRecovery_8A6B78939B5D420B-001\tempDir-001\node2\collection1_shard1_replica2\data    C:\Users\jenkins\workspace\Lucene-Solr-6.x-Windows\solr\build\solr-core\test\J0\temp\solr.cloud.TestCloudRecovery_8A6B78939B5D420B-001\tempDir-001\node2\collection1_shard1_replica2: java.nio.file.DirectoryNotEmptyException: C:\Users\jenkins\workspace\Lucene-Solr-6.x-Windows\solr\build\solr-core\test\J0\temp\solr.cloud.TestCloudRecovery_8A6B78939B5D420B-001\tempDir-001\node2\collection1_shard1_replica2    C:\Users\jenkins\workspace\Lucene-Solr-6.x-Windows\solr\build\solr-core\test\J0\temp\solr.cloud.TestCloudRecovery_8A6B78939B5D420B-001\tempDir-001\node2: java.nio.file.DirectoryNotEmptyException: C:\Users\jenkins\workspace\Lucene-Solr-6.x-Windows\solr\build\solr-core\test\J0\temp\solr.cloud.TestCloudRecovery_8A6B78939B5D420B-001\tempDir-001\node2    C:\Users\jenkins\workspace\Lucene-Solr-6.x-Windows\solr\build\solr-core\test\J0\temp\solr.cloud.TestCloudRecovery_8A6B78939B5D420B-001\tempDir-001\node1\collection1_shard2_replica1\data\tlog\tlog.0000000000000000001: java.nio.file.FileSystemException: C:\Users\jenkins\workspace\Lucene-Solr-6.x-Windows\solr\build\solr-core\test\J0\temp\solr.cloud.TestCloudRecovery_8A6B78939B5D420B-001\tempDir-001\node1\collection1_shard2_replica1\data\tlog\tlog.0000000000000000001: The process cannot access the file because it is being used by another process.     C:\Users\jenkins\workspace\Lucene-Solr-6.x-Windows\solr\build\solr-core\test\J0\temp\solr.cloud.TestCloudRecovery_8A6B78939B5D420B-001\tempDir-001\node1\collection1_shard2_replica1\data\tlog: java.nio.file.DirectoryNotEmptyException: C:\Users\jenkins\workspace\Lucene-Solr-6.x-Windows\solr\build\solr-core\test\J0\temp\solr.cloud.TestCloudRecovery_8A6B78939B5D420B-001\tempDir-001\node1\collection1_shard2_replica1\data\tlog    C:\Users\jenkins\workspace\Lucene-Solr-6.x-Windows\solr\build\solr-core\test\J0\temp\solr.cloud.TestCloudRecovery_8A6B78939B5D420B-001\tempDir-001\node1\collection1_shard2_replica1\data: java.nio.file.DirectoryNotEmptyException: C:\Users\jenkins\workspace\Lucene-Solr-6.x-Windows\solr\build\solr-core\test\J0\temp\solr.cloud.TestCloudRecovery_8A6B78939B5D420B-001\tempDir-001\node1\collection1_shard2_replica1\data    C:\Users\jenkins\workspace\Lucene-Solr-6.x-Windows\solr\build\solr-core\test\J0\temp\solr.cloud.TestCloudRecovery_8A6B78939B5D420B-001\tempDir-001\node1\collection1_shard2_replica1: java.nio.file.DirectoryNotEmptyException: C:\Users\jenkins\workspace\Lucene-Solr-6.x-Windows\solr\build\solr-core\test\J0\temp\solr.cloud.TestCloudRecovery_8A6B78939B5D420B-001\tempDir-001\node1\collection1_shard2_replica1    C:\Users\jenkins\workspace\Lucene-Solr-6.x-Windows\solr\build\solr-core\test\J0\temp\solr.cloud.TestCloudRecovery_8A6B78939B5D420B-001\tempDir-001\node1\collection1_shard1_replica1\data\tlog\tlog.0000000000000000001: java.nio.file.FileSystemException: C:\Users\jenkins\workspace\Lucene-Solr-6.x-Windows\solr\build\solr-core\test\J0\temp\solr.cloud.TestCloudRecovery_8A6B78939B5D420B-001\tempDir-001\node1\collection1_shard1_replica1\data\tlog\tlog.0000000000000000001: The process cannot access the file because it is being used by another process.     C:\Users\jenkins\workspace\Lucene-Solr-6.x-Windows\solr\build\solr-core\test\J0\temp\solr.cloud.TestCloudRecovery_8A6B78939B5D420B-001\tempDir-001\node1\collection1_shard1_replica1\data\tlog: java.nio.file.DirectoryNotEmptyException: C:\Users\jenkins\workspace\Lucene-Solr-6.x-Windows\solr\build\solr-core\test\J0\temp\solr.cloud.TestCloudRecovery_8A6B78939B5D420B-001\tempDir-001\node1\collection1_shard1_replica1\data\tlog    C:\Users\jenkins\workspace\Lucene-Solr-6.x-Windows\solr\build\solr-core\test\J0\temp\solr.cloud.TestCloudRecovery_8A6B78939B5D420B-001\tempDir-001\node1\collection1_shard1_replica1\data: java.nio.file.DirectoryNotEmptyException: C:\Users\jenkins\workspace\Lucene-Solr-6.x-Windows\solr\build\solr-core\test\J0\temp\solr.cloud.TestCloudRecovery_8A6B78939B5D420B-001\tempDir-001\node1\collection1_shard1_replica1\data    C:\Users\jenkins\workspace\Lucene-Solr-6.x-Windows\solr\build\solr-core\test\J0\temp\solr.cloud.TestCloudRecovery_8A6B78939B5D420B-001\tempDir-001\node1\collection1_shard1_replica1: java.nio.file.DirectoryNotEmptyException: C:\Users\jenkins\workspace\Lucene-Solr-6.x-Windows\solr\build\solr-core\test\J0\temp\solr.cloud.TestCloudRecovery_8A6B78939B5D420B-001\tempDir-001\node1\collection1_shard1_replica1    C:\Users\jenkins\workspace\Lucene-Solr-6.x-Windows\solr\build\solr-core\test\J0\temp\solr.cloud.TestCloudRecovery_8A6B78939B5D420B-001\tempDir-001\node1: java.nio.file.DirectoryNotEmptyException: C:\Users\jenkins\workspace\Lucene-Solr-6.x-Windows\solr\build\solr-core\test\J0\temp\solr.cloud.TestCloudRecovery_8A6B78939B5D420B-001\tempDir-001\node1    C:\Users\jenkins\workspace\Lucene-Solr-6.x-Windows\solr\build\solr-core\test\J0\temp\solr.cloud.TestCloudRecovery_8A6B78939B5D420B-001\tempDir-001: java.nio.file.DirectoryNotEmptyException: C:\Users\jenkins\workspace\Lucene-Solr-6.x-Windows\solr\build\solr-core\test\J0\temp\solr.cloud.TestCloudRecovery_8A6B78939B5D420B-001\tempDir-001    C:\Users\jenkins\workspace\Lucene-Solr-6.x-Windows\solr\build\solr-core\test\J0\temp\solr.cloud.TestCloudRecovery_8A6B78939B5D420B-001: java.nio.file.DirectoryNotEmptyException: C:\Users\jenkins\workspace\Lucene-Solr-6.x-Windows\solr\build\solr-core\test\J0\temp\solr.cloud.TestCloudRecovery_8A6B78939B5D420B-001 

Stack Trace:
java.io.IOException: Could not remove the following files (in the order of attempts):
   C:\Users\jenkins\workspace\Lucene-Solr-6.x-Windows\solr\build\solr-core\test\J0\temp\solr.cloud.TestCloudRecovery_8A6B78939B5D420B-001\tempDir-001\node2\collection1_shard2_replica2\data\tlog\tlog.0000000000000000001: java.nio.file.FileSystemException: C:\Users\jenkins\workspace\Lucene-Solr-6.x-Windows\solr\build\solr-core\test\J0\temp\solr.cloud.TestCloudRecovery_8A6B78939B5D420B-001\tempDir-001\node2\collection1_shard2_replica2\data\tlog\tlog.0000000000000000001: The process cannot access the file because it is being used by another process.

   C:\Users\jenkins\workspace\Lucene-Solr-6.x-Windows\solr\build\solr-core\test\J0\temp\solr.cloud.TestCloudRecovery_8A6B78939B5D420B-001\tempDir-001\node2\collection1_shard2_replica2\data\tlog: java.nio.file.DirectoryNotEmptyException: C:\Users\jenkins\workspace\Lucene-Solr-6.x-Windows\solr\build\solr-core\test\J0\temp\solr.cloud.TestCloudRecovery_8A6B78939B5D420B-001\tempDir-001\node2\collection1_shard2_replica2\data\tlog
   C:\Users\jenkins\workspace\Lucene-Solr-6.x-Windows\solr\build\solr-core\test\J0\temp\solr.cloud.TestCloudRecovery_8A6B78939B5D420B-001\tempDir-001\node2\collection1_shard2_replica2\data: java.nio.file.DirectoryNotEmptyException: C:\Users\jenkins\workspace\Lucene-Solr-6.x-Windows\solr\build\solr-core\test\J0\temp\solr.cloud.TestCloudRecovery_8A6B78939B5D420B-001\tempDir-001\node2\collection1_shard2_replica2\data
   C:\Users\jenkins\workspace\Lucene-Solr-6.x-Windows\solr\build\solr-core\test\J0\temp\solr.cloud.TestCloudRecovery_8A6B78939B5D420B-001\tempDir-001\node2\collection1_shard2_replica2: java.nio.file.DirectoryNotEmptyException: C:\Users\jenkins\workspace\Lucene-Solr-6.x-Windows\solr\build\solr-core\test\J0\temp\solr.cloud.TestCloudRecovery_8A6B78939B5D420B-001\tempDir-001\node2\collection1_shard2_replica2
   C:\Users\jenkins\workspace\Lucene-Solr-6.x-Windows\solr\build\solr-core\test\J0\temp\solr.cloud.TestCloudRecovery_8A6B78939B5D420B-001\tempDir-001\node2\collection1_shard1_replica2\data\tlog\tlog.0000000000000000001: java.nio.file.FileSystemException: C:\Users\jenkins\workspace\Lucene-Solr-6.x-Windows\solr\build\solr-core\test\J0\temp\solr.cloud.TestCloudRecovery_8A6B78939B5D420B-001\tempDir-001\node2\collection1_shard1_replica2\data\tlog\tlog.0000000000000000001: The process cannot access the file because it is being used by another process.

   C:\Users\jenkins\workspace\Lucene-Solr-6.x-Windows\solr\build\solr-core\test\J0\temp\solr.cloud.TestCloudRecovery_8A6B78939B5D420B-001\tempDir-001\node2\collection1_shard1_replica2\data\tlog: java.nio.file.DirectoryNotEmptyException: C:\Users\jenkins\workspace\Lucene-Solr-6.x-Windows\solr\build\solr-core\test\J0\temp\solr.cloud.TestCloudRecovery_8A6B78939B5D420B-001\tempDir-001\node2\collection1_shard1_replica2\data\tlog
   C:\Users\jenkins\workspace\Lucene-Solr-6.x-Windows\solr\build\solr-core\test\J0\temp\solr.cloud.TestCloudRecovery_8A6B78939B5D420B-001\tempDir-001\node2\collection1_shard1_replica2\data: java.nio.file.DirectoryNotEmptyException: C:\Users\jenkins\workspace\Lucene-Solr-6.x-Windows\solr\build\solr-core\test\J0\temp\solr.cloud.TestCloudRecovery_8A6B78939B5D420B-001\tempDir-001\node2\collection1_shard1_replica2\data
   C:\Users\jenkins\workspace\Lucene-Solr-6.x-Windows\solr\build\solr-core\test\J0\temp\solr.cloud.TestCloudRecovery_8A6B78939B5D420B-001\tempDir-001\node2\collection1_shard1_replica2: java.nio.file.DirectoryNotEmptyException: C:\Users\jenkins\workspace\Lucene-Solr-6.x-Windows\solr\build\solr-core\test\J0\temp\solr.cloud.TestCloudRecovery_8A6B78939B5D420B-001\tempDir-001\node2\collection1_shard1_replica2
   C:\Users\jenkins\workspace\Lucene-Solr-6.x-Windows\solr\build\solr-core\test\J0\temp\solr.cloud.TestCloudRecovery_8A6B78939B5D420B-001\tempDir-001\node2: java.nio.file.DirectoryNotEmptyException: C:\Users\jenkins\workspace\Lucene-Solr-6.x-Windows\solr\build\solr-core\test\J0\temp\solr.cloud.TestCloudRecovery_8A6B78939B5D420B-001\tempDir-001\node2
   C:\Users\jenkins\workspace\Lucene-Solr-6.x-Windows\solr\build\solr-core\test\J0\temp\solr.cloud.TestCloudRecovery_8A6B78939B5D420B-001\tempDir-001\node1\collection1_shard2_replica1\data\tlog\tlog.0000000000000000001: java.nio.file.FileSystemException: C:\Users\jenkins\workspace\Lucene-Solr-6.x-Windows\solr\build\solr-core\test\J0\temp\solr.cloud.TestCloudRecovery_8A6B78939B5D420B-001\tempDir-001\node1\collection1_shard2_replica1\data\tlog\tlog.0000000000000000001: The process cannot access the file because it is being used by another process.

   C:\Users\jenkins\workspace\Lucene-Solr-6.x-Windows\solr\build\solr-core\test\J0\temp\solr.cloud.TestCloudRecovery_8A6B78939B5D420B-001\tempDir-001\node1\collection1_shard2_replica1\data\tlog: java.nio.file.DirectoryNotEmptyException: C:\Users\jenkins\workspace\Lucene-Solr-6.x-Windows\solr\build\solr-core\test\J0\temp\solr.cloud.TestCloudRecovery_8A6B78939B5D420B-001\tempDir-001\node1\collection1_shard2_replica1\data\tlog
   C:\Users\jenkins\workspace\Lucene-Solr-6.x-Windows\solr\build\solr-core\test\J0\temp\solr.cloud.TestCloudRecovery_8A6B78939B5D420B-001\tempDir-001\node1\collection1_shard2_replica1\data: java.nio.file.DirectoryNotEmptyException: C:\Users\jenkins\workspace\Lucene-Solr-6.x-Windows\solr\build\solr-core\test\J0\temp\solr.cloud.TestCloudRecovery_8A6B78939B5D420B-001\tempDir-001\node1\collection1_shard2_replica1\data
   C:\Users\jenkins\workspace\Lucene-Solr-6.x-Windows\solr\build\solr-core\test\J0\temp\solr.cloud.TestCloudRecovery_8A6B78939B5D420B-001\tempDir-001\node1\collection1_shard2_replica1: java.nio.file.DirectoryNotEmptyException: C:\Users\jenkins\workspace\Lucene-Solr-6.x-Windows\solr\build\solr-core\test\J0\temp\solr.cloud.TestCloudRecovery_8A6B78939B5D420B-001\tempDir-001\node1\collection1_shard2_replica1
   C:\Users\jenkins\workspace\Lucene-Solr-6.x-Windows\solr\build\solr-core\test\J0\temp\solr.cloud.TestCloudRecovery_8A6B78939B5D420B-001\tempDir-001\node1\collection1_shard1_replica1\data\tlog\tlog.0000000000000000001: java.nio.file.FileSystemException: C:\Users\jenkins\workspace\Lucene-Solr-6.x-Windows\solr\build\solr-core\test\J0\temp\solr.cloud.TestCloudRecovery_8A6B78939B5D420B-001\tempDir-001\node1\collection1_shard1_replica1\data\tlog\tlog.0000000000000000001: The process cannot access the file because it is being used by another process.

   C:\Users\jenkins\workspace\Lucene-Solr-6.x-Windows\solr\build\solr-core\test\J0\temp\solr.cloud.TestCloudRecovery_8A6B78939B5D420B-001\tempDir-001\node1\collection1_shard1_replica1\data\tlog: java.nio.file.DirectoryNotEmptyException: C:\Users\jenkins\workspace\Lucene-Solr-6.x-Windows\solr\build\solr-core\test\J0\temp\solr.cloud.TestCloudRecovery_8A6B78939B5D420B-001\tempDir-001\node1\collection1_shard1_replica1\data\tlog
   C:\Users\jenkins\workspace\Lucene-Solr-6.x-Windows\solr\build\solr-core\test\J0\temp\solr.cloud.TestCloudRecovery_8A6B78939B5D420B-001\tempDir-001\node1\collection1_shard1_replica1\data: java.nio.file.DirectoryNotEmptyException: C:\Users\jenkins\workspace\Lucene-Solr-6.x-Windows\solr\build\solr-core\test\J0\temp\solr.cloud.TestCloudRecovery_8A6B78939B5D420B-001\tempDir-001\node1\collection1_shard1_replica1\data
   C:\Users\jenkins\workspace\Lucene-Solr-6.x-Windows\solr\build\solr-core\test\J0\temp\solr.cloud.TestCloudRecovery_8A6B78939B5D420B-001\tempDir-001\node1\collection1_shard1_replica1: java.nio.file.DirectoryNotEmptyException: C:\Users\jenkins\workspace\Lucene-Solr-6.x-Windows\solr\build\solr-core\test\J0\temp\solr.cloud.TestCloudRecovery_8A6B78939B5D420B-001\tempDir-001\node1\collection1_shard1_replica1
   C:\Users\jenkins\workspace\Lucene-Solr-6.x-Windows\solr\build\solr-core\test\J0\temp\solr.cloud.TestCloudRecovery_8A6B78939B5D420B-001\tempDir-001\node1: java.nio.file.DirectoryNotEmptyException: C:\Users\jenkins\workspace\Lucene-Solr-6.x-Windows\solr\build\solr-core\test\J0\temp\solr.cloud.TestCloudRecovery_8A6B78939B5D420B-001\tempDir-001\node1
   C:\Users\jenkins\workspace\Lucene-Solr-6.x-Windows\solr\build\solr-core\test\J0\temp\solr.cloud.TestCloudRecovery_8A6B78939B5D420B-001\tempDir-001: java.nio.file.DirectoryNotEmptyException: C:\Users\jenkins\workspace\Lucene-Solr-6.x-Windows\solr\build\solr-core\test\J0\temp\solr.cloud.TestCloudRecovery_8A6B78939B5D420B-001\tempDir-001
   C:\Users\jenkins\workspace\Lucene-Solr-6.x-Windows\solr\build\solr-core\test\J0\temp\solr.cloud.TestCloudRecovery_8A6B78939B5D420B-001: java.nio.file.DirectoryNotEmptyException: C:\Users\jenkins\workspace\Lucene-Solr-6.x-Windows\solr\build\solr-core\test\J0\temp\solr.cloud.TestCloudRecovery_8A6B78939B5D420B-001

	at __randomizedtesting.SeedInfo.seed([8A6B78939B5D420B]:0)
	at org.apache.lucene.util.IOUtils.rm(IOUtils.java:329)
	at org.apache.lucene.util.TestRuleTemporaryFilesCleanup.afterAlways(TestRuleTemporaryFilesCleanup.java:216)
	at com.carrotsearch.randomizedtesting.rules.TestRuleAdapter$1.afterAlways(TestRuleAdapter.java:31)
	at com.carrotsearch.randomizedtesting.rules.StatementAdapter.evaluate(StatementAdapter.java:43)
	at com.carrotsearch.randomizedtesting.rules.StatementAdapter.evaluate(StatementAdapter.java:36)
	at org.apache.lucene.util.TestRuleAssertionsRequired$1.evaluate(TestRuleAssertionsRequired.java:53)
	at org.apache.lucene.util.TestRuleMarkFailure$1.evaluate(TestRuleMarkFailure.java:47)
	at org.apache.lucene.util.TestRuleIgnoreAfterMaxFailures$1.evaluate(TestRuleIgnoreAfterMaxFailures.java:64)
	at org.apache.lucene.util.TestRuleIgnoreTestSuites$1.evaluate(TestRuleIgnoreTestSuites.java:54)
	at com.carrotsearch.randomizedtesting.rules.StatementAdapter.evaluate(StatementAdapter.java:36)
	at com.carrotsearch.randomizedtesting.ThreadLeakControl$StatementRunner.run(ThreadLeakControl.java:368)
	at java.base/java.lang.Thread.run(Thread.java:844)




Build Log:
[...truncated 11262 lines...]
   [junit4] Suite: org.apache.solr.cloud.MissingSegmentRecoveryTest
   [junit4]   2> Creating dataDir: C:\Users\jenkins\workspace\Lucene-Solr-6.x-Windows\solr\build\solr-core\test\J1\temp\solr.cloud.MissingSegmentRecoveryTest_8A6B78939B5D420B-001\init-core-data-001
   [junit4]   2> 84101 WARN  (SUITE-MissingSegmentRecoveryTest-seed#[8A6B78939B5D420B]-worker) [    ] o.a.s.SolrTestCaseJ4 startTrackingSearchers: numOpens=2 numCloses=2
   [junit4]   2> 84101 INFO  (SUITE-MissingSegmentRecoveryTest-seed#[8A6B78939B5D420B]-worker) [    ] o.a.s.SolrTestCaseJ4 Using TrieFields
   [junit4]   2> 84102 INFO  (SUITE-MissingSegmentRecoveryTest-seed#[8A6B78939B5D420B]-worker) [    ] o.a.s.SolrTestCaseJ4 Randomized ssl (false) and clientAuth (false) via: @org.apache.solr.util.RandomizeSSL(reason="", value=0.0/0.0, ssl=0.0/0.0, clientAuth=0.0/0.0)
   [junit4]   2> 84103 INFO  (SUITE-MissingSegmentRecoveryTest-seed#[8A6B78939B5D420B]-worker) [    ] o.a.s.c.MiniSolrCloudCluster Starting cluster of 2 servers in C:\Users\jenkins\workspace\Lucene-Solr-6.x-Windows\solr\build\solr-core\test\J1\temp\solr.cloud.MissingSegmentRecoveryTest_8A6B78939B5D420B-001\tempDir-001
   [junit4]   2> 84104 INFO  (SUITE-MissingSegmentRecoveryTest-seed#[8A6B78939B5D420B]-worker) [    ] o.a.s.c.ZkTestServer STARTING ZK TEST SERVER
   [junit4]   2> 84108 INFO  (Thread-199) [    ] o.a.s.c.ZkTestServer client port:0.0.0.0/0.0.0.0:0
   [junit4]   2> 84108 INFO  (Thread-199) [    ] o.a.s.c.ZkTestServer Starting server
   [junit4]   2> 84113 ERROR (Thread-199) [    ] o.a.z.s.ZooKeeperServer ZKShutdownHandler is not registered, so ZooKeeper server won't take any action on ERROR or SHUTDOWN server state changes
   [junit4]   2> 84205 INFO  (SUITE-MissingSegmentRecoveryTest-seed#[8A6B78939B5D420B]-worker) [    ] o.a.s.c.ZkTestServer start zk server on port:62769
   [junit4]   2> 84213 INFO  (jetty-launcher-168-thread-2) [    ] o.e.j.s.Server jetty-9.3.14.v20161028
   [junit4]   2> 84213 INFO  (jetty-launcher-168-thread-1) [    ] o.e.j.s.Server jetty-9.3.14.v20161028
   [junit4]   2> 84214 INFO  (jetty-launcher-168-thread-2) [    ] o.e.j.s.h.ContextHandler Started o.e.j.s.ServletContextHandler@4ab9663c{/solr,null,AVAILABLE}
   [junit4]   2> 84214 INFO  (jetty-launcher-168-thread-1) [    ] o.e.j.s.h.ContextHandler Started o.e.j.s.ServletContextHandler@3425451f{/solr,null,AVAILABLE}
   [junit4]   2> 84218 INFO  (jetty-launcher-168-thread-1) [    ] o.e.j.s.AbstractConnector Started ServerConnector@4abbdd8e{HTTP/1.1,[http/1.1]}{127.0.0.1:?????}
   [junit4]   2> 84218 INFO  (jetty-launcher-168-thread-1) [    ] o.e.j.s.Server Started @?????ms
   [junit4]   2> 84218 INFO  (jetty-launcher-168-thread-1) [    ] o.a.s.c.s.e.JettySolrRunner Jetty properties: {hostContext=/solr, hostPort=62776}
   [junit4]   2> 84219 ERROR (jetty-launcher-168-thread-1) [    ] o.a.s.s.StartupLoggingUtils Missing Java Option solr.log.dir. Logging may be missing or incomplete.
   [junit4]   2> 84219 INFO  (jetty-launcher-168-thread-1) [    ] o.a.s.s.SolrDispatchFilter  ___      _       Welcome to Apache Solr? version 6.7.0
   [junit4]   2> 84219 INFO  (jetty-launcher-168-thread-2) [    ] o.e.j.s.AbstractConnector Started ServerConnector@5d68d7e4{HTTP/1.1,[http/1.1]}{127.0.0.1:?????}
   [junit4]   2> 84219 INFO  (jetty-launcher-168-thread-1) [    ] o.a.s.s.SolrDispatchFilter / __| ___| |_ _   Starting in cloud mode on port null
   [junit4]   2> 84219 INFO  (jetty-launcher-168-thread-1) [    ] o.a.s.s.SolrDispatchFilter \__ \/ _ \ | '_|  Install dir: null
   [junit4]   2> 84219 INFO  (jetty-launcher-168-thread-2) [    ] o.e.j.s.Server Started @?????ms
   [junit4]   2> 84219 INFO  (jetty-launcher-168-thread-2) [    ] o.a.s.c.s.e.JettySolrRunner Jetty properties: {hostContext=/solr, hostPort=62774}
   [junit4]   2> 84219 INFO  (jetty-launcher-168-thread-1) [    ] o.a.s.s.SolrDispatchFilter |___/\___/_|_|    Start time: 2017-07-01T12:38:29.229513400Z
   [junit4]   2> 84219 ERROR (jetty-launcher-168-thread-2) [    ] o.a.s.s.StartupLoggingUtils Missing Java Option solr.log.dir. Logging may be missing or incomplete.
   [junit4]   2> 84219 INFO  (jetty-launcher-168-thread-2) [    ] o.a.s.s.SolrDispatchFilter  ___      _       Welcome to Apache Solr? version 6.7.0
   [junit4]   2> 84219 INFO  (jetty-launcher-168-thread-2) [    ] o.a.s.s.SolrDispatchFilter / __| ___| |_ _   Starting in cloud mode on port null
   [junit4]   2> 84220 INFO  (jetty-launcher-168-thread-2) [    ] o.a.s.s.SolrDispatchFilter \__ \/ _ \ | '_|  Install dir: null
   [junit4]   2> 84220 INFO  (jetty-launcher-168-thread-2) [    ] o.a.s.s.SolrDispatchFilter |___/\___/_|_|    Start time: 2017-07-01T12:38:29.230589200Z
   [junit4]   2> 84222 INFO  (jetty-launcher-168-thread-1) [    ] o.a.s.s.SolrDispatchFilter solr.xml found in ZooKeeper. Loading...
   [junit4]   2> 84223 INFO  (jetty-launcher-168-thread-2) [    ] o.a.s.s.SolrDispatchFilter solr.xml found in ZooKeeper. Loading...
   [junit4]   2> 84231 INFO  (jetty-launcher-168-thread-1) [    ] o.a.s.u.UpdateShardHandler Creating UpdateShardHandler HTTP client with params: socketTimeout=340000&connTimeout=45000&retry=true
   [junit4]   2> 84231 INFO  (jetty-launcher-168-thread-2) [    ] o.a.s.u.UpdateShardHandler Creating UpdateShardHandler HTTP client with params: socketTimeout=340000&connTimeout=45000&retry=true
   [junit4]   2> 84232 INFO  (jetty-launcher-168-thread-1) [    ] o.a.s.c.ZkContainer Zookeeper client=127.0.0.1:62769/solr
   [junit4]   2> 84232 INFO  (jetty-launcher-168-thread-2) [    ] o.a.s.c.ZkContainer Zookeeper client=127.0.0.1:62769/solr
   [junit4]   2> 84236 WARN  (NIOServerCxn.Factory:0.0.0.0/0.0.0.0:0) [    ] o.a.z.s.NIOServerCnxn caught end of stream exception
   [junit4]   2> EndOfStreamException: Unable to read additional data from client sessionid 0x15cfe28da020003, likely client has closed socket
   [junit4]   2> 	at org.apache.zookeeper.server.NIOServerCnxn.doIO(NIOServerCnxn.java:239)
   [junit4]   2> 	at org.apache.zookeeper.server.NIOServerCnxnFactory.run(NIOServerCnxnFactory.java:203)
   [junit4]   2> 	at java.base/java.lang.Thread.run(Thread.java:844)
   [junit4]   2> 84238 WARN  (NIOServerCxn.Factory:0.0.0.0/0.0.0.0:0) [    ] o.a.z.s.NIOServerCnxn caught end of stream exception
   [junit4]   2> EndOfStreamException: Unable to read additional data from client sessionid 0x15cfe28da020004, likely client has closed socket
   [junit4]   2> 	at org.apache.zookeeper.server.NIOServerCnxn.doIO(NIOServerCnxn.java:239)
   [junit4]   2> 	at org.apache.zookeeper.server.NIOServerCnxnFactory.run(NIOServerCnxnFactory.java:203)
   [junit4]   2> 	at java.base/java.lang.Thread.run(Thread.java:844)
   [junit4]   2> 84259 INFO  (jetty-launcher-168-thread-1) [    ] o.a.s.c.Overseer Overseer (id=null) closing
   [junit4]   2> 84260 INFO  (jetty-launcher-168-thread-2) [    ] o.a.s.c.Overseer Overseer (id=null) closing
   [junit4]   2> 84260 INFO  (jetty-launcher-168-thread-1) [    ] o.a.s.c.OverseerElectionContext I am going to be the leader 127.0.0.1:62776_solr
   [junit4]   2> 84261 INFO  (jetty-launcher-168-thread-1) [    ] o.a.s.c.Overseer Overseer (id=98232743305019397-127.0.0.1:62776_solr-n_0000000000) starting
   [junit4]   2> 84262 INFO  (jetty-launcher-168-thread-2) [    ] o.a.s.c.ZkController Register node as live in ZooKeeper:/live_nodes/127.0.0.1:62774_solr
   [junit4]   2> 84263 INFO  (zkCallback-179-thread-1) [    ] o.a.s.c.c.ZkStateReader Updated live nodes from ZooKeeper... (0) -> (1)
   [junit4]   2> 84264 INFO  (zkCallback-180-thread-1) [    ] o.a.s.c.c.ZkStateReader Updated live nodes from ZooKeeper... (0) -> (1)
   [junit4]   2> 84267 INFO  (jetty-launcher-168-thread-1) [    ] o.a.s.c.ZkController Register node as live in ZooKeeper:/live_nodes/127.0.0.1:62776_solr
   [junit4]   2> 84299 INFO  (zkCallback-179-thread-1) [    ] o.a.s.c.c.ZkStateReader Updated live nodes from ZooKeeper... (1) -> (2)
   [junit4]   2> 84299 INFO  (zkCallback-180-thread-1) [    ] o.a.s.c.c.ZkStateReader Updated live nodes from ZooKeeper... (1) -> (2)
   [junit4]   2> 84316 INFO  (jetty-launcher-168-thread-1) [    ] o.a.s.c.CorePropertiesLocator Found 0 core definitions underneath C:\Users\jenkins\workspace\Lucene-Solr-6.x-Windows\solr\build\solr-core\test\J1\temp\solr.cloud.MissingSegmentRecoveryTest_8A6B78939B5D420B-001\tempDir-001\node1\.
   [junit4]   2> 84332 INFO  (jetty-launcher-168-thread-2) [    ] o.a.s.c.CorePropertiesLocator Found 0 core definitions underneath C:\Users\jenkins\workspace\Lucene-Solr-6.x-Windows\solr\build\solr-core\test\J1\temp\solr.cloud.MissingSegmentRecoveryTest_8A6B78939B5D420B-001\tempDir-001\node2\.
   [junit4]   2> 84347 WARN  (NIOServerCxn.Factory:0.0.0.0/0.0.0.0:0) [    ] o.a.z.s.NIOServerCnxn caught end of stream exception
   [junit4]   2> EndOfStreamException: Unable to read additional data from client sessionid 0x15cfe28da020007, likely client has closed socket
   [junit4]   2> 	at org.apache.zookeeper.server.NIOServerCnxn.doIO(NIOServerCnxn.java:239)
   [junit4]   2> 	at org.apache.zookeeper.server.NIOServerCnxnFactory.run(NIOServerCnxnFactory.java:203)
   [junit4]   2> 	at java.base/java.lang.Thread.run(Thread.java:844)
   [junit4]   2> 84351 INFO  (SUITE-MissingSegmentRecoveryTest-seed#[8A6B78939B5D420B]-worker) [    ] o.a.s.c.c.ZkStateReader Updated live nodes from ZooKeeper... (0) -> (2)
   [junit4]   2> 84352 INFO  (SUITE-MissingSegmentRecoveryTest-seed#[8A6B78939B5D420B]-worker) [    ] o.a.s.c.s.i.ZkClientClusterStateProvider Cluster at 127.0.0.1:62769/solr ready
   [junit4]   2> 84364 INFO  (TEST-MissingSegmentRecoveryTest.testLeaderRecovery-seed#[8A6B78939B5D420B]) [    ] o.a.s.SolrTestCaseJ4 ###Starting testLeaderRecovery
   [junit4]   2> 84368 INFO  (qtp536776047-864) [    ] o.a.s.h.a.CollectionsHandler Invoked Collection Action :create with params replicationFactor=2&collection.configName=conf&maxShardsPerNode=1&name=MissingSegmentRecoveryTest&action=CREATE&numShards=1&wt=javabin&version=2 and sendToOCPQueue=true
   [junit4]   2> 84383 INFO  (OverseerThreadFactory-442-thread-1) [    ] o.a.s.c.CreateCollectionCmd Create collection MissingSegmentRecoveryTest
   [junit4]   2> 84495 INFO  (qtp536776047-867) [    ] o.a.s.h.a.CoreAdminOperation core create command qt=/admin/cores&collection.configName=conf&newCollection=true&name=MissingSegmentRecoveryTest_shard1_replica2&action=CREATE&numShards=1&collection=MissingSegmentRecoveryTest&shard=shard1&wt=javabin&version=2
   [junit4]   2> 84495 INFO  (qtp536776047-867) [    ] o.a.s.c.TransientSolrCoreCacheDefault Allocating transient cache for 2147483647 transient cores
   [junit4]   2> 84498 INFO  (qtp1588610480-859) [    ] o.a.s.h.a.CoreAdminOperation core create command qt=/admin/cores&collection.configName=conf&newCollection=true&name=MissingSegmentRecoveryTest_shard1_replica1&action=CREATE&numShards=1&collection=MissingSegmentRecoveryTest&shard=shard1&wt=javabin&version=2
   [junit4]   2> 84499 INFO  (qtp1588610480-859) [    ] o.a.s.c.TransientSolrCoreCacheDefault Allocating transient cache for 2147483647 transient cores
   [junit4]   2> 84610 INFO  (zkCallback-179-thread-1) [    ] o.a.s.c.c.ZkStateReader A cluster state change: [WatchedEvent state:SyncConnected type:NodeDataChanged path:/collections/MissingSegmentRecoveryTest/state.json] for collection [MissingSegmentRecoveryTest] has occurred - updating... (live nodes size: [2])
   [junit4]   2> 84610 INFO  (zkCallback-180-thread-1) [    ] o.a.s.c.c.ZkStateReader A cluster state change: [WatchedEvent state:SyncConnected type:NodeDataChanged path:/collections/MissingSegmentRecoveryTest/state.json] for collection [MissingSegmentRecoveryTest] has occurred - updating... (live nodes size: [2])
   [junit4]   2> 85513 INFO  (qtp1588610480-859) [    ] o.a.s.c.SolrConfig Using Lucene MatchVersion: 6.7.0
   [junit4]   2> 85513 INFO  (qtp536776047-867) [    ] o.a.s.c.SolrConfig Using Lucene MatchVersion: 6.7.0
   [junit4]   2> 85524 INFO  (qtp536776047-867) [    ] o.a.s.s.IndexSchema [MissingSegmentRecoveryTest_shard1_replica2] Schema name=minimal
   [junit4]   2> 85524 INFO  (qtp1588610480-859) [    ] o.a.s.s.IndexSchema [MissingSegmentRecoveryTest_shard1_replica1] Schema name=minimal
   [junit4]   2> 85525 INFO  (qtp1588610480-859) [    ] o.a.s.s.IndexSchema Loaded schema minimal/1.1 with uniqueid field id
   [junit4]   2> 85525 INFO  (qtp1588610480-859) [    ] o.a.s.c.CoreContainer Creating SolrCore 'MissingSegmentRecoveryTest_shard1_replica1' using configuration from collection MissingSegmentRecoveryTest, trusted=true
   [junit4]   2> 85525 INFO  (qtp1588610480-859) [    ] o.a.s.c.SolrCore solr.RecoveryStrategy.Builder
   [junit4]   2> 85526 INFO  (qtp1588610480-859) [    ] o.a.s.c.SolrCore [[MissingSegmentRecoveryTest_shard1_replica1] ] Opening new SolrCore at [C:\Users\jenkins\workspace\Lucene-Solr-6.x-Windows\solr\build\solr-core\test\J1\temp\solr.cloud.MissingSegmentRecoveryTest_8A6B78939B5D420B-001\tempDir-001\node2\MissingSegmentRecoveryTest_shard1_replica1], dataDir=[C:\Users\jenkins\workspace\Lucene-Solr-6.x-Windows\solr\build\solr-core\test\J1\temp\solr.cloud.MissingSegmentRecoveryTest_8A6B78939B5D420B-001\tempDir-001\node2\.\MissingSegmentRecoveryTest_shard1_replica1\data\]
   [junit4]   2> 85529 INFO  (qtp536776047-867) [    ] o.a.s.s.IndexSchema Loaded schema minimal/1.1 with uniqueid field id
   [junit4]   2> 85529 INFO  (qtp536776047-867) [    ] o.a.s.c.CoreContainer Creating SolrCore 'MissingSegmentRecoveryTest_shard1_replica2' using configuration from collection MissingSegmentRecoveryTest, trusted=true
   [junit4]   2> 85534 INFO  (qtp536776047-867) [    ] o.a.s.c.SolrCore solr.RecoveryStrategy.Builder
   [junit4]   2> 85534 INFO  (qtp536776047-867) [    ] o.a.s.c.SolrCore [[MissingSegmentRecoveryTest_shard1_replica2] ] Opening new SolrCore at [C:\Users\jenkins\workspace\Lucene-Solr-6.x-Windows\solr\build\solr-core\test\J1\temp\solr.cloud.MissingSegmentRecoveryTest_8A6B78939B5D420B-001\tempDir-001\node1\MissingSegmentRecoveryTest_shard1_replica2], dataDir=[C:\Users\jenkins\workspace\Lucene-Solr-6.x-Windows\solr\build\solr-core\test\J1\temp\solr.cloud.MissingSegmentRecoveryTest_8A6B78939B5D420B-001\tempDir-001\node1\.\MissingSegmentRecoveryTest_shard1_replica2\data\]
   [junit4]   2> 85602 INFO  (qtp1588610480-859) [    ] o.a.s.u.UpdateHandler Using UpdateLog implementation: org.apache.solr.update.UpdateLog
   [junit4]   2> 85602 INFO  (qtp1588610480-859) [    ] o.a.s.u.UpdateLog Initializing UpdateLog: dataDir=null defaultSyncLevel=FLUSH numRecordsToKeep=100 maxNumLogsToKeep=10 numVersionBuckets=65536
   [junit4]   2> 85603 INFO  (qtp1588610480-859) [    ] o.a.s.u.CommitTracker Hard AutoCommit: disabled
   [junit4]   2> 85603 INFO  (qtp1588610480-859) [    ] o.a.s.u.CommitTracker Soft AutoCommit: disabled
   [junit4]   2> 85606 INFO  (qtp1588610480-859) [    ] o.a.s.s.SolrIndexSearcher Opening [Searcher@5257c695[MissingSegmentRecoveryTest_shard1_replica1] main]
   [junit4]   2> 85606 INFO  (qtp536776047-867) [    ] o.a.s.u.UpdateHandler Using UpdateLog implementation: org.apache.solr.update.UpdateLog
   [junit4]   2> 85606 INFO  (qtp536776047-867) [    ] o.a.s.u.UpdateLog Initializing UpdateLog: dataDir=null defaultSyncLevel=FLUSH numRecordsToKeep=100 maxNumLogsToKeep=10 numVersionBuckets=65536
   [junit4]   2> 85607 INFO  (qtp1588610480-859) [    ] o.a.s.r.ManagedResourceStorage Configured ZooKeeperStorageIO with znodeBase: /configs/conf
   [junit4]   2> 85607 INFO  (qtp1588610480-859) [    ] o.a.s.r.ManagedResourceStorage Loaded null at path _rest_managed.json using ZooKeeperStorageIO:path=/configs/conf
   [junit4]   2> 85607 INFO  (qtp1588610480-859) [    ] o.a.s.h.ReplicationHandler Commits will be reserved for  10000
   [junit4]   2> 85607 INFO  (qtp536776047-867) [    ] o.a.s.u.CommitTracker Hard AutoCommit: disabled
   [junit4]   2> 85607 INFO  (qtp536776047-867) [    ] o.a.s.u.CommitTracker Soft AutoCommit: disabled
   [junit4]   2> 85608 INFO  (qtp1588610480-859) [    ] o.a.s.u.UpdateLog Could not find max version in index or recent updates, using new clock 1571723894448979968
   [junit4]   2> 85610 INFO  (searcherExecutor-444-thread-1) [    ] o.a.s.c.SolrCore [MissingSegmentRecoveryTest_shard1_replica1] Registered new searcher Searcher@5257c695[MissingSegmentRecoveryTest_shard1_replica1] main{ExitableDirectoryReader(UninvertingDirectoryReader())}
   [junit4]   2> 85611 INFO  (qtp536776047-867) [    ] o.a.s.s.SolrIndexSearcher Opening [Searcher@3c17d3d2[MissingSegmentRecoveryTest_shard1_replica2] main]
   [junit4]   2> 85612 INFO  (qtp536776047-867) [    ] o.a.s.r.ManagedResourceStorage Configured ZooKeeperStorageIO with znodeBase: /configs/conf
   [junit4]   2> 85613 INFO  (qtp536776047-867) [    ] o.a.s.r.ManagedResourceStorage Loaded null at path _rest_managed.json using ZooKeeperStorageIO:path=/configs/conf
   [junit4]   2> 85613 INFO  (qtp536776047-867) [    ] o.a.s.h.ReplicationHandler Commits will be reserved for  10000
   [junit4]   2> 85614 INFO  (searcherExecutor-445-thread-1) [    ] o.a.s.c.SolrCore [MissingSegmentRecoveryTest_shard1_replica2] Registered new searcher Searcher@3c17d3d2[MissingSegmentRecoveryTest_shard1_replica2] main{ExitableDirectoryReader(UninvertingDirectoryReader())}
   [junit4]   2> 85614 INFO  (qtp536776047-867) [    ] o.a.s.u.UpdateLog Could not find max version in index or recent updates, using new clock 1571723894455271424
   [junit4]   2> 85625 INFO  (qtp1588610480-859) [    ] o.a.s.c.ShardLeaderElectionContext Waiting until we see more replicas up for shard shard1: total=2 found=1 timeoutin=9989ms
   [junit4]   2> 85731 INFO  (zkCallback-180-thread-1) [    ] o.a.s.c.c.ZkStateReader A cluster state change: [WatchedEvent state:SyncConnected type:NodeDataChanged path:/collections/MissingSegmentRecoveryTest/state.json] for collection [MissingSegmentRecoveryTest] has occurred - updating... (live nodes size: [2])
   [junit4]   2> 85731 INFO  (zkCallback-179-thread-1) [    ] o.a.s.c.c.ZkStateReader A cluster state change: [WatchedEvent state:SyncConnected type:NodeDataChanged path:/collections/MissingSegmentRecoveryTest/state.json] for collection [MissingSegmentRecoveryTest] has occurred - updating... (live nodes size: [2])
   [junit4]   2> 86126 INFO  (qtp1588610480-859) [    ] o.a.s.c.ShardLeaderElectionContext Enough replicas found to continue.
   [junit4]   2> 86126 INFO  (qtp1588610480-859) [    ] o.a.s.c.ShardLeaderElectionContext I may be the new leader - try and sync
   [junit4]   2> 86126 INFO  (qtp1588610480-859) [    ] o.a.s.c.SyncStrategy Sync replicas to http://127.0.0.1:62774/solr/MissingSegmentRecoveryTest_shard1_replica1/
   [junit4]   2> 86129 INFO  (qtp1588610480-859) [    ] o.a.s.u.PeerSync PeerSync: core=MissingSegmentRecoveryTest_shard1_replica1 url=http://127.0.0.1:62774/solr START replicas=[http://127.0.0.1:62776/solr/MissingSegmentRecoveryTest_shard1_replica2/] nUpdates=100
   [junit4]   2> 86130 INFO  (qtp1588610480-859) [    ] o.a.s.u.PeerSync PeerSync: core=MissingSegmentRecoveryTest_shard1_replica1 url=http://127.0.0.1:62774/solr DONE.  We have no versions.  sync failed.
   [junit4]   2> 86132 INFO  (qtp536776047-870) [    ] o.a.s.c.S.Request [MissingSegmentRecoveryTest_shard1_replica2]  webapp=/solr path=/get params={distrib=false&qt=/get&fingerprint=false&getVersions=100&wt=javabin&version=2} status=0 QTime=0
   [junit4]   2> 86134 INFO  (qtp1588610480-859) [    ] o.a.s.c.SyncStrategy Leader's attempt to sync with shard failed, moving to the next candidate
   [junit4]   2> 86134 INFO  (qtp1588610480-859) [    ] o.a.s.c.ShardLeaderElectionContext We failed sync, but we have no versions - we can't sync in that case - we were active before, so become leader anyway
   [junit4]   2> 86134 INFO  (qtp1588610480-859) [    ] o.a.s.c.ShardLeaderElectionContext Found all replicas participating in election, clear LIR
   [junit4]   2> 86138 INFO  (qtp1588610480-859) [    ] o.a.s.c.ShardLeaderElectionContext I am the new leader: http://127.0.0.1:62774/solr/MissingSegmentRecoveryTest_shard1_replica1/ shard1
   [junit4]   2> 86242 INFO  (zkCallback-179-thread-1) [    ] o.a.s.c.c.ZkStateReader A cluster state change: [WatchedEvent state:SyncConnected type:NodeDataChanged path:/collections/MissingSegmentRecoveryTest/state.json] for collection [MissingSegmentRecoveryTest] has occurred - updating... (live nodes size: [2])
   [junit4]   2> 86242 INFO  (zkCallback-180-thread-1) [    ] o.a.s.c.c.ZkStateReader A cluster state change: [WatchedEvent state:SyncConnected type:NodeDataChanged path:/collections/MissingSegmentRecoveryTest/state.json] for collection [MissingSegmentRecoveryTest] has occurred - updating... (live nodes size: [2])
   [junit4]   2> 86290 INFO  (qtp1588610480-859) [    ] o.a.s.c.ZkController I am the leader, no recovery necessary
   [junit4]   2> 86293 INFO  (qtp1588610480-859) [    ] o.a.s.s.HttpSolrCall [admin] webapp=null path=/admin/cores params={qt=/admin/cores&collection.configName=conf&newCollection=true&name=MissingSegmentRecoveryTest_shard1_replica1&action=CREATE&numShards=1&collection=MissingSegmentRecoveryTest&shard=shard1&wt=javabin&version=2} status=0 QTime=1794
   [junit4]   2> 86396 INFO  (zkCallback-180-thread-1) [    ] o.a.s.c.c.ZkStateReader A cluster state change: [WatchedEvent state:SyncConnected type:NodeDataChanged path:/collections/MissingSegmentRecoveryTest/state.json] for collection [MissingSegmentRecoveryTest] has occurred - updating... (live nodes size: [2])
   [junit4]   2> 86396 INFO  (zkCallback-179-thread-1) [    ] o.a.s.c.c.ZkStateReader A cluster state change: [WatchedEvent state:SyncConnected type:NodeDataChanged path:/collections/MissingSegmentRecoveryTest/state.json] for collection [MissingSegmentRecoveryTest] has occurred - updating... (live nodes size: [2])
   [junit4]   2> 86634 INFO  (qtp536776047-867) [    ] o.a.s.s.HttpSolrCall [admin] webapp=null path=/admin/cores params={qt=/admin/cores&collection.configName=conf&newCollection=true&name=MissingSegmentRecoveryTest_shard1_replica2&action=CREATE&numShards=1&collection=MissingSegmentRecoveryTest&shard=shard1&wt=javabin&version=2} status=0 QTime=2138
   [junit4]   2> 86637 INFO  (qtp536776047-864) [    ] o.a.s.h.a.CollectionsHandler Wait for new collection to be active for at most 30 seconds. Check all shard replicas
   [junit4]   2> 86735 INFO  (zkCallback-180-thread-1) [    ] o.a.s.c.c.ZkStateReader A cluster state change: [WatchedEvent state:SyncConnected type:NodeDataChanged path:/collections/MissingSegmentRecoveryTest/state.json] for collection [MissingSegmentRecoveryTest] has occurred - updating... (live nodes size: [2])
   [junit4]   2> 86735 INFO  (zkCallback-179-thread-1) [    ] o.a.s.c.c.ZkStateReader A cluster state change: [WatchedEvent state:SyncConnected type:NodeDataChanged path:/collections/MissingSegmentRecoveryTest/state.json] for collection [MissingSegmentRecoveryTest] has occurred - updating... (live nodes size: [2])
   [junit4]   2> 87638 INFO  (qtp536776047-864) [    ] o.a.s.s.HttpSolrCall [admin] webapp=null path=/admin/collections params={replicationFactor=2&collection.configName=conf&maxShardsPerNode=1&name=MissingSegmentRecoveryTest&action=CREATE&numShards=1&wt=javabin&version=2} status=0 QTime=3269
   [junit4]   2> 87666 INFO  (qtp536776047-873) [    ] o.a.s.u.p.LogUpdateProcessorFactory [MissingSegmentRecoveryTest_shard1_replica2]  webapp=/solr path=/update params={update.distrib=FROMLEADER&distrib.from=http://127.0.0.1:62774/solr/MissingSegmentRecoveryTest_shard1_replica1/&wt=javabin&version=2}{add=[0 (1571723896588075008), 1 (1571723896594366464), 2 (1571723896595415040), 3 (1571723896595415041), 4 (1571723896595415042), 5 (1571723896595415043), 6 (1571723896595415044), 7 (1571723896595415045), 8 (1571723896595415046), 9 (1571723896595415047)]} 0 6
   [junit4]   2> 87667 INFO  (qtp1588610480-861) [    ] o.a.s.u.p.LogUpdateProcessorFactory [MissingSegmentRecoveryTest_shard1_replica1]  webapp=/solr path=/update params={wt=javabin&version=2}{add=[0 (1571723896588075008), 1 (1571723896594366464), 2 (1571723896595415040), 3 (1571723896595415041), 4 (1571723896595415042), 5 (1571723896595415043), 6 (1571723896595415044), 7 (1571723896595415045), 8 (1571723896595415046), 9 (1571723896595415047)]} 0 19
   [junit4]   2> 87673 INFO  (qtp536776047-876) [    ] o.a.s.u.DirectUpdateHandler2 start commit{,optimize=false,openSearcher=true,waitSearcher=true,expungeDeletes=false,softCommit=false,prepareCommit=false}
   [junit4]   2> 87673 INFO  (qtp536776047-876) [    ] o.a.s.u.SolrIndexWriter Calling setCommitData with IW:org.apache.solr.update.SolrIndexWriter@218a4718
   [junit4]   2> 87685 INFO  (qtp1588610480-865) [    ] o.a.s.u.DirectUpdateHandler2 start commit{,optimize=false,openSearcher=true,waitSearcher=true,expungeDeletes=false,softCommit=false,prepareCommit=false}
   [junit4]   2> 87685 INFO  (qtp1588610480-865) [    ] o.a.s.u.SolrIndexWriter Calling setCommitData with IW:org.apache.solr.update.SolrIndexWriter@6c827411
   [junit4]   2> 87717 INFO  (qtp536776047-876) [    ] o.a.s.s.SolrIndexSearcher Opening [Searcher@a11a2c3[MissingSegmentRecoveryTest_shard1_replica2] main]
   [junit4]   2> 87718 INFO  (searcherExecutor-445-thread-1) [    ] o.a.s.c.SolrCore [MissingSegmentRecoveryTest_shard1_replica2] Registered new searcher Searcher@a11a2c3[MissingSegmentRecoveryTest_shard1_replica2] main{ExitableDirectoryReader(UninvertingDirectoryReader(Uninverting(_0(6.7.0):C10)))}
   [junit4]   2> 87718 INFO  (qtp1588610480-865) [    ] o.a.s.s.SolrIndexSearcher Opening [Searcher@4de1b5a4[MissingSegmentRecoveryTest_shard1_replica1] main]
   [junit4]   2> 87719 INFO  (searcherExecutor-444-thread-1) [    ] o.a.s.c.SolrCore [MissingSegmentRecoveryTest_shard1_replica1] Registered new searcher Searcher@4de1b5a4[MissingSegmentRecoveryTest_shard1_replica1] main{ExitableDirectoryReader(UninvertingDirectoryReader(Uninverting(_0(6.7.0):C10)))}
   [junit4]   2> 87719 INFO  (qtp536776047-876) [    ] o.a.s.u.DirectUpdateHandler2 end_commit_flush
   [junit4]   2> 87719 INFO  (qtp536776047-876) [    ] o.a.s.u.p.LogUpdateProcessorFactory [MissingSegmentRecoveryTest_shard1_replica2]  webapp=/solr path=/update params={update.distrib=FROMLEADER&waitSearcher=true&openSearcher=true&commit=true&softCommit=false&distrib.from=http://127.0.0.1:62774/solr/MissingSegmentRecoveryTest_shard1_replica1/&commit_end_point=true&wt=javabin&version=2&expungeDeletes=false}{commit=} 0 47
   [junit4]   2> 87720 INFO  (qtp1588610480-865) [    ] o.a.s.u.DirectUpdateHandler2 end_commit_flush
   [junit4]   2> 87720 INFO  (qtp1588610480-865) [    ] o.a.s.u.p.LogUpdateProcessorFactory [MissingSegmentRecoveryTest_shard1_replica1]  webapp=/solr path=/update params={update.distrib=FROMLEADER&waitSearcher=true&openSearcher=true&commit=true&softCommit=false&distrib.from=http://127.0.0.1:62774/solr/MissingSegmentRecoveryTest_shard1_replica1/&commit_end_point=true&wt=javabin&version=2&expungeDeletes=false}{commit=} 0 35
   [junit4]   2> 87721 INFO  (qtp1588610480-866) [    ] o.a.s.u.p.LogUpdateProcessorFactory [MissingSegmentRecoveryTest_shard1_replica1]  webapp=/solr path=/update params={_stateVer_=MissingSegmentRecoveryTest:5&waitSearcher=true&commit=true&softCommit=false&wt=javabin&version=2}{commit=} 0 51
   [junit4]   2> 87724 INFO  (TEST-MissingSegmentRecoveryTest.testLeaderRecovery-seed#[8A6B78939B5D420B]) [    ] o.e.j.s.AbstractConnector Stopped ServerConnector@4abbdd8e{HTTP/1.1,[http/1.1]}{127.0.0.1:?}
   [junit4]   2> 87724 INFO  (TEST-MissingSegmentRecoveryTest.testLeaderRecovery-seed#[8A6B78939B5D420B]) [    ] o.a.s.c.CoreContainer Shutting down CoreContainer instance=2076622112
   [junit4]   2> 87724 INFO  (TEST-MissingSegmentRecoveryTest.testLeaderRecovery-seed#[8A6B78939B5D420B]) [    ] o.a.s.m.SolrMetricManager Closing metric reporters for: solr.node
   [junit4]   2> 87724 INFO  (TEST-MissingSegmentRecoveryTest.testLeaderRecovery-seed#[8A6B78939B5D420B]) [    ] o.a.s.m.SolrMetricManager Closing metric reporters for: solr.jvm
   [junit4]   2> 87724 INFO  (TEST-MissingSegmentRecoveryTest.testLeaderRecovery-seed#[8A6B78939B5D420B]) [    ] o.a.s.m.SolrMetricManager Closing metric reporters for: solr.jetty
   [junit4]   2> 87729 INFO  (coreCloseExecutor-454-thread-1) [    ] o.a.s.c.SolrCore [MissingSegmentRecoveryTest_shard1_replica2]  CLOSING SolrCore org.apache.solr.core.SolrCore@52e6ed9a
   [junit4]   2> 87733 INFO  (coreCloseExecutor-454-thread-1) [    ] o.a.s.m.SolrMetricManager Closing metric reporters for: solr.core.MissingSegmentRecoveryTest.shard1.replica2
   [junit4]   2> 87734 INFO  (TEST-MissingSegmentRecoveryTest.testLeaderRecovery-seed#[8A6B78939B5D420B]) [    ] o.a.s.c.Overseer Overseer (id=98232743305019397-127.0.0.1:62776_solr-n_0000000000) closing
   [junit4]   2> 87734 INFO  (OverseerStateUpdate-98232743305019397-127.0.0.1:62776_solr-n_0000000000) [    ] o.a.s.c.Overseer Overseer Loop exiting : 127.0.0.1:62776_solr
   [junit4]   2> 87736 WARN  (NIOServerCxn.Factory:0.0.0.0/0.0.0.0:0) [    ] o.a.z.s.NIOServerCnxn caught end of stream exception
   [junit4]   2> EndOfStreamException: Unable to read additional data from client sessionid 0x15cfe28da020005, likely client has closed socket
   [junit4]   2> 	at org.apache.zookeeper.server.NIOServerCnxn.doIO(NIOServerCnxn.java:239)
   [junit4]   2> 	at org.apache.zookeeper.server.NIOServerCnxnFactory.run(NIOServerCnxnFactory.java:203)
   [junit4]   2> 	at java.base/java.lang.Thread.run(Thread.java:844)
   [junit4]   2> 87736 WARN  (zkCallback-179-thread-1) [    ] o.a.s.c.c.ZkStateReader ZooKeeper watch triggered, but Solr cannot talk to ZK: [KeeperErrorCode = Session expired for /live_nodes]
   [junit4]   2> 87738 INFO  (TEST-MissingSegmentRecoveryTest.testLeaderRecovery-seed#[8A6B78939B5D420B]) [    ] o.e.j.s.h.ContextHandler Stopped o.e.j.s.ServletContextHandler@3425451f{/solr,null,UNAVAILABLE}
   [junit4]   2> 87738 INFO  (zkCallback-186-thread-1) [    ] o.a.s.c.c.ZkStateReader Updated live nodes from ZooKeeper... (2) -> (1)
   [junit4]   2> 87738 INFO  (zkCallback-180-thread-1) [    ] o.a.s.c.OverseerElectionContext I am going to be the leader 127.0.0.1:62774_solr
   [junit4]   2> 87738 INFO  (zkCallback-180-thread-2) [    ] o.a.s.c.c.ZkStateReader Updated live nodes from ZooKeeper... (2) -> (1)
   [junit4]   2> 87740 INFO  (TEST-MissingSegmentRecoveryTest.testLeaderRecovery-seed#[8A6B78939B5D420B]) [    ] o.e.j.s.Server jetty-9.3.14.v20161028
   [junit4]   2> 87741 INFO  (zkCallback-180-thread-1) [    ] o.a.s.c.Overseer Overseer (id=98232743305019398-127.0.0.1:62774_solr-n_0000000001) starting
   [junit4]   2> 87741 INFO  (TEST-MissingSegmentRecoveryTest.testLeaderRecovery-seed#[8A6B78939B5D420B]) [    ] o.e.j.s.h.ContextHandler Started o.e.j.s.ServletContextHandler@203247bc{/solr,null,AVAILABLE}
   [junit4]   2> 87743 INFO  (TEST-MissingSegmentRecoveryTest.testLeaderRecovery-seed#[8A6B78939B5D420B]) [    ] o.e.j.s.AbstractConnector Started ServerConnector@40cb58a9{HTTP/1.1,[http/1.1]}{127.0.0.1:?????}
   [junit4]   2> 87743 INFO  (TEST-MissingSegmentRecoveryTest.testLeaderRecovery-seed#[8A6B78939B5D420B]) [    ] o.e.j.s.Server Started @?????ms
   [junit4]   2> 87744 INFO  (TEST-MissingSegmentRecoveryTest.testLeaderRecovery-seed#[8A6B78939B5D420B]) [    ] o.a.s.c.s.e.JettySolrRunner Jetty properties: {hostContext=/solr, hostPort=62776}
   [junit4]   2> 87744 ERROR (TEST-MissingSegmentRecoveryTest.testLeaderRecovery-seed#[8A6B78939B5D420B]) [    ] o.a.s.s.StartupLoggingUtils Missing Java Option solr.log.dir. Logging may be missing or incomplete.
   [junit4]   2> 87744 INFO  (TEST-MissingSegmentRecoveryTest.testLeaderRecovery-seed#[8A6B78939B5D420B]) [    ] o.a.s.s.SolrDispatchFilter  ___      _       Welcome to Apache Solr? version 6.7.0
   [junit4]   2> 87744 INFO  (TEST-MissingSegmentRecoveryTest.testLeaderRecovery-seed#[8A6B78939B5D420B]) [    ] o.a.s.s.SolrDispatchFilter / __| ___| |_ _   Starting in cloud mode on port null
   [junit4]   2> 87744 INFO  (TEST-MissingSegmentRecoveryTest.testLeaderRecovery-seed#[8A6B78939B5D420B]) [    ] o.a.s.s.SolrDispatchFilter \__ \/ _ \ | '_|  Install dir: null
   [junit4]   2> 87744 INFO  (TEST-MissingSegmentRecoveryTest.testLeaderRecovery-seed#[8A6B78939B5D420B]) [    ] o.a.s.s.SolrDispatchFilter |___/\___/_|_|    Start time: 2017-07-01T12:38:32.754897500Z
   [junit4]   2> 87752 INFO  (TEST-MissingSegmentRecoveryTest.testLeaderRecovery-seed#[8A6B78939B5D420B]) [    ] o.a.s.s.SolrDispatchFilter solr.xml found in ZooKeeper. Loading...
   [junit4]   2> 87757 WARN  (NIOServerCxn.Factory:0.0.0.0/0.0.0.0:0) [    ] o.a.z.s.NIOServerCnxn caught end of stream exception
   [junit4]   2> EndOfStreamException: Unable to read additional data from client sessionid 0x15cfe28da020009, likely client has closed socket
   [junit4]   2> 	at org.apache.zookeeper.server.NIOServerCnxn.doIO(NIOServerCnxn.java:239)
   [junit4]   2> 	at org.apache.zookeeper.server.NIOServerCnxnFactory.run(NIOServerCnxnFactory.java:203)
   [junit4]   2> 	at java.base/java.lang.Thread.run(Thread.java:844)
   [junit4]   2> 87758 INFO  (zkCallback-180-thread-1) [    ] o.a.s.c.c.ZkStateReader A cluster state change: [WatchedEvent state:SyncConnected type:NodeDataChanged path:/collections/MissingSegmentRecoveryTest/state.json] for collection [MissingSegmentRecoveryTest] has occurred - updating... (live nodes size: [1])
   [junit4]   2> 87759 INFO  (TEST-MissingSegmentRecoveryTest.testLeaderRecovery-seed#[8A6B78939B5D420B]) [    ] o.a.s.u.UpdateShardHandler Creating UpdateShardHandler HTTP client with params: socketTimeout=340000&connTimeout=45000&retry=true
   [junit4]   2> 87760 INFO  (TEST-MissingSegmentRecoveryTest.testLeaderRecovery-seed#[8A6B78939B5D420B]) [    ] o.a.s.c.ZkContainer Zookeeper client=127.0.0.1:62769/solr
   [junit4]   2> 87764 WARN  (NIOServerCxn.Factory:0.0.0.0/0.0.0.0:0) [    ] o.a.z.s.NIOServerCnxn caught end of stream exception
   [junit4]   2> EndOfStreamException: Unable to read additional data from client sessionid 0x15cfe28da02000a, likely client has closed socket
   [junit4]   2> 	at org.apache.zookeeper.server.NIOServerCnxn.doIO(NIOServerCnxn.java:239)
   [junit4]   2> 	at org.apache.zookeeper.server.NIOServerCnxnFactory.run(NIOServerCnxnFactory.java:203)
   [junit4]   2> 	at java.base/java.lang.Thread.run(Thread.java:844)
   [junit4]   2> 87774 INFO  (TEST-MissingSegmentRecoveryTest.testLeaderRecovery-seed#[8A6B78939B5D420B]) [    ] o.a.s.c.c.ZkStateReader Updated live nodes from ZooKeeper... (0) -> (1)
   [junit4]   2> 87776 INFO  (TEST-MissingSegmentRecoveryTest.testLeaderRecovery-seed#[8A6B78939B5D420B]) [    ] o.a.s.c.Overseer Overseer (id=null) closing
   [junit4]   2> 87778 INFO  (TEST-MissingSegmentRecoveryTest.testLeaderRecovery-seed#[8A6B78939B5D420B]) [    ] o.a.s.c.ZkController Register node as live in ZooKeeper:/live_nodes/127.0.0.1:62776_solr
   [junit4]   2> 87795 INFO  (zkCallback-186-thread-1) [    ] o.a.s.c.c.ZkStateReader Updated live nodes from ZooKeeper... (1) -> (2)
   [junit4]   2> 87795 INFO  (zkCallback-191-thread-1) [    ] o.a.s.c.c.ZkStateReader Updated live nodes from ZooKeeper... (1) -> (2)
   [junit4]   2> 87795 INFO  (zkCallback-180-thread-1) [    ] o.a.s.c.c.ZkStateReader Updated live nodes from ZooKeeper... (1) -> (2)
   [junit4]   2> 87852 INFO  (TEST-MissingSegmentRecoveryTest.testLeaderRecovery-seed#[8A6B78939B5D420B]) [    ] o.a.s.c.CorePropertiesLocator Found 1 core definitions underneath C:\Users\jenkins\workspace\Lucene-Solr-6.x-Windows\solr\build\solr-core\test\J1\temp\solr.cloud.MissingSegmentRecoveryTest_8A6B78939B5D420B-001\tempDir-001\node1\.
   [junit4]   2> 87852 INFO  (TEST-MissingSegmentRecoveryTest.testLeaderRecovery-seed#[8A6B78939B5D420B]) [    ] o.a.s.c.CorePropertiesLocator Cores are: [MissingSegmentRecoveryTest_shard1_replica2]
   [junit4]   2> 87864 INFO  (coreLoadExecutor-463-thread-1) [    ] o.a.s.c.TransientSolrCoreCacheDefault Allocating transient cache for 2147483647 transient cores
   [junit4]   2> 87877 INFO  (coreLoadExecutor-463-thread-1) [    ] o.a.s.c.SolrConfig Using Lucene MatchVersion: 6.7.0
   [junit4]   2> 87888 INFO  (coreLoadExecutor-463-thread-1) [    ] o.a.s.s.IndexSchema [MissingSegmentRecoveryTest_shard1_replica2] Schema name=minimal
   [junit4]   2> 87889 INFO  (coreLoadExecutor-463-thread-1) [    ] o.a.s.s.IndexSchema Loaded schema minimal/1.1 with uniqueid field id
   [junit4]   2> 87889 INFO  (coreLoadExecutor-463-thread-1) [    ] o.a.s.c.CoreContainer Creating SolrCore 'MissingSegmentRecoveryTest_shard1_replica2' using configuration from collection MissingSegmentRecoveryTest, trusted=true
   [junit4]   2> 87889 INFO  (coreLoadExecutor-463-thread-1) [    ] o.a.s.c.SolrCore solr.RecoveryStrategy.Builder
   [junit4]   2> 87889 INFO  (coreLoadExecutor-463-thread-1) [    ] o.a.s.c.SolrCore [[MissingSegmentRecoveryTest_shard1_replica2] ] Opening new SolrCore at [C:\Users\jenkins\workspace\Lucene-Solr-6.x-Windows\solr\build\solr-core\test\J1\temp\solr.cloud.MissingSegmentRecoveryTest_8A6B78939B5D420B-001\tempDir-001\node1\MissingSegmentRecoveryTest_shard1_replica2], dataDir=[C:\Users\jenkins\workspace\Lucene-Solr-6.x-Windows\solr\build\solr-core\test\J1\temp\solr.cloud.MissingSegmentRecoveryTest_8A6B78939B5D420B-001\tempDir-001\node1\.\MissingSegmentRecoveryTest_shard1_replica2\data\]
   [junit4]   2> 87943 INFO  (coreLoadExecutor-463-thread-1) [    ] o.a.s.u.UpdateHandler Using UpdateLog implementation: org.apache.solr.update.UpdateLog
   [junit4]   2> 87943 INFO  (coreLoadExecutor-463-thread-1) [    ] o.a.s.u.UpdateLog Initializing UpdateLog: dataDir=null defaultSyncLevel=FLUSH numRecordsToKeep=100 maxNumLogsToKeep=10 numVersionBuckets=65536
   [junit4]   2> 87945 INFO  (coreLoadExecutor-463-thread-1) [    ] o.a.s.u.CommitTracker Hard AutoCommit: disabled
   [junit4]   2> 87945 INFO  (coreLoadExecutor-463-thread-1) [    ] o.a.s.u.CommitTracker Soft AutoCommit: disabled
   [junit4]   2> 87949 INFO  (coreLoadExecutor-463-thread-1) [    ] o.a.s.c.SolrCore [MissingSegmentRecoveryTest_shard1_replica2]  CLOSING SolrCore org.apache.solr.core.SolrCore@4c75b7ec
   [junit4]   2> 87949 INFO  (coreLoadExecutor-463-thread-1) [    ] o.a.s.m.SolrMetricManager Closing metric reporters for: solr.core.MissingSegmentRecoveryTest.shard1.replica2
   [junit4]   2> 87950 INFO  (coreLoadExecutor-463-thread-1) [    ] o.a.s.c.CoreContainer Found active leader, will attempt to create fresh core and recover.
   [junit4]   2> 87951 INFO  (coreLoadExecutor-463-thread-1) [    ] o.a.s.c.SolrCore Updating index properties... index=index.20170701143832960
   [junit4]   2> 87953 INFO  (coreLoadExecutor-463-thread-1) [    ] o.a.s.c.SolrCore solr.RecoveryStrategy.Builder
   [junit4]   2> 87953 INFO  (coreLoadExecutor-463-thread-1) [    ] o.a.s.c.SolrCore [[MissingSegmentRecoveryTest_shard1_replica2] ] Opening new SolrCore at [C:\Users\jenkins\workspace\Lucene-Solr-6.x-Windows\solr\build\solr-core\test\J1\temp\solr.cloud.MissingSegmentRecoveryTest_8A6B78939B5D420B-001\tempDir-001\node1\MissingSegmentRecoveryTest_shard1_replica2], dataDir=[C:\Users\jenkins\workspace\Lucene-Solr-6.x-Windows\solr\build\solr-core\test\J1\temp\solr.cloud.MissingSegmentRecoveryTest_8A6B78939B5D420B-001\tempDir-001\node1\.\MissingSegmentRecoveryTest_shard1_replica2\data\]
   [junit4]   2> 87962 INFO  (OldIndexDirectoryCleanupThreadForCore-MissingSegmentRecoveryTest_shard1_replica2) [    ] o.a.s.c.DirectoryFactory Found 1 old index directories to clean-up under C:\Users\jenkins\workspace\Lucene-Solr-6.x-Windows\solr\build\solr-core\test\J1\temp\solr.cloud.MissingSegmentRecoveryTest_8A6B78939B5D420B-001\tempDir-001\node1\.\MissingSegmentRecoveryTest_shard1_replica2\data\ afterReload=false
   [junit4]   2> 87965 INFO  (OldIndexDirectoryCleanupThreadForCore-MissingSegmentRecoveryTest_shard1_replica2) [    ] o.a.s.c.DirectoryFactory Deleted old index directory: C:\Users\jenkins\workspace\Lucene-Solr-6.x-Windows\solr\build\solr-core\test\J1\temp\solr.cloud.MissingSegmentRecoveryTest_8A6B78939B5D420B-001\tempDir-001\node1\.\MissingSegmentRecoveryTest_shard1_replica2\data\index.20170701143832960
   [junit4]   2> 88014 INFO  (coreLoadExecutor-463-thread-1) [    ] o.a.s.u.UpdateHandler Using UpdateLog implementation: org.apache.solr.update.UpdateLog
   [junit4]   2> 88014 INFO  (coreLoadExecutor-463-thread-1) [    ] o.a.s.u.UpdateLog Initializing UpdateLog: dataDir=null defaultSyncLevel=FLUSH numRecordsToKeep=100 maxNumLogsToKeep=10 numVersionBuckets=65536
   [junit4]   2> 88015 INFO  (coreLoadExecutor-463-thread-1) [    ] o.a.s.u.CommitTracker Hard AutoCommit: disabled
   [junit4]   2> 88015 INFO  (coreLoadExecutor-463-thread-1) [    ] o.a.s.u.CommitTracker Soft AutoCommit: disabled
   [junit4]   2> 88016 INFO  (OldIndexDirectoryCleanupThreadForCore-MissingSegmentRecoveryTest_shard1_replica2) [    ] o.a.s.c.DirectoryFactory Found 1 old index directories to clean-up under C:\Users\jenkins\workspace\Lucene-Solr-6.x-Windows\solr\build\solr-core\test\J1\temp\solr.cloud.MissingSegmentRecoveryTest_8A6B78939B5D420B-001\tempDir-001\node1\.\MissingSegmentRecoveryTest_shard1_replica2\data\ afterReload=false
   [junit4]   2> 88022 INFO  (OldIndexDirectoryCleanupThreadForCore-MissingSegmentRecoveryTest_shard1_replica2) [    ] o.a.s.c.DirectoryFactory Deleted old index directory: C:\Users\jenkins\workspace\Lucene-Solr-6.x-Windows\solr\build\solr-core\test\J1\temp\solr.cloud.MissingSegmentRecoveryTest_8A6B78939B5D420B-001\tempDir-001\node1\.\MissingSegmentRecoveryTest_shard1_replica2\data\index
   [junit4]   2> 88024 INFO  (zkCallback-191-thread-1) [    ] o.a.s.c.c.ZkStateReader A cluster state change: [WatchedEvent state:SyncConnected type:NodeDataChanged path:/collections/MissingSegmentRecoveryTest/state.json] for collection [MissingSegmentRecoveryTest] has occurred - updating... (live nodes size: [2])
   [junit4]   2> 88025 INFO  (zkCallback-180-thread-1) [    ] o.a.s.c.c.ZkStateReader A cluster state change: [WatchedEvent state:SyncConnected type:NodeDataChanged path:/collections/MissingSegmentRecoveryTest/state.json] for collection [MissingSegmentRecoveryTest] has occurred - updating... (live nodes size: [2])
   [junit4]   2> 88030 INFO  (coreLoadExecutor-463-thread-1) [    ] o.a.s.c.SolrCore [MissingSegmentRecoveryTest_shard1_replica2]  CLOSING SolrCore org.apache.solr.core.SolrCore@d91cb29
   [junit4]   2> 88031 INFO  (coreLoadExecutor-463-thread-1) [    ] o.a.s.m.SolrMetricManager Closing metric reporters for: solr.core.MissingSegmentRecoveryTest.shard1.replica2
   [junit4]   2> 88031 ERROR (coreContainerWorkExecutor-458-thread-1) [    ] o.a.s.c.CoreContainer Error waiting for SolrCore to be created
   [junit4]   2> java.util.concurrent.ExecutionException: org.apache.solr.common.SolrException: Unable to create core [MissingSegmentRecoveryTest_shard1_replica2]
   [junit4]   2> 	at java.base/java.util.concurrent.FutureTask.report(FutureTask.java:122)
   [junit4]   2> 	at java.base/java.util.concurrent.FutureTask.get(FutureTask.java:191)
   [junit4]   2> 	at org.apache.solr.core.CoreContainer.lambda$load$6(CoreContainer.java:592)
   [junit4]   2> 	at com.codahale.metrics.InstrumentedExecutorService$InstrumentedRunnable.run(InstrumentedExecutorService.java:176)
   [junit4]   2> 	at java.base/java.util.concurrent.Executors$RunnableAdapter.call(Executors.java:514)
   [junit4]   2> 	at java.base/java.util.concurrent.FutureTask.run(FutureTask.java:264)
   [junit4]   2> 	at org.apache.solr.common.util.ExecutorUtil$MDCAwareThreadPoolExecutor.lambda$execute$0(ExecutorUtil.java:229)
   [junit4]   2> 	at java.base/java.util.concurrent.ThreadPoolExecutor.runWorker(ThreadPoolExecutor.java:1161)
   [junit4]   2> 	at java.base/java.util.concurrent.ThreadPoolExecutor$Worker.run(ThreadPoolExecutor.java:635)
   [junit4]   2> 	at java.base/java.lang.Thread.run(Thread.java:844)
   [junit4]   2> Caused by: org.apache.solr.common.SolrException: Unable to create core [MissingSegmentRecoveryTest_shard1_replica2]
   [junit4]   2> 	at org.apache.solr.core.CoreContainer.create(CoreContainer.java:936)
   [junit4]   2> 	at org.apache.solr.core.CoreContainer.lambda$load$5(CoreContainer.java:564)
   [junit4]   2> 	at com.codahale.metrics.InstrumentedExecutorService$InstrumentedCallable.call(InstrumentedExecutorService.java:197)
   [junit4]   2> 	... 5 more
   [junit4]   2> Caused by: org.apache.solr.common.SolrException: Error opening new searcher
   [junit4]   2> 	at org.apache.solr.core.SolrCore.<init>(SolrCore.java:977)
   [junit4]   2> 	at org.apache.solr.core.SolrCore.<init>(SolrCore.java:830)
   [junit4]   2> 	at org.apache.solr.core.CoreContainer.processCoreCreateException(CoreContainer.java:996)
   [junit4]   2> 	at org.apache.solr.core.CoreContainer.create(CoreContainer.java:922)
   [junit4]   2> 	... 7 more
   [junit4]   2> 	Suppressed: org.apache.solr.common.SolrException: Error opening new searcher
   [junit4]   2> 		at org.apache.solr.core.SolrCore.<init>(SolrCore.java:977)
   [junit4]   2> 		at org.apache.solr.core.SolrCore.<init>(SolrCore.java:830)
   [junit4]   2> 		at org.apache.solr.core.CoreContainer.create(CoreContainer.java:920)
   [junit4]   2> 		... 7 more
   [junit4]   2> 	Caused by: org.apache.solr.common.SolrException: Error opening new searcher
   [junit4]   2> 		at org.apache.solr.core.SolrCore.openNewSearcher(SolrCore.java:2069)
   [junit4]   2> 		at org.apache.solr.core.SolrCore.getSearcher(SolrCore.java:2189)
   [junit4]   2> 		at org.apache.solr.core.SolrCore.initSearcher(SolrCore.java:1071)
   [junit4]   2> 		at org.apache.solr.core.SolrCore.<init>(SolrCore.java:949)
   [junit4]   2> 		... 9 more
   [junit4]   2> 	Caused by: org.apache.lucene.index.CorruptIndexException: Unexpected file read error while reading index. (resource=BufferedChecksumIndexInput(MMapIndexInput(path="C:\Users\jenkins\workspace\Lucene-Solr-6.x-Windows\solr\build\solr-core\test\J1\temp\solr.cloud.MissingSegmentRecoveryTest_8A6B78939B5D420B-001\tempDir-001\node1\MissingSegmentRecoveryTest_shard1_replica2\data\index\segments_2")))
   [junit4]   2> 		at org.apache.lucene.index.SegmentInfos.readCommit(SegmentInfos.java:290)
   [junit4]   2> 		at org.apache.lucene.index.IndexWriter.<init>(IndexWriter.java:930)
   [junit4]   2> 		at org.apache.solr.update.SolrIndexWriter.<init>(SolrIndexWriter.java:118)
   [junit4]   2> 		at org.apache.solr.update.SolrIndexWriter.create(SolrIndexWriter.java:93)
   [junit4]   2> 		at org.apache.solr.update.DefaultSolrCoreState.createMainIndexWriter(DefaultSolrCoreState.java:248)
   [junit4]   2> 		at org.apache.solr.update.DefaultSolrCoreState.getIndexWriter(DefaultSolrCoreState.java:122)
   [junit4]   2> 		at org.apache.solr.core.SolrCore.openNewSearcher(SolrCore.java:2030)
   [junit4]   2> 		... 12 more
   [junit4]   2> 	Caused by: java.io.EOFException: read past EOF: MMapIndexInput(path="C:\Users\jenkins\workspace\Lucene-Solr-6.x-Windows\solr\build\solr-core\test\J1\temp\solr.cloud.MissingSegmentRecoveryTest_8A6B78939B5D420B-001\tempDir-001\node1\MissingSegmentRecoveryTest_shard1_replica2\data\index\segments_2")
   [junit4]   2> 		at org.apache.lucene.store.ByteBufferIndexInput.readByte(ByteBufferIndexInput.java:75)
   [junit4]   2> 		at org.apache.lucene.store.BufferedChecksumIndexInput.readByte(BufferedChecksumIndexInput.java:41)
   [junit4]   2> 		at org.apache.lucene.store.DataInput.readInt(DataInput.java:101)
   [junit4]   2> 		at org.apache.lucene.index.SegmentInfos.readCommit(SegmentInfos.java:300)
   [junit4]   2> 		at org.apache.lucene.index.SegmentInfos.readCommit(SegmentInfos.java:288)
   [junit4]   2> 		... 18 more
   [junit4]   2> Caused by: org.apache.solr.common.SolrException: Error opening new searcher
   [junit4]   2> 	at org.apache.solr.core.SolrCore.openNewSearcher(SolrCore.java:2069)
   [junit4]   2> 	at org.apache.solr.core.SolrCore.getSearcher(SolrCore.java:2189)
   [junit4]   2> 	at org.apache.solr.core.SolrCore.initSearcher(SolrCore.java:1071)
   [junit4]   2> 	at org.apache.solr.core.SolrCore.<init>(SolrCore.java:949)
   [junit4]   2> 	... 10 more
   [junit4]   2> Caused by: org.apache.lucene.index.IndexNotFoundException: no segments* file found in LockValidatingDirectoryWrapper(MMapDirectory@C:\Users\jenkins\workspace\Lucene-Solr-6.x-Windows\solr\build\solr-core\test\J1\temp\solr.cloud.MissingSegmentRecoveryTest_8A6B78939B5D420B-001\tempDir-001\node1\MissingSegmentRecoveryTest_shard1_replica2\data\index.20170701143832960 lockFactory=org.apache.lucene.store.NativeFSLockFactory@2cd4ff82): files: [write.lock]
   [junit4]   2> 	at org.apache.lucene.index.IndexWriter.<init>(IndexWriter.java:925)
   [junit4]   2> 	at org.apache.solr.update.SolrIndexWriter.<init>(SolrIndexWriter.java:118)
   [junit4]   2> 	at org.apache.solr.update.SolrIndexWriter.create(SolrIndexWriter.java:93)
   [junit4]   2> 	at org.apache.solr.update.DefaultSolrCoreState.createMainIndexWriter(DefaultSolrCoreState.java:248)
   [junit4]   2> 	at org.apache.solr.update.DefaultSolrCoreState.getIndexWriter(DefaultSolrCoreState.java:122)
   [junit4]   2> 	at org.apache.solr.core.SolrCore.openNewSearcher(SolrCore.java:2030)
   [junit4]   2> 	... 13 more
   [junit4]   2> 178369 INFO  (qtp568421132-940) [    ] o.a.s.h.a.CollectionsHandler Invoked Collection Action :delete with params name=MissingSegmentRecoveryTest&action=DELETE&wt=javabin&version=2 and sendToOCPQueue=true
   [junit4]   2> 178374 INFO  (OverseerThreadFactory-461-thread-1) [    ] o.a.s.c.OverseerCollectionMessageHandler Executing Collection Cmd : action=UNLOAD&deleteInstanceDir=true&deleteDataDir=true
   [junit4]   2> 178378 INFO  (qtp1588610480-871) [    ] o.a.s.m.SolrMetricManager Closing metric reporters for: solr.core.MissingSegmentRecoveryTest.shard1.replica1
   [junit4]   2> 178378 INFO  (qtp1588610480-871) [    ] o.a.s.c.SolrCore [MissingSegmentRecoveryTest_shard1_replica1]  CLOSING SolrCore org.apache.solr.core.SolrCore@4cc1d00
   [junit4]   2> 178381 INFO  (qtp1588610480-871) [    ] o.a.s.m.SolrMetricManager Closing metric reporters for: solr.core.MissingSegmentRecoveryTest.shard1.replica1
   [junit4]   2> 178383 INFO  (qtp568421132-945) [    ] o.a.s.s.HttpSolrCall [admin] webapp=null path=/admin/cores params={deleteInstanceDir=true&core=MissingSegmentRecoveryTest_shard1_replica2&qt=/admin/cores&deleteDataDir=true&action=UNLOAD&wt=javabin&version=2} status=0 QTime=6
   [junit4]   2> 178395 INFO  (qtp1588610480-871) [    ] o.a.s.s.HttpSolrCall [admin] webapp=null path=/admin/cores params={deleteInstanceDir=true&core=MissingSegmentRecoveryTest_shard1_replica1&qt=/admin/cores&deleteDataDir=true&action=UNLOAD&wt=javabin&version=2} status=0 QTime=17
   [junit4]   2> 178397 INFO  (zkCallback-191-thread-2) [    ] o.a.s.c.c.ZkStateReader A cluster state change: [WatchedEvent state:SyncConnected type:NodeDataChanged path:/collections/MissingSegmentRecoveryTest/state.json] for collection [MissingSegmentRecoveryTest] has occurred - updating... (live nodes size: [2])
   [junit4]   2> 178507 INFO  (zkCallback-191-thread-2) [    ] o.a.s.c.c.ZkStateReader A cluster state change: [WatchedEvent state:SyncConnected type:NodeDeleted path:/collections/MissingSegmentRecoveryTest/state.json] for collection [MissingSegmentRecoveryTest] has occurred - updating... (live nodes size: [2])
   [junit4]   2> 179103 INFO  (qtp568421132-940) [    ] o.a.s.s.HttpSolrCall [admin] webapp=null path=/admin/collections params={name=MissingSegmentRecoveryTest&action=DELETE&wt=javabin&version=2} status=0 QTime=734
   [junit4]   2> 179104 INFO  (TEST-MissingSegmentRecoveryTest.testLeaderRecovery-seed#[8A6B78939B5D420B]) [    ] o.a.s.SolrTestCaseJ4 ###Ending testLeaderRecovery
   [junit4]   2> NOTE: reproduce with: ant test  -Dtestcase=MissingSegmentRecoveryTest -Dtests.method=testLeaderRecovery -Dtests.seed=8A6B78939B5D420B -Dtests.slow=true -Dtests.locale=mzn-IR -Dtests.timezone=Africa/Maseru -Dtests.asserts=true -Dtests.file.encoding=US-ASCII
   [junit4] FAILURE 94.7s J1 | MissingSegmentRecoveryTest.testLeaderRecovery <<<
   [junit4]    > Throwable #1: java.lang.AssertionError: Expected a collection with one shard and two replicas
   [junit4]    > null
   [junit4]    > Last available state: DocCollection(MissingSegmentRecoveryTest//collections/MissingSegmentRecoveryTest/state.json/7)={
   [junit4]    >   "replicationFactor":"2",
   [junit4]    >   "shards":{"shard1":{
   [junit4]    >       "range":"80000000-7fffffff",
   [junit4]    >       "state":"active",
   [junit4]    >       "replicas":{
   [junit4]    >         "core_node1":{
   [junit4]    >           "core":"MissingSegmentRecoveryTest_shard1_replica2",
   [junit4]    >           "base_url":"http://127.0.0.1:62776/solr",
   [junit4]    >           "node_name":"127.0.0.1:62776_solr",
   [junit4]    >           "state":"down"},
   [junit4]    >         "core_node2":{
   [junit4]    >           "core":"MissingSegmentRecoveryTest_shard1_replica1",
   [junit4]    >           "base_url":"http://127.0.0.1:62774/solr",
   [junit4]    >           "node_name":"127.0.0.1:62774_solr",
   [junit4]    >           "state":"active",
   [junit4]    >           "leader":"true"}}}},
   [junit4]    >   "router":{"name":"compositeId"},
   [junit4]    >   "maxShardsPerNode":"1",
   [junit4]    >   "autoAddReplicas":"false"}
   [junit4]    > 	at __randomizedtesting.SeedInfo.seed([8A6B78939B5D420B:DA3EE090C27CF416]:0)
   [junit4]    > 	at org.apache.solr.cloud.SolrCloudTestCase.waitForState(SolrCloudTestCase.java:265)
   [junit4]    > 	at org.apache.solr.cloud.MissingSegmentRecoveryTest.testLeaderRecovery(MissingSegmentRecoveryTest.java:105)
   [junit4]    > 	at java.base/jdk.internal.reflect.NativeMethodAccessorImpl.invoke0(Native Method)
   [junit4]    > 	at java.base/jdk.internal.reflect.NativeMethodAccessorImpl.invoke(NativeMethodAccessorImpl.java:62)
   [junit4]    > 	at java.base/jdk.internal.reflect.DelegatingMethodAccessorImpl.invoke(DelegatingMethodAccessorImpl.java:43)
   [junit4]    > 	at java.base/java.lang.reflect.Method.invoke(Method.java:564)
   [junit4]    > 	at java.base/java.lang.Thread.run(Thread.java:844)
   [junit4]   2> 179107 INFO  (jetty-closer-169-thread-1) [    ] o.e.j.s.AbstractConnector Stopped ServerConnector@40cb58a9{HTTP/1.1,[http/1.1]}{127.0.0.1:?????}
   [junit4]   2> 179108 INFO  (jetty-closer-169-thread-1) [    ] o.a.s.c.CoreContainer Shutting down CoreContainer instance=53905882
   [junit4]   2> 179108 INFO  (jetty-closer-169-thread-1) [    ] o.a.s.m.SolrMetricManager Closing metric reporters for: solr.node
   [junit4]   2> 179108 INFO  (jetty-closer-169-thread-1) [    ] o.a.s.m.SolrMetricManager Closing metric reporters for: solr.jvm
   [junit4]   2> 179108 INFO  (jetty-closer-169-thread-1) [    ] o.a.s.m.SolrMetricManager Closing metric reporters for: solr.jetty
   [junit4]   2> 179108 INFO  (jetty-closer-169-thread-2) [    ] o.e.j.s.AbstractConnector Stopped ServerConnector@5d68d7e4{HTTP/1.1,[http/1.1]}{127.0.0.1:?}
   [junit4]   2> 179109 INFO  (jetty-closer-169-thread-2) [    ] o.a.s.c.CoreContainer Shutting down CoreContainer instance=1069038557
   [junit4]   2> 179109 INFO  (jetty-closer-169-thread-2) [    ] o.a.s.m.SolrMetricManager Closing metric reporters for: solr.node
   [junit4]   2> 179109 INFO  (jetty-closer-169-thread-2) [    ] o.a.s.m.SolrMetricManager Closing metric reporters for: solr.jvm
   [junit4]   2> 179109 INFO  (jetty-closer-169-thread-2) [    ] o.a.s.m.SolrMetricManager Closing metric reporters for: solr.jetty
   [junit4]   2> 179112 INFO  (jetty-closer-169-thread-2) [    ] o.a.s.c.Overseer Overseer (id=98232743305019398-127.0.0.1:62774_solr-n_0000000001) closing
   [junit4]   2> 179112 INFO  (OverseerStateUpdate-98232743305019398-127.0.0.1:62774_solr-n_0000000001) [    ] o.a.s.c.Overseer Overseer Loop exiting : 127.0.0.1:62774_solr
   [junit4]   2> 179113 WARN  (NIOServerCxn.Factory:0.0.0.0/0.0.0.0:0) [    ] o.a.z.s.NIOServerCnxn caught end of stream exception
   [junit4]   2> EndOfStreamException: Unable to read additional data from client sessionid 0x15cfe28da02000b, likely client has closed socket
   [junit4]   2> 	at org.apache.zookeeper.server.NIOServerCnxn.doIO(NIOServerCnxn.java:239)
   [junit4]   2> 	at org.apache.zookeeper.server.NIOServerCnxnFactory.run(NIOServerCnxnFactory.java:203)
   [junit4]   2> 	at java.base/java.lang.Thread.run(Thread.java:844)
   [junit4]   2> 179113 WARN  (zkCallback-191-thread-2) [    ] o.a.s.c.c.ZkStateReader ZooKeeper watch triggered, but Solr cannot talk to ZK: [KeeperErrorCode = Session expired for /live_nodes]
   [junit4]   2> 179114 INFO  (jetty-closer-169-thread-1) [    ] o.e.j.s.h.ContextHandler Stopped o.e.j.s.ServletContextHandler@203247bc{/solr,null,UNAVAILABLE}
   [junit4]   2> 180613 WARN  (zkCallback-180-thread-3) [    ] o.a.s.c.c.ZkStateReader ZooKeeper watch triggered, but Solr cannot talk to ZK: [KeeperErrorCode = Session expired for /live_nodes]
   [junit4]   2> 180614 INFO  (jetty-closer-169-thread-2) [    ] o.e.j.s.h.ContextHandler Stopped o.e.j.s.ServletContextHandler@4ab9663c{/solr,null,UNAVAILABLE}
   [junit4]   2> 180615 ERROR (SUITE-MissingSegmentRecoveryTest-seed#[8A6B78939B5D420B]-worker) [    ] o.a.z.s.ZooKeeperServer ZKShutdownHandler is not registered, so ZooKeeper server won't take any action on ERROR or SHUTDOWN server state changes
   [junit4]   2> 180615 INFO  (SUITE-MissingSegmentRecoveryTest-seed#[8A6B78939B5D420B]-worker) [    ] o.a.s.c.ZkTestServer connecting to 127.0.0.1:62769 62769
   [junit4]   2> 180616 INFO  (Thread-199) [    ] o.a.s.c.ZkTestServer connecting to 127.0.0.1:62769 62769
   [junit4]   2> 180617 WARN  (Thread-199) [    ] o.a.s.c.ZkTestServer Watch limit violations: 
   [junit4]   2> Maximum concurrent create/delete watches above limit:
   [junit4]   2> 
   [junit4]   2> 	4	/solr/aliases.json
   [junit4]   2> 	4	/solr/clusterprops.json
   [junit4]   2> 	3	/solr/security.json
   [junit4]   2> 	2	/solr/configs/conf
   [junit4]   2> 
   [junit4]   2> Maximum concurrent data watches above limit:
   [junit4]   2> 
   [junit4]   2> 	4	/solr/clusterstate.json
   [junit4]   2> 	4	/solr/collections/MissingSegmentRecoveryTest/state.json
   [junit4]   2> 
   [junit4]   2> Maximum concurrent children watches above limit:
   [junit4]   2> 
   [junit4]   2> 	4	/solr/collections
   [junit4]   2> 	3	/solr/live_nodes
   [junit4]   2> 	2	/solr/overseer/queue
   [junit4]   2> 	2	/solr/overseer/collection-queue-work
   [junit4]   2> 
   [junit4]   2> 180617 INFO  (SUITE-MissingSegmentRecoveryTest-seed#[8A6B78939B5D420B]-worker) [    ] o.a.s.SolrTestCaseJ4 ###deleteCore
   [junit4]   2> NOTE: leaving temporary files on disk at: C:\Users\jenkins\workspace\Lucene-Solr-6.x-Windows\solr\build\solr-core\test\J1\temp\solr.cloud.MissingSegmentRecoveryTest_8A6B78939B5D420B-001
   [junit4]   2> Jul 01, 2017 12:40:05 PM com.carrotsearch.randomizedtesting.ThreadLeakControl checkThreadLeaks
   [junit4]   2> WARNING: Will linger awaiting termination of 1 leaked thread(s).
   [junit4]   2> NOTE: test params are: codec=Asserting(Lucene62): {_version_=FSTOrd50, id=Lucene50(blocksize=128)}, docValues:{}, maxPointsInLeafNode=1377, maxMBSortInHeap=6.18704654017543, sim=RandomSimilarity(queryNorm=false,coord=yes): {}, locale=mzn-IR, timezone=Africa/Maseru
   [junit4]   2> NOTE: Windows 10 10.0 amd64/Oracle Corporation 9-ea (64-bit)/cpus=3,threads=1,free=20425616,total=133062656
   [junit4]   2> NOTE: All tests run in this JVM: [TestSweetSpotSimilarityFactory, BadIndexSchemaTest, TestBinaryResponseWriter, TestSchemalessBufferedUpdates, CdcrBootstrapTest, TestClusterProperties, TestSolr4Spatial, TestJsonRequest, DebugComponentTest, CurrencyFieldTypeTest, TestSolrJ, TestConfigSetProperties, TestFastLRUCache, TestCollationField, ShowFileRequestHandlerTest, TestFieldTypeCollectionResource, TestUseDocValuesAsStored2, SystemInfoHandlerTest, CachingDirectoryFactoryTest, TestShardHandlerFactory, TestHighFrequencyDictionaryFactory, MissingSegmentRecoveryTest]
   [junit4] Completed [62/713 (1!)] on J1 in 97.10s, 1 test, 1 failure <<< FAILURES!

[...truncated 831 lines...]
   [junit4] Suite: org.apache.solr.cloud.TestCloudRecovery
   [junit4]   2> Creating dataDir: C:\Users\jenkins\workspace\Lucene-Solr-6.x-Windows\solr\build\solr-core\test\J0\temp\solr.cloud.TestCloudRecovery_8A6B78939B5D420B-001\init-core-data-001
   [junit4]   2> 988252 INFO  (SUITE-TestCloudRecovery-seed#[8A6B78939B5D420B]-worker) [    ] o.a.s.SolrTestCaseJ4 Using PointFields
   [junit4]   2> 988254 INFO  (SUITE-TestCloudRecovery-seed#[8A6B78939B5D420B]-worker) [    ] o.a.s.SolrTestCaseJ4 Randomized ssl (false) and clientAuth (false) via: @org.apache.solr.util.RandomizeSSL(reason="", value=0.0/0.0, ssl=0.0/0.0, clientAuth=0.0/0.0)
   [junit4]   2> 988254 INFO  (SUITE-TestCloudRecovery-seed#[8A6B78939B5D420B]-worker) [    ] o.a.s.c.MiniSolrCloudCluster Starting cluster of 2 servers in C:\Users\jenkins\workspace\Lucene-Solr-6.x-Windows\solr\build\solr-core\test\J0\temp\solr.cloud.TestCloudRecovery_8A6B78939B5D420B-001\tempDir-001
   [junit4]   2> 988256 INFO  (SUITE-TestCloudRecovery-seed#[8A6B78939B5D420B]-worker) [    ] o.a.s.c.ZkTestServer STARTING ZK TEST SERVER
   [junit4]   2> 988256 INFO  (Thread-2311) [    ] o.a.s.c.ZkTestServer client port:0.0.0.0/0.0.0.0:0
   [junit4]   2> 988256 INFO  (Thread-2311) [    ] o.a.s.c.ZkTestServer Starting server
   [junit4]   2> 988261 ERROR (Thread-2311) [    ] o.a.z.s.ZooKeeperServer ZKShutdownHandler is not registered, so ZooKeeper server won't take any action on ERROR or SHUTDOWN server state changes
   [junit4]   2> 988357 INFO  (SUITE-TestCloudRecovery-seed#[8A6B78939B5D420B]-worker) [    ] o.a.s.c.ZkTestServer start zk server on port:52427
   [junit4]   2> 988363 WARN  (NIOServerCxn.Factory:0.0.0.0/0.0.0.0:0) [    ] o.a.z.s.NIOServerCnxn caught end of stream exception
   [junit4]   2> EndOfStreamException: Unable to read additional data from client sessionid 0x15cfe36a5510000, likely client has closed socket
   [junit4]   2> 	at org.apache.zookeeper.server.NIOServerCnxn.doIO(NIOServerCnxn.java:239)
   [junit4]   2> 	at org.apache.zookeeper.server.NIOServerCnxnFactory.run(NIOServerCnxnFactory.java:203)
   [junit4]   2> 	at java.base/java.lang.Thread.run(Thread.java:844)
   [junit4]   2> 988365 INFO  (jetty-launcher-2426-thread-1) [    ] o.e.j.s.Server jetty-9.3.14.v20161028
   [junit4]   2> 988365 INFO  (jetty-launcher-2426-thread-2) [    ] o.e.j.s.Server jetty-9.3.14.v20161028
   [junit4]   2> 988365 INFO  (jetty-launcher-2426-thread-1) [    ] o.e.j.s.h.ContextHandler Started o.e.j.s.ServletContextHandler@121a545d{/solr,null,AVAILABLE}
   [junit4]   2> 988367 INFO  (jetty-launcher-2426-thread-2) [    ] o.e.j.s.h.ContextHandler Started o.e.j.s.ServletContextHandler@1ea2d69e{/solr,null,AVAILABLE}
   [junit4]   2> 988369 INFO  (jetty-launcher-2426-thread-1) [    ] o.e.j.s.AbstractConnector Started ServerConnector@2d7317b3{HTTP/1.1,[http/1.1]}{127.0.0.1:52431}
   [junit4]   2> 988369 INFO  (jetty-launcher-2426-thread-1) [    ] o.e.j.s.Server Started @990379ms
   [junit4]   2> 988369 INFO  (jetty-launcher-2426-thread-1) [    ] o.a.s.c.s.e.JettySolrRunner Jetty properties: {hostContext=/solr, hostPort=52431}
   [junit4]   2> 988369 INFO  (jetty-launcher-2426-thread-2) [    ] o.e.j.s.AbstractConnector Started ServerConnector@763eb5f9{HTTP/1.1,[http/1.1]}{127.0.0.1:52434}
   [junit4]   2> 988369 INFO  (jetty-launcher-2426-thread-2) [    ] o.e.j.s.Server Started @990379ms
   [junit4]   2> 988369 INFO  (jetty-launcher-2426-thread-2) [    ] o.a.s.c.s.e.JettySolrRunner Jetty properties: {hostContext=/solr, hostPort=52434}
   [junit4]   2> 988370 ERROR (jetty-launcher-2426-thread-2) [    ] o.a.s.s.StartupLoggingUtils Missing Java Option solr.log.dir. Logging may be missing or incomplete.
   [junit4]   2> 988370 ERROR (jetty-launcher-2426-thread-1) [    ] o.a.s.s.StartupLoggingUtils Missing Java Option solr.log.dir. Logging may be missing or incomplete.
   [junit4]   2> 988370 INFO  (jetty-launcher-2426-thread-2) [    ] o.a.s.s.SolrDispatchFilter  ___      _       Welcome to Apache Solr? version 6.7.0
   [junit4]   2> 988370 INFO  (jetty-launcher-2426-thread-1) [    ] o.a.s.s.SolrDispatchFilter  ___      _       Welcome to Apache Solr? version 6.7.0
   [junit4]   2> 988370 INFO  (jetty-launcher-2426-thread-2) [    ] o.a.s.s.SolrDispatchFilter / __| ___| |_ _   Starting in cloud mode on port null
   [junit4]   2> 988370 INFO  (jetty-launcher-2426-thread-1) [    ] o.a.s.s.SolrDispatchFilter / __| ___| |_ _   Starting in cloud mode on port null
   [junit4]   2> 988370 INFO  (jetty-launcher-2426-thread-2) [    ] o.a.s.s.SolrDispatchFilter \__ \/ _ \ | '_|  Install dir: null
   [junit4]   2> 988370 INFO  (jetty-launcher-2426-thread-1) [    ] o.a.s.s.SolrDispatchFilter \__ \/ _ \ | '_|  Install dir: null
   [junit4]   2> 988370 INFO  (jetty-launcher-2426-thread-2) [    ] o.a.s.s.SolrDispatchFilter |___/\___/_|_|    Start time: 2017-07-01T12:53:33.246111Z
   [junit4]   2

[...truncated too long message...]

mTest, TestLuceneMatchVersion, TestExclusionRuleCollectionAccess, PreAnalyzedFieldTest, TestMissingGroups, JsonLoaderTest, TestPayloadCheckQParserPlugin, TestSolrQueryParserDefaultOperatorResource, ClusterStateTest, TestFuzzyAnalyzedSuggestions, DocValuesNotIndexedTest, OverseerTest, TestCloudRecovery]
   [junit4]   2> NOTE: reproduce with: ant test  -Dtestcase=TestCloudRecovery -Dtests.seed=8A6B78939B5D420B -Dtests.slow=true -Dtests.locale=fr-MG -Dtests.timezone=Pacific/Pohnpei -Dtests.asserts=true -Dtests.file.encoding=US-ASCII
   [junit4] ERROR   0.00s J0 | TestCloudRecovery (suite) <<<
   [junit4]    > Throwable #1: java.io.IOException: Could not remove the following files (in the order of attempts):
   [junit4]    >    C:\Users\jenkins\workspace\Lucene-Solr-6.x-Windows\solr\build\solr-core\test\J0\temp\solr.cloud.TestCloudRecovery_8A6B78939B5D420B-001\tempDir-001\node2\collection1_shard2_replica2\data\tlog\tlog.0000000000000000001: java.nio.file.FileSystemException: C:\Users\jenkins\workspace\Lucene-Solr-6.x-Windows\solr\build\solr-core\test\J0\temp\solr.cloud.TestCloudRecovery_8A6B78939B5D420B-001\tempDir-001\node2\collection1_shard2_replica2\data\tlog\tlog.0000000000000000001: The process cannot access the file because it is being used by another process.
   [junit4]    >    C:\Users\jenkins\workspace\Lucene-Solr-6.x-Windows\solr\build\solr-core\test\J0\temp\solr.cloud.TestCloudRecovery_8A6B78939B5D420B-001\tempDir-001\node2\collection1_shard2_replica2\data\tlog: java.nio.file.DirectoryNotEmptyException: C:\Users\jenkins\workspace\Lucene-Solr-6.x-Windows\solr\build\solr-core\test\J0\temp\solr.cloud.TestCloudRecovery_8A6B78939B5D420B-001\tempDir-001\node2\collection1_shard2_replica2\data\tlog
   [junit4]    >    C:\Users\jenkins\workspace\Lucene-Solr-6.x-Windows\solr\build\solr-core\test\J0\temp\solr.cloud.TestCloudRecovery_8A6B78939B5D420B-001\tempDir-001\node2\collection1_shard2_replica2\data: java.nio.file.DirectoryNotEmptyException: C:\Users\jenkins\workspace\Lucene-Solr-6.x-Windows\solr\build\solr-core\test\J0\temp\solr.cloud.TestCloudRecovery_8A6B78939B5D420B-001\tempDir-001\node2\collection1_shard2_replica2\data
   [junit4]    >    C:\Users\jenkins\workspace\Lucene-Solr-6.x-Windows\solr\build\solr-core\test\J0\temp\solr.cloud.TestCloudRecovery_8A6B78939B5D420B-001\tempDir-001\node2\collection1_shard2_replica2: java.nio.file.DirectoryNotEmptyException: C:\Users\jenkins\workspace\Lucene-Solr-6.x-Windows\solr\build\solr-core\test\J0\temp\solr.cloud.TestCloudRecovery_8A6B78939B5D420B-001\tempDir-001\node2\collection1_shard2_replica2
   [junit4]    >    C:\Users\jenkins\workspace\Lucene-Solr-6.x-Windows\solr\build\solr-core\test\J0\temp\solr.cloud.TestCloudRecovery_8A6B78939B5D420B-001\tempDir-001\node2\collection1_shard1_replica2\data\tlog\tlog.0000000000000000001: java.nio.file.FileSystemException: C:\Users\jenkins\workspace\Lucene-Solr-6.x-Windows\solr\build\solr-core\test\J0\temp\solr.cloud.TestCloudRecovery_8A6B78939B5D420B-001\tempDir-001\node2\collection1_shard1_replica2\data\tlog\tlog.0000000000000000001: The process cannot access the file because it is being used by another process.
   [junit4]    >    C:\Users\jenkins\workspace\Lucene-Solr-6.x-Windows\solr\build\solr-core\test\J0\temp\solr.cloud.TestCloudRecovery_8A6B78939B5D420B-001\tempDir-001\node2\collection1_shard1_replica2\data\tlog: java.nio.file.DirectoryNotEmptyException: C:\Users\jenkins\workspace\Lucene-Solr-6.x-Windows\solr\build\solr-core\test\J0\temp\solr.cloud.TestCloudRecovery_8A6B78939B5D420B-001\tempDir-001\node2\collection1_shard1_replica2\data\tlog
   [junit4]    >    C:\Users\jenkins\workspace\Lucene-Solr-6.x-Windows\solr\build\solr-core\test\J0\temp\solr.cloud.TestCloudRecovery_8A6B78939B5D420B-001\tempDir-001\node2\collection1_shard1_replica2\data: java.nio.file.DirectoryNotEmptyException: C:\Users\jenkins\workspace\Lucene-Solr-6.x-Windows\solr\build\solr-core\test\J0\temp\solr.cloud.TestCloudRecovery_8A6B78939B5D420B-001\tempDir-001\node2\collection1_shard1_replica2\data
   [junit4]    >    C:\Users\jenkins\workspace\Lucene-Solr-6.x-Windows\solr\build\solr-core\test\J0\temp\solr.cloud.TestCloudRecovery_8A6B78939B5D420B-001\tempDir-001\node2\collection1_shard1_replica2: java.nio.file.DirectoryNotEmptyException: C:\Users\jenkins\workspace\Lucene-Solr-6.x-Windows\solr\build\solr-core\test\J0\temp\solr.cloud.TestCloudRecovery_8A6B78939B5D420B-001\tempDir-001\node2\collection1_shard1_replica2
   [junit4]    >    C:\Users\jenkins\workspace\Lucene-Solr-6.x-Windows\solr\build\solr-core\test\J0\temp\solr.cloud.TestCloudRecovery_8A6B78939B5D420B-001\tempDir-001\node2: java.nio.file.DirectoryNotEmptyException: C:\Users\jenkins\workspace\Lucene-Solr-6.x-Windows\solr\build\solr-core\test\J0\temp\solr.cloud.TestCloudRecovery_8A6B78939B5D420B-001\tempDir-001\node2
   [junit4]    >    C:\Users\jenkins\workspace\Lucene-Solr-6.x-Windows\solr\build\solr-core\test\J0\temp\solr.cloud.TestCloudRecovery_8A6B78939B5D420B-001\tempDir-001\node1\collection1_shard2_replica1\data\tlog\tlog.0000000000000000001: java.nio.file.FileSystemException: C:\Users\jenkins\workspace\Lucene-Solr-6.x-Windows\solr\build\solr-core\test\J0\temp\solr.cloud.TestCloudRecovery_8A6B78939B5D420B-001\tempDir-001\node1\collection1_shard2_replica1\data\tlog\tlog.0000000000000000001: The process cannot access the file because it is being used by another process.
   [junit4]    >    C:\Users\jenkins\workspace\Lucene-Solr-6.x-Windows\solr\build\solr-core\test\J0\temp\solr.cloud.TestCloudRecovery_8A6B78939B5D420B-001\tempDir-001\node1\collection1_shard2_replica1\data\tlog: java.nio.file.DirectoryNotEmptyException: C:\Users\jenkins\workspace\Lucene-Solr-6.x-Windows\solr\build\solr-core\test\J0\temp\solr.cloud.TestCloudRecovery_8A6B78939B5D420B-001\tempDir-001\node1\collection1_shard2_replica1\data\tlog
   [junit4]    >    C:\Users\jenkins\workspace\Lucene-Solr-6.x-Windows\solr\build\solr-core\test\J0\temp\solr.cloud.TestCloudRecovery_8A6B78939B5D420B-001\tempDir-001\node1\collection1_shard2_replica1\data: java.nio.file.DirectoryNotEmptyException: C:\Users\jenkins\workspace\Lucene-Solr-6.x-Windows\solr\build\solr-core\test\J0\temp\solr.cloud.TestCloudRecovery_8A6B78939B5D420B-001\tempDir-001\node1\collection1_shard2_replica1\data
   [junit4]    >    C:\Users\jenkins\workspace\Lucene-Solr-6.x-Windows\solr\build\solr-core\test\J0\temp\solr.cloud.TestCloudRecovery_8A6B78939B5D420B-001\tempDir-001\node1\collection1_shard2_replica1: java.nio.file.DirectoryNotEmptyException: C:\Users\jenkins\workspace\Lucene-Solr-6.x-Windows\solr\build\solr-core\test\J0\temp\solr.cloud.TestCloudRecovery_8A6B78939B5D420B-001\tempDir-001\node1\collection1_shard2_replica1
   [junit4]    >    C:\Users\jenkins\workspace\Lucene-Solr-6.x-Windows\solr\build\solr-core\test\J0\temp\solr.cloud.TestCloudRecovery_8A6B78939B5D420B-001\tempDir-001\node1\collection1_shard1_replica1\data\tlog\tlog.0000000000000000001: java.nio.file.FileSystemException: C:\Users\jenkins\workspace\Lucene-Solr-6.x-Windows\solr\build\solr-core\test\J0\temp\solr.cloud.TestCloudRecovery_8A6B78939B5D420B-001\tempDir-001\node1\collection1_shard1_replica1\data\tlog\tlog.0000000000000000001: The process cannot access the file because it is being used by another process.
   [junit4]    >    C:\Users\jenkins\workspace\Lucene-Solr-6.x-Windows\solr\build\solr-core\test\J0\temp\solr.cloud.TestCloudRecovery_8A6B78939B5D420B-001\tempDir-001\node1\collection1_shard1_replica1\data\tlog: java.nio.file.DirectoryNotEmptyException: C:\Users\jenkins\workspace\Lucene-Solr-6.x-Windows\solr\build\solr-core\test\J0\temp\solr.cloud.TestCloudRecovery_8A6B78939B5D420B-001\tempDir-001\node1\collection1_shard1_replica1\data\tlog
   [junit4]    >    C:\Users\jenkins\workspace\Lucene-Solr-6.x-Windows\solr\build\solr-core\test\J0\temp\solr.cloud.TestCloudRecovery_8A6B78939B5D420B-001\tempDir-001\node1\collection1_shard1_replica1\data: java.nio.file.DirectoryNotEmptyException: C:\Users\jenkins\workspace\Lucene-Solr-6.x-Windows\solr\build\solr-core\test\J0\temp\solr.cloud.TestCloudRecovery_8A6B78939B5D420B-001\tempDir-001\node1\collection1_shard1_replica1\data
   [junit4]    >    C:\Users\jenkins\workspace\Lucene-Solr-6.x-Windows\solr\build\solr-core\test\J0\temp\solr.cloud.TestCloudRecovery_8A6B78939B5D420B-001\tempDir-001\node1\collection1_shard1_replica1: java.nio.file.DirectoryNotEmptyException: C:\Users\jenkins\workspace\Lucene-Solr-6.x-Windows\solr\build\solr-core\test\J0\temp\solr.cloud.TestCloudRecovery_8A6B78939B5D420B-001\tempDir-001\node1\collection1_shard1_replica1
   [junit4]    >    C:\Users\jenkins\workspace\Lucene-Solr-6.x-Windows\solr\build\solr-core\test\J0\temp\solr.cloud.TestCloudRecovery_8A6B78939B5D420B-001\tempDir-001\node1: java.nio.file.DirectoryNotEmptyException: C:\Users\jenkins\workspace\Lucene-Solr-6.x-Windows\solr\build\solr-core\test\J0\temp\solr.cloud.TestCloudRecovery_8A6B78939B5D420B-001\tempDir-001\node1
   [junit4]    >    C:\Users\jenkins\workspace\Lucene-Solr-6.x-Windows\solr\build\solr-core\test\J0\temp\solr.cloud.TestCloudRecovery_8A6B78939B5D420B-001\tempDir-001: java.nio.file.DirectoryNotEmptyException: C:\Users\jenkins\workspace\Lucene-Solr-6.x-Windows\solr\build\solr-core\test\J0\temp\solr.cloud.TestCloudRecovery_8A6B78939B5D420B-001\tempDir-001
   [junit4]    >    C:\Users\jenkins\workspace\Lucene-Solr-6.x-Windows\solr\build\solr-core\test\J0\temp\solr.cloud.TestCloudRecovery_8A6B78939B5D420B-001: java.nio.file.DirectoryNotEmptyException: C:\Users\jenkins\workspace\Lucene-Solr-6.x-Windows\solr\build\solr-core\test\J0\temp\solr.cloud.TestCloudRecovery_8A6B78939B5D420B-001
   [junit4]    > 	at __randomizedtesting.SeedInfo.seed([8A6B78939B5D420B]:0)
   [junit4]    > 	at org.apache.lucene.util.IOUtils.rm(IOUtils.java:329)
   [junit4]    > 	at java.base/java.lang.Thread.run(Thread.java:844)
   [junit4] Completed [304/713 (2!)] on J0 in 26.94s, 2 tests, 1 error <<< FAILURES!

[...truncated 37672 lines...]

Mime
View raw message