lucene-dev mailing list archives

Site index · List index
Message view « Date » · « Thread »
Top « Date » · « Thread »
From Policeman Jenkins Server <jenk...@thetaphi.de>
Subject [JENKINS] Lucene-Solr-7.0-Windows (64bit/jdk1.8.0_131) - Build # 30 - Unstable!
Date Thu, 20 Jul 2017 15:28:59 GMT
Build: https://jenkins.thetaphi.de/job/Lucene-Solr-7.0-Windows/30/
Java: 64bit/jdk1.8.0_131 -XX:-UseCompressedOops -XX:+UseParallelGC

3 tests failed.
FAILED:  junit.framework.TestSuite.org.apache.solr.cloud.TestTlogReplica

Error Message:
ObjectTracker found 5 object(s) that were not released!!! [MockDirectoryWrapper, MockDirectoryWrapper, MockDirectoryWrapper, SolrCore, MockDirectoryWrapper] org.apache.solr.common.util.ObjectReleaseTracker$ObjectTrackerException: org.apache.lucene.store.MockDirectoryWrapper  at org.apache.solr.common.util.ObjectReleaseTracker.track(ObjectReleaseTracker.java:42)  at org.apache.solr.core.CachingDirectoryFactory.get(CachingDirectoryFactory.java:348)  at org.apache.solr.core.SolrCore.initSnapshotMetaDataManager(SolrCore.java:478)  at org.apache.solr.core.SolrCore.<init>(SolrCore.java:928)  at org.apache.solr.core.SolrCore.<init>(SolrCore.java:843)  at org.apache.solr.core.CoreContainer.create(CoreContainer.java:969)  at org.apache.solr.core.CoreContainer.create(CoreContainer.java:904)  at org.apache.solr.handler.admin.CoreAdminOperation.lambda$static$0(CoreAdminOperation.java:91)  at org.apache.solr.handler.admin.CoreAdminOperation.execute(CoreAdminOperation.java:384)  at org.apache.solr.handler.admin.CoreAdminHandler$CallInfo.call(CoreAdminHandler.java:389)  at org.apache.solr.handler.admin.CoreAdminHandler.handleRequestBody(CoreAdminHandler.java:174)  at org.apache.solr.handler.RequestHandlerBase.handleRequest(RequestHandlerBase.java:177)  at org.apache.solr.servlet.HttpSolrCall.handleAdmin(HttpSolrCall.java:745)  at org.apache.solr.servlet.HttpSolrCall.handleAdminRequest(HttpSolrCall.java:726)  at org.apache.solr.servlet.HttpSolrCall.call(HttpSolrCall.java:507)  at org.apache.solr.servlet.SolrDispatchFilter.doFilter(SolrDispatchFilter.java:378)  at org.apache.solr.servlet.SolrDispatchFilter.doFilter(SolrDispatchFilter.java:322)  at org.eclipse.jetty.servlet.ServletHandler$CachedChain.doFilter(ServletHandler.java:1699)  at org.apache.solr.client.solrj.embedded.JettySolrRunner$DebugFilter.doFilter(JettySolrRunner.java:139)  at org.eclipse.jetty.servlet.ServletHandler$CachedChain.doFilter(ServletHandler.java:1699)  at org.eclipse.jetty.servlet.ServletHandler.doHandle(ServletHandler.java:582)  at org.eclipse.jetty.server.session.SessionHandler.doHandle(SessionHandler.java:224)  at org.eclipse.jetty.server.handler.ContextHandler.doHandle(ContextHandler.java:1180)  at org.eclipse.jetty.servlet.ServletHandler.doScope(ServletHandler.java:512)  at org.eclipse.jetty.server.session.SessionHandler.doScope(SessionHandler.java:185)  at org.eclipse.jetty.server.handler.ContextHandler.doScope(ContextHandler.java:1112)  at org.eclipse.jetty.server.handler.ScopedHandler.handle(ScopedHandler.java:141)  at org.eclipse.jetty.server.handler.gzip.GzipHandler.handle(GzipHandler.java:395)  at org.eclipse.jetty.server.handler.HandlerWrapper.handle(HandlerWrapper.java:134)  at org.eclipse.jetty.server.Server.handle(Server.java:534)  at org.eclipse.jetty.server.HttpChannel.handle(HttpChannel.java:320)  at org.eclipse.jetty.server.HttpConnection.onFillable(HttpConnection.java:251)  at org.eclipse.jetty.io.AbstractConnection$ReadCallback.succeeded(AbstractConnection.java:273)  at org.eclipse.jetty.io.FillInterest.fillable(FillInterest.java:95)  at org.eclipse.jetty.io.ssl.SslConnection.onFillable(SslConnection.java:202)  at org.eclipse.jetty.io.AbstractConnection$ReadCallback.succeeded(AbstractConnection.java:273)  at org.eclipse.jetty.io.FillInterest.fillable(FillInterest.java:95)  at org.eclipse.jetty.io.SelectChannelEndPoint$2.run(SelectChannelEndPoint.java:93)  at org.eclipse.jetty.util.thread.strategy.ExecuteProduceConsume.executeProduceConsume(ExecuteProduceConsume.java:303)  at org.eclipse.jetty.util.thread.strategy.ExecuteProduceConsume.produceConsume(ExecuteProduceConsume.java:148)  at org.eclipse.jetty.util.thread.strategy.ExecuteProduceConsume.run(ExecuteProduceConsume.java:136)  at org.eclipse.jetty.util.thread.QueuedThreadPool.runJob(QueuedThreadPool.java:671)  at org.eclipse.jetty.util.thread.QueuedThreadPool$2.run(QueuedThreadPool.java:589)  at java.lang.Thread.run(Thread.java:748)  org.apache.solr.common.util.ObjectReleaseTracker$ObjectTrackerException: org.apache.lucene.store.MockDirectoryWrapper  at org.apache.solr.common.util.ObjectReleaseTracker.track(ObjectReleaseTracker.java:42)  at org.apache.solr.core.CachingDirectoryFactory.get(CachingDirectoryFactory.java:348)  at org.apache.solr.core.SolrCore.getNewIndexDir(SolrCore.java:349)  at org.apache.solr.core.SolrCore.initIndex(SolrCore.java:709)  at org.apache.solr.core.SolrCore.<init>(SolrCore.java:934)  at org.apache.solr.core.SolrCore.<init>(SolrCore.java:843)  at org.apache.solr.core.CoreContainer.create(CoreContainer.java:969)  at org.apache.solr.core.CoreContainer.create(CoreContainer.java:904)  at org.apache.solr.handler.admin.CoreAdminOperation.lambda$static$0(CoreAdminOperation.java:91)  at org.apache.solr.handler.admin.CoreAdminOperation.execute(CoreAdminOperation.java:384)  at org.apache.solr.handler.admin.CoreAdminHandler$CallInfo.call(CoreAdminHandler.java:389)  at org.apache.solr.handler.admin.CoreAdminHandler.handleRequestBody(CoreAdminHandler.java:174)  at org.apache.solr.handler.RequestHandlerBase.handleRequest(RequestHandlerBase.java:177)  at org.apache.solr.servlet.HttpSolrCall.handleAdmin(HttpSolrCall.java:745)  at org.apache.solr.servlet.HttpSolrCall.handleAdminRequest(HttpSolrCall.java:726)  at org.apache.solr.servlet.HttpSolrCall.call(HttpSolrCall.java:507)  at org.apache.solr.servlet.SolrDispatchFilter.doFilter(SolrDispatchFilter.java:378)  at org.apache.solr.servlet.SolrDispatchFilter.doFilter(SolrDispatchFilter.java:322)  at org.eclipse.jetty.servlet.ServletHandler$CachedChain.doFilter(ServletHandler.java:1699)  at org.apache.solr.client.solrj.embedded.JettySolrRunner$DebugFilter.doFilter(JettySolrRunner.java:139)  at org.eclipse.jetty.servlet.ServletHandler$CachedChain.doFilter(ServletHandler.java:1699)  at org.eclipse.jetty.servlet.ServletHandler.doHandle(ServletHandler.java:582)  at org.eclipse.jetty.server.session.SessionHandler.doHandle(SessionHandler.java:224)  at org.eclipse.jetty.server.handler.ContextHandler.doHandle(ContextHandler.java:1180)  at org.eclipse.jetty.servlet.ServletHandler.doScope(ServletHandler.java:512)  at org.eclipse.jetty.server.session.SessionHandler.doScope(SessionHandler.java:185)  at org.eclipse.jetty.server.handler.ContextHandler.doScope(ContextHandler.java:1112)  at org.eclipse.jetty.server.handler.ScopedHandler.handle(ScopedHandler.java:141)  at org.eclipse.jetty.server.handler.gzip.GzipHandler.handle(GzipHandler.java:395)  at org.eclipse.jetty.server.handler.HandlerWrapper.handle(HandlerWrapper.java:134)  at org.eclipse.jetty.server.Server.handle(Server.java:534)  at org.eclipse.jetty.server.HttpChannel.handle(HttpChannel.java:320)  at org.eclipse.jetty.server.HttpConnection.onFillable(HttpConnection.java:251)  at org.eclipse.jetty.io.AbstractConnection$ReadCallback.succeeded(AbstractConnection.java:273)  at org.eclipse.jetty.io.FillInterest.fillable(FillInterest.java:95)  at org.eclipse.jetty.io.ssl.SslConnection.onFillable(SslConnection.java:202)  at org.eclipse.jetty.io.AbstractConnection$ReadCallback.succeeded(AbstractConnection.java:273)  at org.eclipse.jetty.io.FillInterest.fillable(FillInterest.java:95)  at org.eclipse.jetty.io.SelectChannelEndPoint$2.run(SelectChannelEndPoint.java:93)  at org.eclipse.jetty.util.thread.strategy.ExecuteProduceConsume.executeProduceConsume(ExecuteProduceConsume.java:303)  at org.eclipse.jetty.util.thread.strategy.ExecuteProduceConsume.produceConsume(ExecuteProduceConsume.java:148)  at org.eclipse.jetty.util.thread.strategy.ExecuteProduceConsume.run(ExecuteProduceConsume.java:136)  at org.eclipse.jetty.util.thread.QueuedThreadPool.runJob(QueuedThreadPool.java:671)  at org.eclipse.jetty.util.thread.QueuedThreadPool$2.run(QueuedThreadPool.java:589)  at java.lang.Thread.run(Thread.java:748)  org.apache.solr.common.util.ObjectReleaseTracker$ObjectTrackerException: org.apache.lucene.store.MockDirectoryWrapper  at org.apache.solr.common.util.ObjectReleaseTracker.track(ObjectReleaseTracker.java:42)  at org.apache.solr.core.CachingDirectoryFactory.get(CachingDirectoryFactory.java:348)  at org.apache.solr.update.SolrIndexWriter.create(SolrIndexWriter.java:92)  at org.apache.solr.core.SolrCore.initIndex(SolrCore.java:741)  at org.apache.solr.core.SolrCore.<init>(SolrCore.java:934)  at org.apache.solr.core.SolrCore.<init>(SolrCore.java:843)  at org.apache.solr.core.CoreContainer.create(CoreContainer.java:969)  at org.apache.solr.core.CoreContainer.create(CoreContainer.java:904)  at org.apache.solr.handler.admin.CoreAdminOperation.lambda$static$0(CoreAdminOperation.java:91)  at org.apache.solr.handler.admin.CoreAdminOperation.execute(CoreAdminOperation.java:384)  at org.apache.solr.handler.admin.CoreAdminHandler$CallInfo.call(CoreAdminHandler.java:389)  at org.apache.solr.handler.admin.CoreAdminHandler.handleRequestBody(CoreAdminHandler.java:174)  at org.apache.solr.handler.RequestHandlerBase.handleRequest(RequestHandlerBase.java:177)  at org.apache.solr.servlet.HttpSolrCall.handleAdmin(HttpSolrCall.java:745)  at org.apache.solr.servlet.HttpSolrCall.handleAdminRequest(HttpSolrCall.java:726)  at org.apache.solr.servlet.HttpSolrCall.call(HttpSolrCall.java:507)  at org.apache.solr.servlet.SolrDispatchFilter.doFilter(SolrDispatchFilter.java:378)  at org.apache.solr.servlet.SolrDispatchFilter.doFilter(SolrDispatchFilter.java:322)  at org.eclipse.jetty.servlet.ServletHandler$CachedChain.doFilter(ServletHandler.java:1699)  at org.apache.solr.client.solrj.embedded.JettySolrRunner$DebugFilter.doFilter(JettySolrRunner.java:139)  at org.eclipse.jetty.servlet.ServletHandler$CachedChain.doFilter(ServletHandler.java:1699)  at org.eclipse.jetty.servlet.ServletHandler.doHandle(ServletHandler.java:582)  at org.eclipse.jetty.server.session.SessionHandler.doHandle(SessionHandler.java:224)  at org.eclipse.jetty.server.handler.ContextHandler.doHandle(ContextHandler.java:1180)  at org.eclipse.jetty.servlet.ServletHandler.doScope(ServletHandler.java:512)  at org.eclipse.jetty.server.session.SessionHandler.doScope(SessionHandler.java:185)  at org.eclipse.jetty.server.handler.ContextHandler.doScope(ContextHandler.java:1112)  at org.eclipse.jetty.server.handler.ScopedHandler.handle(ScopedHandler.java:141)  at org.eclipse.jetty.server.handler.gzip.GzipHandler.handle(GzipHandler.java:395)  at org.eclipse.jetty.server.handler.HandlerWrapper.handle(HandlerWrapper.java:134)  at org.eclipse.jetty.server.Server.handle(Server.java:534)  at org.eclipse.jetty.server.HttpChannel.handle(HttpChannel.java:320)  at org.eclipse.jetty.server.HttpConnection.onFillable(HttpConnection.java:251)  at org.eclipse.jetty.io.AbstractConnection$ReadCallback.succeeded(AbstractConnection.java:273)  at org.eclipse.jetty.io.FillInterest.fillable(FillInterest.java:95)  at org.eclipse.jetty.io.ssl.SslConnection.onFillable(SslConnection.java:202)  at org.eclipse.jetty.io.AbstractConnection$ReadCallback.succeeded(AbstractConnection.java:273)  at org.eclipse.jetty.io.FillInterest.fillable(FillInterest.java:95)  at org.eclipse.jetty.io.SelectChannelEndPoint$2.run(SelectChannelEndPoint.java:93)  at org.eclipse.jetty.util.thread.strategy.ExecuteProduceConsume.executeProduceConsume(ExecuteProduceConsume.java:303)  at org.eclipse.jetty.util.thread.strategy.ExecuteProduceConsume.produceConsume(ExecuteProduceConsume.java:148)  at org.eclipse.jetty.util.thread.strategy.ExecuteProduceConsume.run(ExecuteProduceConsume.java:136)  at org.eclipse.jetty.util.thread.QueuedThreadPool.runJob(QueuedThreadPool.java:671)  at org.eclipse.jetty.util.thread.QueuedThreadPool$2.run(QueuedThreadPool.java:589)  at java.lang.Thread.run(Thread.java:748)  org.apache.solr.common.util.ObjectReleaseTracker$ObjectTrackerException: org.apache.solr.core.SolrCore  at org.apache.solr.common.util.ObjectReleaseTracker.track(ObjectReleaseTracker.java:42)  at org.apache.solr.core.SolrCore.<init>(SolrCore.java:1019)  at org.apache.solr.core.SolrCore.<init>(SolrCore.java:843)  at org.apache.solr.core.CoreContainer.create(CoreContainer.java:969)  at org.apache.solr.core.CoreContainer.create(CoreContainer.java:904)  at org.apache.solr.handler.admin.CoreAdminOperation.lambda$static$0(CoreAdminOperation.java:91)  at org.apache.solr.handler.admin.CoreAdminOperation.execute(CoreAdminOperation.java:384)  at org.apache.solr.handler.admin.CoreAdminHandler$CallInfo.call(CoreAdminHandler.java:389)  at org.apache.solr.handler.admin.CoreAdminHandler.handleRequestBody(CoreAdminHandler.java:174)  at org.apache.solr.handler.RequestHandlerBase.handleRequest(RequestHandlerBase.java:177)  at org.apache.solr.servlet.HttpSolrCall.handleAdmin(HttpSolrCall.java:745)  at org.apache.solr.servlet.HttpSolrCall.handleAdminRequest(HttpSolrCall.java:726)  at org.apache.solr.servlet.HttpSolrCall.call(HttpSolrCall.java:507)  at org.apache.solr.servlet.SolrDispatchFilter.doFilter(SolrDispatchFilter.java:378)  at org.apache.solr.servlet.SolrDispatchFilter.doFilter(SolrDispatchFilter.java:322)  at org.eclipse.jetty.servlet.ServletHandler$CachedChain.doFilter(ServletHandler.java:1699)  at org.apache.solr.client.solrj.embedded.JettySolrRunner$DebugFilter.doFilter(JettySolrRunner.java:139)  at org.eclipse.jetty.servlet.ServletHandler$CachedChain.doFilter(ServletHandler.java:1699)  at org.eclipse.jetty.servlet.ServletHandler.doHandle(ServletHandler.java:582)  at org.eclipse.jetty.server.session.SessionHandler.doHandle(SessionHandler.java:224)  at org.eclipse.jetty.server.handler.ContextHandler.doHandle(ContextHandler.java:1180)  at org.eclipse.jetty.servlet.ServletHandler.doScope(ServletHandler.java:512)  at org.eclipse.jetty.server.session.SessionHandler.doScope(SessionHandler.java:185)  at org.eclipse.jetty.server.handler.ContextHandler.doScope(ContextHandler.java:1112)  at org.eclipse.jetty.server.handler.ScopedHandler.handle(ScopedHandler.java:141)  at org.eclipse.jetty.server.handler.gzip.GzipHandler.handle(GzipHandler.java:395)  at org.eclipse.jetty.server.handler.HandlerWrapper.handle(HandlerWrapper.java:134)  at org.eclipse.jetty.server.Server.handle(Server.java:534)  at org.eclipse.jetty.server.HttpChannel.handle(HttpChannel.java:320)  at org.eclipse.jetty.server.HttpConnection.onFillable(HttpConnection.java:251)  at org.eclipse.jetty.io.AbstractConnection$ReadCallback.succeeded(AbstractConnection.java:273)  at org.eclipse.jetty.io.FillInterest.fillable(FillInterest.java:95)  at org.eclipse.jetty.io.ssl.SslConnection.onFillable(SslConnection.java:202)  at org.eclipse.jetty.io.AbstractConnection$ReadCallback.succeeded(AbstractConnection.java:273)  at org.eclipse.jetty.io.FillInterest.fillable(FillInterest.java:95)  at org.eclipse.jetty.io.SelectChannelEndPoint$2.run(SelectChannelEndPoint.java:93)  at org.eclipse.jetty.util.thread.strategy.ExecuteProduceConsume.executeProduceConsume(ExecuteProduceConsume.java:303)  at org.eclipse.jetty.util.thread.strategy.ExecuteProduceConsume.produceConsume(ExecuteProduceConsume.java:148)  at org.eclipse.jetty.util.thread.strategy.ExecuteProduceConsume.run(ExecuteProduceConsume.java:136)  at org.eclipse.jetty.util.thread.QueuedThreadPool.runJob(QueuedThreadPool.java:671)  at org.eclipse.jetty.util.thread.QueuedThreadPool$2.run(QueuedThreadPool.java:589)  at java.lang.Thread.run(Thread.java:748)  org.apache.solr.common.util.ObjectReleaseTracker$ObjectTrackerException: org.apache.lucene.store.MockDirectoryWrapper  at org.apache.solr.common.util.ObjectReleaseTracker.track(ObjectReleaseTracker.java:42)  at org.apache.solr.core.CachingDirectoryFactory.get(CachingDirectoryFactory.java:348)  at org.apache.solr.handler.IndexFetcher.fetchLatestIndex(IndexFetcher.java:484)  at org.apache.solr.handler.IndexFetcher.fetchLatestIndex(IndexFetcher.java:332)  at org.apache.solr.handler.ReplicationHandler.doFetch(ReplicationHandler.java:419)  at org.apache.solr.handler.ReplicationHandler.lambda$setupPolling$12(ReplicationHandler.java:1183)  at java.util.concurrent.Executors$RunnableAdapter.call(Executors.java:511)  at java.util.concurrent.FutureTask.runAndReset(FutureTask.java:308)  at java.util.concurrent.ScheduledThreadPoolExecutor$ScheduledFutureTask.access$301(ScheduledThreadPoolExecutor.java:180)  at java.util.concurrent.ScheduledThreadPoolExecutor$ScheduledFutureTask.run(ScheduledThreadPoolExecutor.java:294)  at java.util.concurrent.ThreadPoolExecutor.runWorker(ThreadPoolExecutor.java:1142)  at java.util.concurrent.ThreadPoolExecutor$Worker.run(ThreadPoolExecutor.java:617)  at java.lang.Thread.run(Thread.java:748)  

Stack Trace:
java.lang.AssertionError: ObjectTracker found 5 object(s) that were not released!!! [MockDirectoryWrapper, MockDirectoryWrapper, MockDirectoryWrapper, SolrCore, MockDirectoryWrapper]
org.apache.solr.common.util.ObjectReleaseTracker$ObjectTrackerException: org.apache.lucene.store.MockDirectoryWrapper
	at org.apache.solr.common.util.ObjectReleaseTracker.track(ObjectReleaseTracker.java:42)
	at org.apache.solr.core.CachingDirectoryFactory.get(CachingDirectoryFactory.java:348)
	at org.apache.solr.core.SolrCore.initSnapshotMetaDataManager(SolrCore.java:478)
	at org.apache.solr.core.SolrCore.<init>(SolrCore.java:928)
	at org.apache.solr.core.SolrCore.<init>(SolrCore.java:843)
	at org.apache.solr.core.CoreContainer.create(CoreContainer.java:969)
	at org.apache.solr.core.CoreContainer.create(CoreContainer.java:904)
	at org.apache.solr.handler.admin.CoreAdminOperation.lambda$static$0(CoreAdminOperation.java:91)
	at org.apache.solr.handler.admin.CoreAdminOperation.execute(CoreAdminOperation.java:384)
	at org.apache.solr.handler.admin.CoreAdminHandler$CallInfo.call(CoreAdminHandler.java:389)
	at org.apache.solr.handler.admin.CoreAdminHandler.handleRequestBody(CoreAdminHandler.java:174)
	at org.apache.solr.handler.RequestHandlerBase.handleRequest(RequestHandlerBase.java:177)
	at org.apache.solr.servlet.HttpSolrCall.handleAdmin(HttpSolrCall.java:745)
	at org.apache.solr.servlet.HttpSolrCall.handleAdminRequest(HttpSolrCall.java:726)
	at org.apache.solr.servlet.HttpSolrCall.call(HttpSolrCall.java:507)
	at org.apache.solr.servlet.SolrDispatchFilter.doFilter(SolrDispatchFilter.java:378)
	at org.apache.solr.servlet.SolrDispatchFilter.doFilter(SolrDispatchFilter.java:322)
	at org.eclipse.jetty.servlet.ServletHandler$CachedChain.doFilter(ServletHandler.java:1699)
	at org.apache.solr.client.solrj.embedded.JettySolrRunner$DebugFilter.doFilter(JettySolrRunner.java:139)
	at org.eclipse.jetty.servlet.ServletHandler$CachedChain.doFilter(ServletHandler.java:1699)
	at org.eclipse.jetty.servlet.ServletHandler.doHandle(ServletHandler.java:582)
	at org.eclipse.jetty.server.session.SessionHandler.doHandle(SessionHandler.java:224)
	at org.eclipse.jetty.server.handler.ContextHandler.doHandle(ContextHandler.java:1180)
	at org.eclipse.jetty.servlet.ServletHandler.doScope(ServletHandler.java:512)
	at org.eclipse.jetty.server.session.SessionHandler.doScope(SessionHandler.java:185)
	at org.eclipse.jetty.server.handler.ContextHandler.doScope(ContextHandler.java:1112)
	at org.eclipse.jetty.server.handler.ScopedHandler.handle(ScopedHandler.java:141)
	at org.eclipse.jetty.server.handler.gzip.GzipHandler.handle(GzipHandler.java:395)
	at org.eclipse.jetty.server.handler.HandlerWrapper.handle(HandlerWrapper.java:134)
	at org.eclipse.jetty.server.Server.handle(Server.java:534)
	at org.eclipse.jetty.server.HttpChannel.handle(HttpChannel.java:320)
	at org.eclipse.jetty.server.HttpConnection.onFillable(HttpConnection.java:251)
	at org.eclipse.jetty.io.AbstractConnection$ReadCallback.succeeded(AbstractConnection.java:273)
	at org.eclipse.jetty.io.FillInterest.fillable(FillInterest.java:95)
	at org.eclipse.jetty.io.ssl.SslConnection.onFillable(SslConnection.java:202)
	at org.eclipse.jetty.io.AbstractConnection$ReadCallback.succeeded(AbstractConnection.java:273)
	at org.eclipse.jetty.io.FillInterest.fillable(FillInterest.java:95)
	at org.eclipse.jetty.io.SelectChannelEndPoint$2.run(SelectChannelEndPoint.java:93)
	at org.eclipse.jetty.util.thread.strategy.ExecuteProduceConsume.executeProduceConsume(ExecuteProduceConsume.java:303)
	at org.eclipse.jetty.util.thread.strategy.ExecuteProduceConsume.produceConsume(ExecuteProduceConsume.java:148)
	at org.eclipse.jetty.util.thread.strategy.ExecuteProduceConsume.run(ExecuteProduceConsume.java:136)
	at org.eclipse.jetty.util.thread.QueuedThreadPool.runJob(QueuedThreadPool.java:671)
	at org.eclipse.jetty.util.thread.QueuedThreadPool$2.run(QueuedThreadPool.java:589)
	at java.lang.Thread.run(Thread.java:748)

org.apache.solr.common.util.ObjectReleaseTracker$ObjectTrackerException: org.apache.lucene.store.MockDirectoryWrapper
	at org.apache.solr.common.util.ObjectReleaseTracker.track(ObjectReleaseTracker.java:42)
	at org.apache.solr.core.CachingDirectoryFactory.get(CachingDirectoryFactory.java:348)
	at org.apache.solr.core.SolrCore.getNewIndexDir(SolrCore.java:349)
	at org.apache.solr.core.SolrCore.initIndex(SolrCore.java:709)
	at org.apache.solr.core.SolrCore.<init>(SolrCore.java:934)
	at org.apache.solr.core.SolrCore.<init>(SolrCore.java:843)
	at org.apache.solr.core.CoreContainer.create(CoreContainer.java:969)
	at org.apache.solr.core.CoreContainer.create(CoreContainer.java:904)
	at org.apache.solr.handler.admin.CoreAdminOperation.lambda$static$0(CoreAdminOperation.java:91)
	at org.apache.solr.handler.admin.CoreAdminOperation.execute(CoreAdminOperation.java:384)
	at org.apache.solr.handler.admin.CoreAdminHandler$CallInfo.call(CoreAdminHandler.java:389)
	at org.apache.solr.handler.admin.CoreAdminHandler.handleRequestBody(CoreAdminHandler.java:174)
	at org.apache.solr.handler.RequestHandlerBase.handleRequest(RequestHandlerBase.java:177)
	at org.apache.solr.servlet.HttpSolrCall.handleAdmin(HttpSolrCall.java:745)
	at org.apache.solr.servlet.HttpSolrCall.handleAdminRequest(HttpSolrCall.java:726)
	at org.apache.solr.servlet.HttpSolrCall.call(HttpSolrCall.java:507)
	at org.apache.solr.servlet.SolrDispatchFilter.doFilter(SolrDispatchFilter.java:378)
	at org.apache.solr.servlet.SolrDispatchFilter.doFilter(SolrDispatchFilter.java:322)
	at org.eclipse.jetty.servlet.ServletHandler$CachedChain.doFilter(ServletHandler.java:1699)
	at org.apache.solr.client.solrj.embedded.JettySolrRunner$DebugFilter.doFilter(JettySolrRunner.java:139)
	at org.eclipse.jetty.servlet.ServletHandler$CachedChain.doFilter(ServletHandler.java:1699)
	at org.eclipse.jetty.servlet.ServletHandler.doHandle(ServletHandler.java:582)
	at org.eclipse.jetty.server.session.SessionHandler.doHandle(SessionHandler.java:224)
	at org.eclipse.jetty.server.handler.ContextHandler.doHandle(ContextHandler.java:1180)
	at org.eclipse.jetty.servlet.ServletHandler.doScope(ServletHandler.java:512)
	at org.eclipse.jetty.server.session.SessionHandler.doScope(SessionHandler.java:185)
	at org.eclipse.jetty.server.handler.ContextHandler.doScope(ContextHandler.java:1112)
	at org.eclipse.jetty.server.handler.ScopedHandler.handle(ScopedHandler.java:141)
	at org.eclipse.jetty.server.handler.gzip.GzipHandler.handle(GzipHandler.java:395)
	at org.eclipse.jetty.server.handler.HandlerWrapper.handle(HandlerWrapper.java:134)
	at org.eclipse.jetty.server.Server.handle(Server.java:534)
	at org.eclipse.jetty.server.HttpChannel.handle(HttpChannel.java:320)
	at org.eclipse.jetty.server.HttpConnection.onFillable(HttpConnection.java:251)
	at org.eclipse.jetty.io.AbstractConnection$ReadCallback.succeeded(AbstractConnection.java:273)
	at org.eclipse.jetty.io.FillInterest.fillable(FillInterest.java:95)
	at org.eclipse.jetty.io.ssl.SslConnection.onFillable(SslConnection.java:202)
	at org.eclipse.jetty.io.AbstractConnection$ReadCallback.succeeded(AbstractConnection.java:273)
	at org.eclipse.jetty.io.FillInterest.fillable(FillInterest.java:95)
	at org.eclipse.jetty.io.SelectChannelEndPoint$2.run(SelectChannelEndPoint.java:93)
	at org.eclipse.jetty.util.thread.strategy.ExecuteProduceConsume.executeProduceConsume(ExecuteProduceConsume.java:303)
	at org.eclipse.jetty.util.thread.strategy.ExecuteProduceConsume.produceConsume(ExecuteProduceConsume.java:148)
	at org.eclipse.jetty.util.thread.strategy.ExecuteProduceConsume.run(ExecuteProduceConsume.java:136)
	at org.eclipse.jetty.util.thread.QueuedThreadPool.runJob(QueuedThreadPool.java:671)
	at org.eclipse.jetty.util.thread.QueuedThreadPool$2.run(QueuedThreadPool.java:589)
	at java.lang.Thread.run(Thread.java:748)

org.apache.solr.common.util.ObjectReleaseTracker$ObjectTrackerException: org.apache.lucene.store.MockDirectoryWrapper
	at org.apache.solr.common.util.ObjectReleaseTracker.track(ObjectReleaseTracker.java:42)
	at org.apache.solr.core.CachingDirectoryFactory.get(CachingDirectoryFactory.java:348)
	at org.apache.solr.update.SolrIndexWriter.create(SolrIndexWriter.java:92)
	at org.apache.solr.core.SolrCore.initIndex(SolrCore.java:741)
	at org.apache.solr.core.SolrCore.<init>(SolrCore.java:934)
	at org.apache.solr.core.SolrCore.<init>(SolrCore.java:843)
	at org.apache.solr.core.CoreContainer.create(CoreContainer.java:969)
	at org.apache.solr.core.CoreContainer.create(CoreContainer.java:904)
	at org.apache.solr.handler.admin.CoreAdminOperation.lambda$static$0(CoreAdminOperation.java:91)
	at org.apache.solr.handler.admin.CoreAdminOperation.execute(CoreAdminOperation.java:384)
	at org.apache.solr.handler.admin.CoreAdminHandler$CallInfo.call(CoreAdminHandler.java:389)
	at org.apache.solr.handler.admin.CoreAdminHandler.handleRequestBody(CoreAdminHandler.java:174)
	at org.apache.solr.handler.RequestHandlerBase.handleRequest(RequestHandlerBase.java:177)
	at org.apache.solr.servlet.HttpSolrCall.handleAdmin(HttpSolrCall.java:745)
	at org.apache.solr.servlet.HttpSolrCall.handleAdminRequest(HttpSolrCall.java:726)
	at org.apache.solr.servlet.HttpSolrCall.call(HttpSolrCall.java:507)
	at org.apache.solr.servlet.SolrDispatchFilter.doFilter(SolrDispatchFilter.java:378)
	at org.apache.solr.servlet.SolrDispatchFilter.doFilter(SolrDispatchFilter.java:322)
	at org.eclipse.jetty.servlet.ServletHandler$CachedChain.doFilter(ServletHandler.java:1699)
	at org.apache.solr.client.solrj.embedded.JettySolrRunner$DebugFilter.doFilter(JettySolrRunner.java:139)
	at org.eclipse.jetty.servlet.ServletHandler$CachedChain.doFilter(ServletHandler.java:1699)
	at org.eclipse.jetty.servlet.ServletHandler.doHandle(ServletHandler.java:582)
	at org.eclipse.jetty.server.session.SessionHandler.doHandle(SessionHandler.java:224)
	at org.eclipse.jetty.server.handler.ContextHandler.doHandle(ContextHandler.java:1180)
	at org.eclipse.jetty.servlet.ServletHandler.doScope(ServletHandler.java:512)
	at org.eclipse.jetty.server.session.SessionHandler.doScope(SessionHandler.java:185)
	at org.eclipse.jetty.server.handler.ContextHandler.doScope(ContextHandler.java:1112)
	at org.eclipse.jetty.server.handler.ScopedHandler.handle(ScopedHandler.java:141)
	at org.eclipse.jetty.server.handler.gzip.GzipHandler.handle(GzipHandler.java:395)
	at org.eclipse.jetty.server.handler.HandlerWrapper.handle(HandlerWrapper.java:134)
	at org.eclipse.jetty.server.Server.handle(Server.java:534)
	at org.eclipse.jetty.server.HttpChannel.handle(HttpChannel.java:320)
	at org.eclipse.jetty.server.HttpConnection.onFillable(HttpConnection.java:251)
	at org.eclipse.jetty.io.AbstractConnection$ReadCallback.succeeded(AbstractConnection.java:273)
	at org.eclipse.jetty.io.FillInterest.fillable(FillInterest.java:95)
	at org.eclipse.jetty.io.ssl.SslConnection.onFillable(SslConnection.java:202)
	at org.eclipse.jetty.io.AbstractConnection$ReadCallback.succeeded(AbstractConnection.java:273)
	at org.eclipse.jetty.io.FillInterest.fillable(FillInterest.java:95)
	at org.eclipse.jetty.io.SelectChannelEndPoint$2.run(SelectChannelEndPoint.java:93)
	at org.eclipse.jetty.util.thread.strategy.ExecuteProduceConsume.executeProduceConsume(ExecuteProduceConsume.java:303)
	at org.eclipse.jetty.util.thread.strategy.ExecuteProduceConsume.produceConsume(ExecuteProduceConsume.java:148)
	at org.eclipse.jetty.util.thread.strategy.ExecuteProduceConsume.run(ExecuteProduceConsume.java:136)
	at org.eclipse.jetty.util.thread.QueuedThreadPool.runJob(QueuedThreadPool.java:671)
	at org.eclipse.jetty.util.thread.QueuedThreadPool$2.run(QueuedThreadPool.java:589)
	at java.lang.Thread.run(Thread.java:748)

org.apache.solr.common.util.ObjectReleaseTracker$ObjectTrackerException: org.apache.solr.core.SolrCore
	at org.apache.solr.common.util.ObjectReleaseTracker.track(ObjectReleaseTracker.java:42)
	at org.apache.solr.core.SolrCore.<init>(SolrCore.java:1019)
	at org.apache.solr.core.SolrCore.<init>(SolrCore.java:843)
	at org.apache.solr.core.CoreContainer.create(CoreContainer.java:969)
	at org.apache.solr.core.CoreContainer.create(CoreContainer.java:904)
	at org.apache.solr.handler.admin.CoreAdminOperation.lambda$static$0(CoreAdminOperation.java:91)
	at org.apache.solr.handler.admin.CoreAdminOperation.execute(CoreAdminOperation.java:384)
	at org.apache.solr.handler.admin.CoreAdminHandler$CallInfo.call(CoreAdminHandler.java:389)
	at org.apache.solr.handler.admin.CoreAdminHandler.handleRequestBody(CoreAdminHandler.java:174)
	at org.apache.solr.handler.RequestHandlerBase.handleRequest(RequestHandlerBase.java:177)
	at org.apache.solr.servlet.HttpSolrCall.handleAdmin(HttpSolrCall.java:745)
	at org.apache.solr.servlet.HttpSolrCall.handleAdminRequest(HttpSolrCall.java:726)
	at org.apache.solr.servlet.HttpSolrCall.call(HttpSolrCall.java:507)
	at org.apache.solr.servlet.SolrDispatchFilter.doFilter(SolrDispatchFilter.java:378)
	at org.apache.solr.servlet.SolrDispatchFilter.doFilter(SolrDispatchFilter.java:322)
	at org.eclipse.jetty.servlet.ServletHandler$CachedChain.doFilter(ServletHandler.java:1699)
	at org.apache.solr.client.solrj.embedded.JettySolrRunner$DebugFilter.doFilter(JettySolrRunner.java:139)
	at org.eclipse.jetty.servlet.ServletHandler$CachedChain.doFilter(ServletHandler.java:1699)
	at org.eclipse.jetty.servlet.ServletHandler.doHandle(ServletHandler.java:582)
	at org.eclipse.jetty.server.session.SessionHandler.doHandle(SessionHandler.java:224)
	at org.eclipse.jetty.server.handler.ContextHandler.doHandle(ContextHandler.java:1180)
	at org.eclipse.jetty.servlet.ServletHandler.doScope(ServletHandler.java:512)
	at org.eclipse.jetty.server.session.SessionHandler.doScope(SessionHandler.java:185)
	at org.eclipse.jetty.server.handler.ContextHandler.doScope(ContextHandler.java:1112)
	at org.eclipse.jetty.server.handler.ScopedHandler.handle(ScopedHandler.java:141)
	at org.eclipse.jetty.server.handler.gzip.GzipHandler.handle(GzipHandler.java:395)
	at org.eclipse.jetty.server.handler.HandlerWrapper.handle(HandlerWrapper.java:134)
	at org.eclipse.jetty.server.Server.handle(Server.java:534)
	at org.eclipse.jetty.server.HttpChannel.handle(HttpChannel.java:320)
	at org.eclipse.jetty.server.HttpConnection.onFillable(HttpConnection.java:251)
	at org.eclipse.jetty.io.AbstractConnection$ReadCallback.succeeded(AbstractConnection.java:273)
	at org.eclipse.jetty.io.FillInterest.fillable(FillInterest.java:95)
	at org.eclipse.jetty.io.ssl.SslConnection.onFillable(SslConnection.java:202)
	at org.eclipse.jetty.io.AbstractConnection$ReadCallback.succeeded(AbstractConnection.java:273)
	at org.eclipse.jetty.io.FillInterest.fillable(FillInterest.java:95)
	at org.eclipse.jetty.io.SelectChannelEndPoint$2.run(SelectChannelEndPoint.java:93)
	at org.eclipse.jetty.util.thread.strategy.ExecuteProduceConsume.executeProduceConsume(ExecuteProduceConsume.java:303)
	at org.eclipse.jetty.util.thread.strategy.ExecuteProduceConsume.produceConsume(ExecuteProduceConsume.java:148)
	at org.eclipse.jetty.util.thread.strategy.ExecuteProduceConsume.run(ExecuteProduceConsume.java:136)
	at org.eclipse.jetty.util.thread.QueuedThreadPool.runJob(QueuedThreadPool.java:671)
	at org.eclipse.jetty.util.thread.QueuedThreadPool$2.run(QueuedThreadPool.java:589)
	at java.lang.Thread.run(Thread.java:748)

org.apache.solr.common.util.ObjectReleaseTracker$ObjectTrackerException: org.apache.lucene.store.MockDirectoryWrapper
	at org.apache.solr.common.util.ObjectReleaseTracker.track(ObjectReleaseTracker.java:42)
	at org.apache.solr.core.CachingDirectoryFactory.get(CachingDirectoryFactory.java:348)
	at org.apache.solr.handler.IndexFetcher.fetchLatestIndex(IndexFetcher.java:484)
	at org.apache.solr.handler.IndexFetcher.fetchLatestIndex(IndexFetcher.java:332)
	at org.apache.solr.handler.ReplicationHandler.doFetch(ReplicationHandler.java:419)
	at org.apache.solr.handler.ReplicationHandler.lambda$setupPolling$12(ReplicationHandler.java:1183)
	at java.util.concurrent.Executors$RunnableAdapter.call(Executors.java:511)
	at java.util.concurrent.FutureTask.runAndReset(FutureTask.java:308)
	at java.util.concurrent.ScheduledThreadPoolExecutor$ScheduledFutureTask.access$301(ScheduledThreadPoolExecutor.java:180)
	at java.util.concurrent.ScheduledThreadPoolExecutor$ScheduledFutureTask.run(ScheduledThreadPoolExecutor.java:294)
	at java.util.concurrent.ThreadPoolExecutor.runWorker(ThreadPoolExecutor.java:1142)
	at java.util.concurrent.ThreadPoolExecutor$Worker.run(ThreadPoolExecutor.java:617)
	at java.lang.Thread.run(Thread.java:748)


	at __randomizedtesting.SeedInfo.seed([CEA6879DE649CF57]:0)
	at org.junit.Assert.fail(Assert.java:93)
	at org.junit.Assert.assertTrue(Assert.java:43)
	at org.junit.Assert.assertNull(Assert.java:551)
	at org.apache.solr.SolrTestCaseJ4.teardownTestCases(SolrTestCaseJ4.java:296)
	at sun.reflect.GeneratedMethodAccessor54.invoke(Unknown Source)
	at sun.reflect.DelegatingMethodAccessorImpl.invoke(DelegatingMethodAccessorImpl.java:43)
	at java.lang.reflect.Method.invoke(Method.java:498)
	at com.carrotsearch.randomizedtesting.RandomizedRunner.invoke(RandomizedRunner.java:1713)
	at com.carrotsearch.randomizedtesting.RandomizedRunner$7.evaluate(RandomizedRunner.java:870)
	at com.carrotsearch.randomizedtesting.rules.StatementAdapter.evaluate(StatementAdapter.java:36)
	at com.carrotsearch.randomizedtesting.rules.SystemPropertiesRestoreRule$1.evaluate(SystemPropertiesRestoreRule.java:57)
	at org.apache.lucene.util.AbstractBeforeAfterRule$1.evaluate(AbstractBeforeAfterRule.java:45)
	at com.carrotsearch.randomizedtesting.rules.StatementAdapter.evaluate(StatementAdapter.java:36)
	at org.apache.lucene.util.TestRuleStoreClassName$1.evaluate(TestRuleStoreClassName.java:41)
	at com.carrotsearch.randomizedtesting.rules.NoShadowingOrOverridesOnMethodsRule$1.evaluate(NoShadowingOrOverridesOnMethodsRule.java:40)
	at com.carrotsearch.randomizedtesting.rules.NoShadowingOrOverridesOnMethodsRule$1.evaluate(NoShadowingOrOverridesOnMethodsRule.java:40)
	at com.carrotsearch.randomizedtesting.rules.StatementAdapter.evaluate(StatementAdapter.java:36)
	at com.carrotsearch.randomizedtesting.rules.StatementAdapter.evaluate(StatementAdapter.java:36)
	at com.carrotsearch.randomizedtesting.rules.StatementAdapter.evaluate(StatementAdapter.java:36)
	at org.apache.lucene.util.TestRuleAssertionsRequired$1.evaluate(TestRuleAssertionsRequired.java:53)
	at org.apache.lucene.util.TestRuleMarkFailure$1.evaluate(TestRuleMarkFailure.java:47)
	at org.apache.lucene.util.TestRuleIgnoreAfterMaxFailures$1.evaluate(TestRuleIgnoreAfterMaxFailures.java:64)
	at org.apache.lucene.util.TestRuleIgnoreTestSuites$1.evaluate(TestRuleIgnoreTestSuites.java:54)
	at com.carrotsearch.randomizedtesting.rules.StatementAdapter.evaluate(StatementAdapter.java:36)
	at com.carrotsearch.randomizedtesting.ThreadLeakControl$StatementRunner.run(ThreadLeakControl.java:368)
	at java.lang.Thread.run(Thread.java:748)


FAILED:  junit.framework.TestSuite.org.apache.solr.handler.component.InfixSuggestersTest

Error Message:
Could not remove the following files (in the order of attempts):    C:\Users\jenkins\workspace\Lucene-Solr-7.0-Windows\solr\build\solr-core\test\J0\temp\solr.handler.component.InfixSuggestersTest_CEA6879DE649CF57-001\init-core-data-001: java.nio.file.AccessDeniedException: C:\Users\jenkins\workspace\Lucene-Solr-7.0-Windows\solr\build\solr-core\test\J0\temp\solr.handler.component.InfixSuggestersTest_CEA6879DE649CF57-001\init-core-data-001    C:\Users\jenkins\workspace\Lucene-Solr-7.0-Windows\solr\build\solr-core\test\J0\temp\solr.handler.component.InfixSuggestersTest_CEA6879DE649CF57-001: java.nio.file.DirectoryNotEmptyException: C:\Users\jenkins\workspace\Lucene-Solr-7.0-Windows\solr\build\solr-core\test\J0\temp\solr.handler.component.InfixSuggestersTest_CEA6879DE649CF57-001 

Stack Trace:
java.io.IOException: Could not remove the following files (in the order of attempts):
   C:\Users\jenkins\workspace\Lucene-Solr-7.0-Windows\solr\build\solr-core\test\J0\temp\solr.handler.component.InfixSuggestersTest_CEA6879DE649CF57-001\init-core-data-001: java.nio.file.AccessDeniedException: C:\Users\jenkins\workspace\Lucene-Solr-7.0-Windows\solr\build\solr-core\test\J0\temp\solr.handler.component.InfixSuggestersTest_CEA6879DE649CF57-001\init-core-data-001
   C:\Users\jenkins\workspace\Lucene-Solr-7.0-Windows\solr\build\solr-core\test\J0\temp\solr.handler.component.InfixSuggestersTest_CEA6879DE649CF57-001: java.nio.file.DirectoryNotEmptyException: C:\Users\jenkins\workspace\Lucene-Solr-7.0-Windows\solr\build\solr-core\test\J0\temp\solr.handler.component.InfixSuggestersTest_CEA6879DE649CF57-001

	at __randomizedtesting.SeedInfo.seed([CEA6879DE649CF57]:0)
	at org.apache.lucene.util.IOUtils.rm(IOUtils.java:329)
	at org.apache.lucene.util.TestRuleTemporaryFilesCleanup.afterAlways(TestRuleTemporaryFilesCleanup.java:216)
	at com.carrotsearch.randomizedtesting.rules.TestRuleAdapter$1.afterAlways(TestRuleAdapter.java:31)
	at com.carrotsearch.randomizedtesting.rules.StatementAdapter.evaluate(StatementAdapter.java:43)
	at com.carrotsearch.randomizedtesting.rules.StatementAdapter.evaluate(StatementAdapter.java:36)
	at org.apache.lucene.util.TestRuleAssertionsRequired$1.evaluate(TestRuleAssertionsRequired.java:53)
	at org.apache.lucene.util.TestRuleMarkFailure$1.evaluate(TestRuleMarkFailure.java:47)
	at org.apache.lucene.util.TestRuleIgnoreAfterMaxFailures$1.evaluate(TestRuleIgnoreAfterMaxFailures.java:64)
	at org.apache.lucene.util.TestRuleIgnoreTestSuites$1.evaluate(TestRuleIgnoreTestSuites.java:54)
	at com.carrotsearch.randomizedtesting.rules.StatementAdapter.evaluate(StatementAdapter.java:36)
	at com.carrotsearch.randomizedtesting.ThreadLeakControl$StatementRunner.run(ThreadLeakControl.java:368)
	at java.lang.Thread.run(Thread.java:748)


FAILED:  junit.framework.TestSuite.org.apache.solr.handler.component.SuggestComponentTest

Error Message:
Could not remove the following files (in the order of attempts):    C:\Users\jenkins\workspace\Lucene-Solr-7.0-Windows\solr\build\solr-core\test\J1\temp\solr.handler.component.SuggestComponentTest_CEA6879DE649CF57-001\init-core-data-001: java.nio.file.DirectoryNotEmptyException: C:\Users\jenkins\workspace\Lucene-Solr-7.0-Windows\solr\build\solr-core\test\J1\temp\solr.handler.component.SuggestComponentTest_CEA6879DE649CF57-001\init-core-data-001    C:\Users\jenkins\workspace\Lucene-Solr-7.0-Windows\solr\build\solr-core\test\J1\temp\solr.handler.component.SuggestComponentTest_CEA6879DE649CF57-001\init-core-data-001\suggest_fuzzy_doc_manal_build: java.nio.file.AccessDeniedException: C:\Users\jenkins\workspace\Lucene-Solr-7.0-Windows\solr\build\solr-core\test\J1\temp\solr.handler.component.SuggestComponentTest_CEA6879DE649CF57-001\init-core-data-001\suggest_fuzzy_doc_manal_build    C:\Users\jenkins\workspace\Lucene-Solr-7.0-Windows\solr\build\solr-core\test\J1\temp\solr.handler.component.SuggestComponentTest_CEA6879DE649CF57-001: java.nio.file.DirectoryNotEmptyException: C:\Users\jenkins\workspace\Lucene-Solr-7.0-Windows\solr\build\solr-core\test\J1\temp\solr.handler.component.SuggestComponentTest_CEA6879DE649CF57-001 

Stack Trace:
java.io.IOException: Could not remove the following files (in the order of attempts):
   C:\Users\jenkins\workspace\Lucene-Solr-7.0-Windows\solr\build\solr-core\test\J1\temp\solr.handler.component.SuggestComponentTest_CEA6879DE649CF57-001\init-core-data-001: java.nio.file.DirectoryNotEmptyException: C:\Users\jenkins\workspace\Lucene-Solr-7.0-Windows\solr\build\solr-core\test\J1\temp\solr.handler.component.SuggestComponentTest_CEA6879DE649CF57-001\init-core-data-001
   C:\Users\jenkins\workspace\Lucene-Solr-7.0-Windows\solr\build\solr-core\test\J1\temp\solr.handler.component.SuggestComponentTest_CEA6879DE649CF57-001\init-core-data-001\suggest_fuzzy_doc_manal_build: java.nio.file.AccessDeniedException: C:\Users\jenkins\workspace\Lucene-Solr-7.0-Windows\solr\build\solr-core\test\J1\temp\solr.handler.component.SuggestComponentTest_CEA6879DE649CF57-001\init-core-data-001\suggest_fuzzy_doc_manal_build
   C:\Users\jenkins\workspace\Lucene-Solr-7.0-Windows\solr\build\solr-core\test\J1\temp\solr.handler.component.SuggestComponentTest_CEA6879DE649CF57-001: java.nio.file.DirectoryNotEmptyException: C:\Users\jenkins\workspace\Lucene-Solr-7.0-Windows\solr\build\solr-core\test\J1\temp\solr.handler.component.SuggestComponentTest_CEA6879DE649CF57-001

	at __randomizedtesting.SeedInfo.seed([CEA6879DE649CF57]:0)
	at org.apache.lucene.util.IOUtils.rm(IOUtils.java:329)
	at org.apache.lucene.util.TestRuleTemporaryFilesCleanup.afterAlways(TestRuleTemporaryFilesCleanup.java:216)
	at com.carrotsearch.randomizedtesting.rules.TestRuleAdapter$1.afterAlways(TestRuleAdapter.java:31)
	at com.carrotsearch.randomizedtesting.rules.StatementAdapter.evaluate(StatementAdapter.java:43)
	at com.carrotsearch.randomizedtesting.rules.StatementAdapter.evaluate(StatementAdapter.java:36)
	at org.apache.lucene.util.TestRuleAssertionsRequired$1.evaluate(TestRuleAssertionsRequired.java:53)
	at org.apache.lucene.util.TestRuleMarkFailure$1.evaluate(TestRuleMarkFailure.java:47)
	at org.apache.lucene.util.TestRuleIgnoreAfterMaxFailures$1.evaluate(TestRuleIgnoreAfterMaxFailures.java:64)
	at org.apache.lucene.util.TestRuleIgnoreTestSuites$1.evaluate(TestRuleIgnoreTestSuites.java:54)
	at com.carrotsearch.randomizedtesting.rules.StatementAdapter.evaluate(StatementAdapter.java:36)
	at com.carrotsearch.randomizedtesting.ThreadLeakControl$StatementRunner.run(ThreadLeakControl.java:368)
	at java.lang.Thread.run(Thread.java:748)




Build Log:
[...truncated 11410 lines...]
   [junit4] Suite: org.apache.solr.cloud.TestTlogReplica
   [junit4]   2> Creating dataDir: C:\Users\jenkins\workspace\Lucene-Solr-7.0-Windows\solr\build\solr-core\test\J1\temp\solr.cloud.TestTlogReplica_CEA6879DE649CF57-001\init-core-data-001
   [junit4]   2> 627194 WARN  (SUITE-TestTlogReplica-seed#[CEA6879DE649CF57]-worker) [    ] o.a.s.SolrTestCaseJ4 startTrackingSearchers: numOpens=1 numCloses=1
   [junit4]   2> 627194 INFO  (SUITE-TestTlogReplica-seed#[CEA6879DE649CF57]-worker) [    ] o.a.s.SolrTestCaseJ4 Using PointFields (NUMERIC_POINTS_SYSPROP=true) w/NUMERIC_DOCVALUES_SYSPROP=true
   [junit4]   2> 627198 INFO  (SUITE-TestTlogReplica-seed#[CEA6879DE649CF57]-worker) [    ] o.a.s.SolrTestCaseJ4 Randomized ssl (true) and clientAuth (false) via: @org.apache.solr.util.RandomizeSSL(reason=, value=NaN, ssl=NaN, clientAuth=NaN)
   [junit4]   2> 627200 INFO  (SUITE-TestTlogReplica-seed#[CEA6879DE649CF57]-worker) [    ] o.a.s.c.MiniSolrCloudCluster Starting cluster of 2 servers in C:\Users\jenkins\workspace\Lucene-Solr-7.0-Windows\solr\build\solr-core\test\J1\temp\solr.cloud.TestTlogReplica_CEA6879DE649CF57-001\tempDir-001
   [junit4]   2> 627200 INFO  (SUITE-TestTlogReplica-seed#[CEA6879DE649CF57]-worker) [    ] o.a.s.c.ZkTestServer STARTING ZK TEST SERVER
   [junit4]   2> 627201 INFO  (Thread-998) [    ] o.a.s.c.ZkTestServer client port:0.0.0.0/0.0.0.0:0
   [junit4]   2> 627201 INFO  (Thread-998) [    ] o.a.s.c.ZkTestServer Starting server
   [junit4]   2> 627205 ERROR (Thread-998) [    ] o.a.z.s.ZooKeeperServer ZKShutdownHandler is not registered, so ZooKeeper server won't take any action on ERROR or SHUTDOWN server state changes
   [junit4]   2> 627300 INFO  (SUITE-TestTlogReplica-seed#[CEA6879DE649CF57]-worker) [    ] o.a.s.c.ZkTestServer start zk server on port:54546
   [junit4]   2> 627318 INFO  (jetty-launcher-792-thread-1) [    ] o.e.j.s.Server jetty-9.3.14.v20161028
   [junit4]   2> 627318 INFO  (jetty-launcher-792-thread-2) [    ] o.e.j.s.Server jetty-9.3.14.v20161028
   [junit4]   2> 627319 INFO  (jetty-launcher-792-thread-2) [    ] o.e.j.s.h.ContextHandler Started o.e.j.s.ServletContextHandler@78e242{/solr,null,AVAILABLE}
   [junit4]   2> 627319 INFO  (jetty-launcher-792-thread-1) [    ] o.e.j.s.h.ContextHandler Started o.e.j.s.ServletContextHandler@53f97a83{/solr,null,AVAILABLE}
   [junit4]   2> 627327 INFO  (jetty-launcher-792-thread-2) [    ] o.e.j.s.AbstractConnector Started ServerConnector@67afdf49{SSL,[ssl, http/1.1]}{127.0.0.1:54550}
   [junit4]   2> 627327 INFO  (jetty-launcher-792-thread-2) [    ] o.e.j.s.Server Started @631338ms
   [junit4]   2> 627327 INFO  (jetty-launcher-792-thread-2) [    ] o.a.s.c.s.e.JettySolrRunner Jetty properties: {hostContext=/solr, hostPort=54550}
   [junit4]   2> 627328 ERROR (jetty-launcher-792-thread-2) [    ] o.a.s.s.StartupLoggingUtils Missing Java Option solr.log.dir. Logging may be missing or incomplete.
   [junit4]   2> 627328 INFO  (jetty-launcher-792-thread-2) [    ] o.a.s.s.SolrDispatchFilter  ___      _       Welcome to Apache Solr? version 7.0.0
   [junit4]   2> 627328 INFO  (jetty-launcher-792-thread-2) [    ] o.a.s.s.SolrDispatchFilter / __| ___| |_ _   Starting in cloud mode on port null
   [junit4]   2> 627328 INFO  (jetty-launcher-792-thread-2) [    ] o.a.s.s.SolrDispatchFilter \__ \/ _ \ | '_|  Install dir: null, Default config dir: null
   [junit4]   2> 627328 INFO  (jetty-launcher-792-thread-2) [    ] o.a.s.s.SolrDispatchFilter |___/\___/_|_|    Start time: 2017-07-20T14:30:47.516Z
   [junit4]   2> 627328 INFO  (jetty-launcher-792-thread-1) [    ] o.e.j.s.AbstractConnector Started ServerConnector@12d1be67{SSL,[ssl, http/1.1]}{127.0.0.1:54551}
   [junit4]   2> 627328 INFO  (jetty-launcher-792-thread-1) [    ] o.e.j.s.Server Started @631339ms
   [junit4]   2> 627328 INFO  (jetty-launcher-792-thread-1) [    ] o.a.s.c.s.e.JettySolrRunner Jetty properties: {hostContext=/solr, hostPort=54551}
   [junit4]   2> 627328 ERROR (jetty-launcher-792-thread-1) [    ] o.a.s.s.StartupLoggingUtils Missing Java Option solr.log.dir. Logging may be missing or incomplete.
   [junit4]   2> 627329 INFO  (jetty-launcher-792-thread-1) [    ] o.a.s.s.SolrDispatchFilter  ___      _       Welcome to Apache Solr? version 7.0.0
   [junit4]   2> 627329 INFO  (jetty-launcher-792-thread-1) [    ] o.a.s.s.SolrDispatchFilter / __| ___| |_ _   Starting in cloud mode on port null
   [junit4]   2> 627329 INFO  (jetty-launcher-792-thread-1) [    ] o.a.s.s.SolrDispatchFilter \__ \/ _ \ | '_|  Install dir: null, Default config dir: null
   [junit4]   2> 627329 INFO  (jetty-launcher-792-thread-1) [    ] o.a.s.s.SolrDispatchFilter |___/\___/_|_|    Start time: 2017-07-20T14:30:47.517Z
   [junit4]   2> 627334 INFO  (jetty-launcher-792-thread-1) [    ] o.a.s.s.SolrDispatchFilter solr.xml found in ZooKeeper. Loading...
   [junit4]   2> 627336 INFO  (jetty-launcher-792-thread-2) [    ] o.a.s.s.SolrDispatchFilter solr.xml found in ZooKeeper. Loading...
   [junit4]   2> 627350 WARN  (NIOServerCxn.Factory:0.0.0.0/0.0.0.0:0) [    ] o.a.z.s.NIOServerCnxn caught end of stream exception
   [junit4]   2> EndOfStreamException: Unable to read additional data from client sessionid 0x15d60687f610002, likely client has closed socket
   [junit4]   2> 	at org.apache.zookeeper.server.NIOServerCnxn.doIO(NIOServerCnxn.java:239)
   [junit4]   2> 	at org.apache.zookeeper.server.NIOServerCnxnFactory.run(NIOServerCnxnFactory.java:203)
   [junit4]   2> 	at java.lang.Thread.run(Thread.java:748)
   [junit4]   2> 627356 INFO  (jetty-launcher-792-thread-1) [    ] o.a.s.c.ZkContainer Zookeeper client=127.0.0.1:54546/solr
   [junit4]   2> 627356 INFO  (jetty-launcher-792-thread-2) [    ] o.a.s.c.ZkContainer Zookeeper client=127.0.0.1:54546/solr
   [junit4]   2> 627373 WARN  (NIOServerCxn.Factory:0.0.0.0/0.0.0.0:0) [    ] o.a.z.s.NIOServerCnxn caught end of stream exception
   [junit4]   2> EndOfStreamException: Unable to read additional data from client sessionid 0x15d60687f610003, likely client has closed socket
   [junit4]   2> 	at org.apache.zookeeper.server.NIOServerCnxn.doIO(NIOServerCnxn.java:239)
   [junit4]   2> 	at org.apache.zookeeper.server.NIOServerCnxnFactory.run(NIOServerCnxnFactory.java:203)
   [junit4]   2> 	at java.lang.Thread.run(Thread.java:748)
   [junit4]   2> 627487 INFO  (jetty-launcher-792-thread-1) [n:127.0.0.1:54551_solr    ] o.a.s.c.Overseer Overseer (id=null) closing
   [junit4]   2> 627487 INFO  (jetty-launcher-792-thread-2) [n:127.0.0.1:54550_solr    ] o.a.s.c.Overseer Overseer (id=null) closing
   [junit4]   2> 627488 INFO  (jetty-launcher-792-thread-1) [n:127.0.0.1:54551_solr    ] o.a.s.c.OverseerElectionContext I am going to be the leader 127.0.0.1:54551_solr
   [junit4]   2> 627489 INFO  (jetty-launcher-792-thread-2) [n:127.0.0.1:54550_solr    ] o.a.s.c.ZkController Register node as live in ZooKeeper:/live_nodes/127.0.0.1:54550_solr
   [junit4]   2> 627489 INFO  (jetty-launcher-792-thread-1) [n:127.0.0.1:54551_solr    ] o.a.s.c.Overseer Overseer (id=98340768801947654-127.0.0.1:54551_solr-n_0000000000) starting
   [junit4]   2> 627523 INFO  (zkCallback-804-thread-1-processing-n:127.0.0.1:54551_solr) [n:127.0.0.1:54551_solr    ] o.a.s.c.c.ZkStateReader Updated live nodes from ZooKeeper... (0) -> (1)
   [junit4]   2> 627523 INFO  (zkCallback-803-thread-1-processing-n:127.0.0.1:54550_solr) [n:127.0.0.1:54550_solr    ] o.a.s.c.c.ZkStateReader Updated live nodes from ZooKeeper... (0) -> (1)
   [junit4]   2> 627529 INFO  (jetty-launcher-792-thread-1) [n:127.0.0.1:54551_solr    ] o.a.s.c.ZkController Register node as live in ZooKeeper:/live_nodes/127.0.0.1:54551_solr
   [junit4]   2> 627557 INFO  (zkCallback-804-thread-1-processing-n:127.0.0.1:54551_solr) [n:127.0.0.1:54551_solr    ] o.a.s.c.c.ZkStateReader Updated live nodes from ZooKeeper... (1) -> (2)
   [junit4]   2> 627557 INFO  (zkCallback-803-thread-1-processing-n:127.0.0.1:54550_solr) [n:127.0.0.1:54550_solr    ] o.a.s.c.c.ZkStateReader Updated live nodes from ZooKeeper... (1) -> (2)
   [junit4]   2> 627591 INFO  (jetty-launcher-792-thread-2) [n:127.0.0.1:54550_solr    ] o.a.s.m.r.SolrJmxReporter JMX monitoring for 'solr_54550.solr.node' (registry 'solr.node') enabled at server: com.sun.jmx.mbeanserver.JmxMBeanServer@3dc912a
   [junit4]   2> 627593 INFO  (jetty-launcher-792-thread-2) [n:127.0.0.1:54550_solr    ] o.a.s.m.r.SolrJmxReporter JMX monitoring for 'solr_54550.solr.jvm' (registry 'solr.jvm') enabled at server: com.sun.jmx.mbeanserver.JmxMBeanServer@3dc912a
   [junit4]   2> 627593 INFO  (jetty-launcher-792-thread-2) [n:127.0.0.1:54550_solr    ] o.a.s.m.r.SolrJmxReporter JMX monitoring for 'solr_54550.solr.jetty' (registry 'solr.jetty') enabled at server: com.sun.jmx.mbeanserver.JmxMBeanServer@3dc912a
   [junit4]   2> 627594 INFO  (jetty-launcher-792-thread-2) [n:127.0.0.1:54550_solr    ] o.a.s.c.CorePropertiesLocator Found 0 core definitions underneath C:\Users\jenkins\workspace\Lucene-Solr-7.0-Windows\solr\build\solr-core\test\J1\temp\solr.cloud.TestTlogReplica_CEA6879DE649CF57-001\tempDir-001\node2\.
   [junit4]   2> 627598 INFO  (jetty-launcher-792-thread-1) [n:127.0.0.1:54551_solr    ] o.a.s.m.r.SolrJmxReporter JMX monitoring for 'solr_54551.solr.node' (registry 'solr.node') enabled at server: com.sun.jmx.mbeanserver.JmxMBeanServer@3dc912a
   [junit4]   2> 627599 INFO  (jetty-launcher-792-thread-1) [n:127.0.0.1:54551_solr    ] o.a.s.m.r.SolrJmxReporter JMX monitoring for 'solr_54551.solr.jvm' (registry 'solr.jvm') enabled at server: com.sun.jmx.mbeanserver.JmxMBeanServer@3dc912a
   [junit4]   2> 627599 INFO  (jetty-launcher-792-thread-1) [n:127.0.0.1:54551_solr    ] o.a.s.m.r.SolrJmxReporter JMX monitoring for 'solr_54551.solr.jetty' (registry 'solr.jetty') enabled at server: com.sun.jmx.mbeanserver.JmxMBeanServer@3dc912a
   [junit4]   2> 627601 INFO  (jetty-launcher-792-thread-1) [n:127.0.0.1:54551_solr    ] o.a.s.c.CorePropertiesLocator Found 0 core definitions underneath C:\Users\jenkins\workspace\Lucene-Solr-7.0-Windows\solr\build\solr-core\test\J1\temp\solr.cloud.TestTlogReplica_CEA6879DE649CF57-001\tempDir-001\node1\.
   [junit4]   2> 627655 INFO  (SUITE-TestTlogReplica-seed#[CEA6879DE649CF57]-worker) [    ] o.a.s.c.c.ZkStateReader Updated live nodes from ZooKeeper... (0) -> (2)
   [junit4]   2> 627656 INFO  (SUITE-TestTlogReplica-seed#[CEA6879DE649CF57]-worker) [    ] o.a.s.c.s.i.ZkClientClusterStateProvider Cluster at 127.0.0.1:54546/solr ready
   [junit4]   2> 627663 INFO  (SUITE-TestTlogReplica-seed#[CEA6879DE649CF57]-worker) [    ] o.a.s.c.TestTlogReplica Using legacyCloud?: false
   [junit4]   2> 627683 INFO  (qtp1071604251-5147) [n:127.0.0.1:54551_solr    ] o.a.s.h.a.CollectionsHandler Invoked Collection Action :clusterprop with params val=false&name=legacyCloud&action=CLUSTERPROP&wt=javabin&version=2 and sendToOCPQueue=true
   [junit4]   2> 627687 INFO  (qtp1071604251-5147) [n:127.0.0.1:54551_solr    ] o.a.s.s.HttpSolrCall [admin] webapp=null path=/admin/collections params={val=false&name=legacyCloud&action=CLUSTERPROP&wt=javabin&version=2} status=0 QTime=3
   [junit4]   2> 627699 INFO  (TEST-TestTlogReplica.testKillTlogReplica-seed#[CEA6879DE649CF57]) [    ] o.a.s.SolrTestCaseJ4 ###Starting testKillTlogReplica
   [junit4]   2> 627701 INFO  (qtp1071604251-5143) [n:127.0.0.1:54551_solr    ] o.a.s.h.a.CollectionsHandler Invoked Collection Action :create with params pullReplicas=0&replicationFactor=0&collection.configName=conf&maxShardsPerNode=100&name=tlog_replica_test_kill_tlog_replica&nrtReplicas=0&action=CREATE&numShards=1&tlogReplicas=2&wt=javabin&version=2 and sendToOCPQueue=true
   [junit4]   2> 627708 INFO  (OverseerThreadFactory-2400-thread-1-processing-n:127.0.0.1:54551_solr) [n:127.0.0.1:54551_solr    ] o.a.s.c.CreateCollectionCmd Create collection tlog_replica_test_kill_tlog_replica
   [junit4]   2> 627818 INFO  (OverseerStateUpdate-98340768801947654-127.0.0.1:54551_solr-n_0000000000) [n:127.0.0.1:54551_solr    ] o.a.s.c.o.SliceMutator createReplica() {
   [junit4]   2>   "operation":"ADDREPLICA",
   [junit4]   2>   "collection":"tlog_replica_test_kill_tlog_replica",
   [junit4]   2>   "shard":"shard1",
   [junit4]   2>   "core":"tlog_replica_test_kill_tlog_replica_shard1_replica_t1",
   [junit4]   2>   "state":"down",
   [junit4]   2>   "base_url":"https://127.0.0.1:54550/solr",
   [junit4]   2>   "type":"TLOG"} 
   [junit4]   2> 627820 INFO  (OverseerStateUpdate-98340768801947654-127.0.0.1:54551_solr-n_0000000000) [n:127.0.0.1:54551_solr    ] o.a.s.c.o.SliceMutator createReplica() {
   [junit4]   2>   "operation":"ADDREPLICA",
   [junit4]   2>   "collection":"tlog_replica_test_kill_tlog_replica",
   [junit4]   2>   "shard":"shard1",
   [junit4]   2>   "core":"tlog_replica_test_kill_tlog_replica_shard1_replica_t2",
   [junit4]   2>   "state":"down",
   [junit4]   2>   "base_url":"https://127.0.0.1:54551/solr",
   [junit4]   2>   "type":"TLOG"} 
   [junit4]   2> 628039 INFO  (qtp1071604251-5142) [n:127.0.0.1:54551_solr    ] o.a.s.h.a.CoreAdminOperation core create command qt=/admin/cores&coreNodeName=core_node2&collection.configName=conf&newCollection=true&name=tlog_replica_test_kill_tlog_replica_shard1_replica_t2&action=CREATE&numShards=1&collection=tlog_replica_test_kill_tlog_replica&shard=shard1&wt=javabin&version=2&replicaType=TLOG
   [junit4]   2> 628040 INFO  (qtp1071604251-5142) [n:127.0.0.1:54551_solr    ] o.a.s.c.TransientSolrCoreCacheDefault Allocating transient cache for 2147483647 transient cores
   [junit4]   2> 628050 INFO  (qtp44117353-5146) [n:127.0.0.1:54550_solr    ] o.a.s.h.a.CoreAdminOperation core create command qt=/admin/cores&coreNodeName=core_node1&collection.configName=conf&newCollection=true&name=tlog_replica_test_kill_tlog_replica_shard1_replica_t1&action=CREATE&numShards=1&collection=tlog_replica_test_kill_tlog_replica&shard=shard1&wt=javabin&version=2&replicaType=TLOG
   [junit4]   2> 628051 INFO  (qtp44117353-5146) [n:127.0.0.1:54550_solr    ] o.a.s.c.TransientSolrCoreCacheDefault Allocating transient cache for 2147483647 transient cores
   [junit4]   2> 628157 INFO  (zkCallback-804-thread-1-processing-n:127.0.0.1:54551_solr) [n:127.0.0.1:54551_solr    ] o.a.s.c.c.ZkStateReader A cluster state change: [WatchedEvent state:SyncConnected type:NodeDataChanged path:/collections/tlog_replica_test_kill_tlog_replica/state.json] for collection [tlog_replica_test_kill_tlog_replica] has occurred - updating... (live nodes size: [2])
   [junit4]   2> 628157 INFO  (zkCallback-803-thread-1-processing-n:127.0.0.1:54550_solr) [n:127.0.0.1:54550_solr    ] o.a.s.c.c.ZkStateReader A cluster state change: [WatchedEvent state:SyncConnected type:NodeDataChanged path:/collections/tlog_replica_test_kill_tlog_replica/state.json] for collection [tlog_replica_test_kill_tlog_replica] has occurred - updating... (live nodes size: [2])
   [junit4]   2> 628158 INFO  (zkCallback-804-thread-2-processing-n:127.0.0.1:54551_solr) [n:127.0.0.1:54551_solr    ] o.a.s.c.c.ZkStateReader A cluster state change: [WatchedEvent state:SyncConnected type:NodeDataChanged path:/collections/tlog_replica_test_kill_tlog_replica/state.json] for collection [tlog_replica_test_kill_tlog_replica] has occurred - updating... (live nodes size: [2])
   [junit4]   2> 628158 INFO  (zkCallback-803-thread-2-processing-n:127.0.0.1:54550_solr) [n:127.0.0.1:54550_solr    ] o.a.s.c.c.ZkStateReader A cluster state change: [WatchedEvent state:SyncConnected type:NodeDataChanged path:/collections/tlog_replica_test_kill_tlog_replica/state.json] for collection [tlog_replica_test_kill_tlog_replica] has occurred - updating... (live nodes size: [2])
   [junit4]   2> 629079 INFO  (qtp1071604251-5142) [n:127.0.0.1:54551_solr c:tlog_replica_test_kill_tlog_replica s:shard1 r:core_node2 x:tlog_replica_test_kill_tlog_replica_shard1_replica_t2] o.a.s.c.SolrConfig Using Lucene MatchVersion: 7.0.0
   [junit4]   2> 629079 INFO  (qtp44117353-5146) [n:127.0.0.1:54550_solr c:tlog_replica_test_kill_tlog_replica s:shard1 r:core_node1 x:tlog_replica_test_kill_tlog_replica_shard1_replica_t1] o.a.s.c.SolrConfig Using Lucene MatchVersion: 7.0.0
   [junit4]   2> 629100 INFO  (qtp44117353-5146) [n:127.0.0.1:54550_solr c:tlog_replica_test_kill_tlog_replica s:shard1 r:core_node1 x:tlog_replica_test_kill_tlog_replica_shard1_replica_t1] o.a.s.s.IndexSchema [tlog_replica_test_kill_tlog_replica_shard1_replica_t1] Schema name=minimal
   [junit4]   2> 629101 INFO  (qtp1071604251-5142) [n:127.0.0.1:54551_solr c:tlog_replica_test_kill_tlog_replica s:shard1 r:core_node2 x:tlog_replica_test_kill_tlog_replica_shard1_replica_t2] o.a.s.s.IndexSchema [tlog_replica_test_kill_tlog_replica_shard1_replica_t2] Schema name=minimal
   [junit4]   2> 629107 INFO  (qtp1071604251-5142) [n:127.0.0.1:54551_solr c:tlog_replica_test_kill_tlog_replica s:shard1 r:core_node2 x:tlog_replica_test_kill_tlog_replica_shard1_replica_t2] o.a.s.s.IndexSchema Loaded schema minimal/1.1 with uniqueid field id
   [junit4]   2> 629107 INFO  (qtp44117353-5146) [n:127.0.0.1:54550_solr c:tlog_replica_test_kill_tlog_replica s:shard1 r:core_node1 x:tlog_replica_test_kill_tlog_replica_shard1_replica_t1] o.a.s.s.IndexSchema Loaded schema minimal/1.1 with uniqueid field id
   [junit4]   2> 629107 INFO  (qtp1071604251-5142) [n:127.0.0.1:54551_solr c:tlog_replica_test_kill_tlog_replica s:shard1 r:core_node2 x:tlog_replica_test_kill_tlog_replica_shard1_replica_t2] o.a.s.c.CoreContainer Creating SolrCore 'tlog_replica_test_kill_tlog_replica_shard1_replica_t2' using configuration from collection tlog_replica_test_kill_tlog_replica, trusted=true
   [junit4]   2> 629107 INFO  (qtp44117353-5146) [n:127.0.0.1:54550_solr c:tlog_replica_test_kill_tlog_replica s:shard1 r:core_node1 x:tlog_replica_test_kill_tlog_replica_shard1_replica_t1] o.a.s.c.CoreContainer Creating SolrCore 'tlog_replica_test_kill_tlog_replica_shard1_replica_t1' using configuration from collection tlog_replica_test_kill_tlog_replica, trusted=true
   [junit4]   2> 629108 INFO  (qtp1071604251-5142) [n:127.0.0.1:54551_solr c:tlog_replica_test_kill_tlog_replica s:shard1 r:core_node2 x:tlog_replica_test_kill_tlog_replica_shard1_replica_t2] o.a.s.m.r.SolrJmxReporter JMX monitoring for 'solr_54551.solr.core.tlog_replica_test_kill_tlog_replica.shard1.replica_t2' (registry 'solr.core.tlog_replica_test_kill_tlog_replica.shard1.replica_t2') enabled at server: com.sun.jmx.mbeanserver.JmxMBeanServer@3dc912a
   [junit4]   2> 629108 INFO  (qtp44117353-5146) [n:127.0.0.1:54550_solr c:tlog_replica_test_kill_tlog_replica s:shard1 r:core_node1 x:tlog_replica_test_kill_tlog_replica_shard1_replica_t1] o.a.s.m.r.SolrJmxReporter JMX monitoring for 'solr_54550.solr.core.tlog_replica_test_kill_tlog_replica.shard1.replica_t1' (registry 'solr.core.tlog_replica_test_kill_tlog_replica.shard1.replica_t1') enabled at server: com.sun.jmx.mbeanserver.JmxMBeanServer@3dc912a
   [junit4]   2> 629108 INFO  (qtp1071604251-5142) [n:127.0.0.1:54551_solr c:tlog_replica_test_kill_tlog_replica s:shard1 r:core_node2 x:tlog_replica_test_kill_tlog_replica_shard1_replica_t2] o.a.s.c.SolrCore solr.RecoveryStrategy.Builder
   [junit4]   2> 629109 INFO  (qtp44117353-5146) [n:127.0.0.1:54550_solr c:tlog_replica_test_kill_tlog_replica s:shard1 r:core_node1 x:tlog_replica_test_kill_tlog_replica_shard1_replica_t1] o.a.s.c.SolrCore solr.RecoveryStrategy.Builder
   [junit4]   2> 629109 INFO  (qtp1071604251-5142) [n:127.0.0.1:54551_solr c:tlog_replica_test_kill_tlog_replica s:shard1 r:core_node2 x:tlog_replica_test_kill_tlog_replica_shard1_replica_t2] o.a.s.c.SolrCore [[tlog_replica_test_kill_tlog_replica_shard1_replica_t2] ] Opening new SolrCore at [C:\Users\jenkins\workspace\Lucene-Solr-7.0-Windows\solr\build\solr-core\test\J1\temp\solr.cloud.TestTlogReplica_CEA6879DE649CF57-001\tempDir-001\node1\tlog_replica_test_kill_tlog_replica_shard1_replica_t2], dataDir=[C:\Users\jenkins\workspace\Lucene-Solr-7.0-Windows\solr\build\solr-core\test\J1\temp\solr.cloud.TestTlogReplica_CEA6879DE649CF57-001\tempDir-001\node1\.\tlog_replica_test_kill_tlog_replica_shard1_replica_t2\data\]
   [junit4]   2> 629109 INFO  (qtp44117353-5146) [n:127.0.0.1:54550_solr c:tlog_replica_test_kill_tlog_replica s:shard1 r:core_node1 x:tlog_replica_test_kill_tlog_replica_shard1_replica_t1] o.a.s.c.SolrCore [[tlog_replica_test_kill_tlog_replica_shard1_replica_t1] ] Opening new SolrCore at [C:\Users\jenkins\workspace\Lucene-Solr-7.0-Windows\solr\build\solr-core\test\J1\temp\solr.cloud.TestTlogReplica_CEA6879DE649CF57-001\tempDir-001\node2\tlog_replica_test_kill_tlog_replica_shard1_replica_t1], dataDir=[C:\Users\jenkins\workspace\Lucene-Solr-7.0-Windows\solr\build\solr-core\test\J1\temp\solr.cloud.TestTlogReplica_CEA6879DE649CF57-001\tempDir-001\node2\.\tlog_replica_test_kill_tlog_replica_shard1_replica_t1\data\]
   [junit4]   2> 629250 INFO  (qtp1071604251-5142) [n:127.0.0.1:54551_solr c:tlog_replica_test_kill_tlog_replica s:shard1 r:core_node2 x:tlog_replica_test_kill_tlog_replica_shard1_replica_t2] o.a.s.u.UpdateHandler Using UpdateLog implementation: org.apache.solr.update.UpdateLog
   [junit4]   2> 629250 INFO  (qtp1071604251-5142) [n:127.0.0.1:54551_solr c:tlog_replica_test_kill_tlog_replica s:shard1 r:core_node2 x:tlog_replica_test_kill_tlog_replica_shard1_replica_t2] o.a.s.u.UpdateLog Initializing UpdateLog: dataDir=null defaultSyncLevel=FLUSH numRecordsToKeep=100 maxNumLogsToKeep=10 numVersionBuckets=65536
   [junit4]   2> 629251 INFO  (qtp1071604251-5142) [n:127.0.0.1:54551_solr c:tlog_replica_test_kill_tlog_replica s:shard1 r:core_node2 x:tlog_replica_test_kill_tlog_replica_shard1_replica_t2] o.a.s.u.CommitTracker Hard AutoCommit: disabled
   [junit4]   2> 629251 INFO  (qtp1071604251-5142) [n:127.0.0.1:54551_solr c:tlog_replica_test_kill_tlog_replica s:shard1 r:core_node2 x:tlog_replica_test_kill_tlog_replica_shard1_replica_t2] o.a.s.u.CommitTracker Soft AutoCommit: disabled
   [junit4]   2> 629265 INFO  (qtp1071604251-5142) [n:127.0.0.1:54551_solr c:tlog_replica_test_kill_tlog_replica s:shard1 r:core_node2 x:tlog_replica_test_kill_tlog_replica_shard1_replica_t2] o.a.s.s.SolrIndexSearcher Opening [Searcher@1fa1e06f[tlog_replica_test_kill_tlog_replica_shard1_replica_t2] main]
   [junit4]   2> 629269 INFO  (qtp1071604251-5142) [n:127.0.0.1:54551_solr c:tlog_replica_test_kill_tlog_replica s:shard1 r:core_node2 x:tlog_replica_test_kill_tlog_replica_shard1_replica_t2] o.a.s.r.ManagedResourceStorage Configured ZooKeeperStorageIO with znodeBase: /configs/conf
   [junit4]   2> 629270 INFO  (qtp1071604251-5142) [n:127.0.0.1:54551_solr c:tlog_replica_test_kill_tlog_replica s:shard1 r:core_node2 x:tlog_replica_test_kill_tlog_replica_shard1_replica_t2] o.a.s.r.ManagedResourceStorage Loaded null at path _rest_managed.json using ZooKeeperStorageIO:path=/configs/conf
   [junit4]   2> 629271 INFO  (qtp1071604251-5142) [n:127.0.0.1:54551_solr c:tlog_replica_test_kill_tlog_replica s:shard1 r:core_node2 x:tlog_replica_test_kill_tlog_replica_shard1_replica_t2] o.a.s.h.ReplicationHandler Commits will be reserved for  10000
   [junit4]   2> 629272 INFO  (searcherExecutor-2403-thread-1-processing-n:127.0.0.1:54551_solr x:tlog_replica_test_kill_tlog_replica_shard1_replica_t2 s:shard1 c:tlog_replica_test_kill_tlog_replica r:core_node2) [n:127.0.0.1:54551_solr c:tlog_replica_test_kill_tlog_replica s:shard1 r:core_node2 x:tlog_replica_test_kill_tlog_replica_shard1_replica_t2] o.a.s.c.SolrCore [tlog_replica_test_kill_tlog_replica_shard1_replica_t2] Registered new searcher Searcher@1fa1e06f[tlog_replica_test_kill_tlog_replica_shard1_replica_t2] main{ExitableDirectoryReader(UninvertingDirectoryReader())}
   [junit4]   2> 629274 INFO  (qtp1071604251-5142) [n:127.0.0.1:54551_solr c:tlog_replica_test_kill_tlog_replica s:shard1 r:core_node2 x:tlog_replica_test_kill_tlog_replica_shard1_replica_t2] o.a.s.u.UpdateLog Could not find max version in index or recent updates, using new clock 1573452303000666112
   [junit4]   2> 629292 INFO  (qtp44117353-5146) [n:127.0.0.1:54550_solr c:tlog_replica_test_kill_tlog_replica s:shard1 r:core_node1 x:tlog_replica_test_kill_tlog_replica_shard1_replica_t1] o.a.s.u.UpdateHandler Using UpdateLog implementation: org.apache.solr.update.UpdateLog
   [junit4]   2> 629292 INFO  (qtp44117353-5146) [n:127.0.0.1:54550_solr c:tlog_replica_test_kill_tlog_replica s:shard1 r:core_node1 x:tlog_replica_test_kill_tlog_replica_shard1_replica_t1] o.a.s.u.UpdateLog Initializing UpdateLog: dataDir=null defaultSyncLevel=FLUSH numRecordsToKeep=100 maxNumLogsToKeep=10 numVersionBuckets=65536
   [junit4]   2> 629294 INFO  (qtp44117353-5146) [n:127.0.0.1:54550_solr c:tlog_replica_test_kill_tlog_replica s:shard1 r:core_node1 x:tlog_replica_test_kill_tlog_replica_shard1_replica_t1] o.a.s.u.CommitTracker Hard AutoCommit: disabled
   [junit4]   2> 629294 INFO  (qtp44117353-5146) [n:127.0.0.1:54550_solr c:tlog_replica_test_kill_tlog_replica s:shard1 r:core_node1 x:tlog_replica_test_kill_tlog_replica_shard1_replica_t1] o.a.s.u.CommitTracker Soft AutoCommit: disabled
   [junit4]   2> 629295 INFO  (qtp1071604251-5142) [n:127.0.0.1:54551_solr c:tlog_replica_test_kill_tlog_replica s:shard1 r:core_node2 x:tlog_replica_test_kill_tlog_replica_shard1_replica_t2] o.a.s.c.ShardLeaderElectionContext Waiting until we see more replicas up for shard shard1: total=2 found=1 timeoutin=9999ms
   [junit4]   2> 629298 INFO  (qtp44117353-5146) [n:127.0.0.1:54550_solr c:tlog_replica_test_kill_tlog_replica s:shard1 r:core_node1 x:tlog_replica_test_kill_tlog_replica_shard1_replica_t1] o.a.s.s.SolrIndexSearcher Opening [Searcher@1e531fee[tlog_replica_test_kill_tlog_replica_shard1_replica_t1] main]
   [junit4]   2> 629300 INFO  (qtp44117353-5146) [n:127.0.0.1:54550_solr c:tlog_replica_test_kill_tlog_replica s:shard1 r:core_node1 x:tlog_replica_test_kill_tlog_replica_shard1_replica_t1] o.a.s.r.ManagedResourceStorage Configured ZooKeeperStorageIO with znodeBase: /configs/conf
   [junit4]   2> 629300 INFO  (qtp44117353-5146) [n:127.0.0.1:54550_solr c:tlog_replica_test_kill_tlog_replica s:shard1 r:core_node1 x:tlog_replica_test_kill_tlog_replica_shard1_replica_t1] o.a.s.r.ManagedResourceStorage Loaded null at path _rest_managed.json using ZooKeeperStorageIO:path=/configs/conf
   [junit4]   2> 629301 INFO  (qtp44117353-5146) [n:127.0.0.1:54550_solr c:tlog_replica_test_kill_tlog_replica s:shard1 r:core_node1 x:tlog_replica_test_kill_tlog_replica_shard1_replica_t1] o.a.s.h.ReplicationHandler Commits will be reserved for  10000
   [junit4]   2> 629301 INFO  (qtp44117353-5146) [n:127.0.0.1:54550_solr c:tlog_replica_test_kill_tlog_replica s:shard1 r:core_node1 x:tlog_replica_test_kill_tlog_replica_shard1_replica_t1] o.a.s.u.UpdateLog Could not find max version in index or recent updates, using new clock 1573452303028977664
   [junit4]   2> 629304 INFO  (searcherExecutor-2404-thread-1-processing-n:127.0.0.1:54550_solr x:tlog_replica_test_kill_tlog_replica_shard1_replica_t1 s:shard1 c:tlog_replica_test_kill_tlog_replica r:core_node1) [n:127.0.0.1:54550_solr c:tlog_replica_test_kill_tlog_replica s:shard1 r:core_node1 x:tlog_replica_test_kill_tlog_replica_shard1_replica_t1] o.a.s.c.SolrCore [tlog_replica_test_kill_tlog_replica_shard1_replica_t1] Registered new searcher Searcher@1e531fee[tlog_replica_test_kill_tlog_replica_shard1_replica_t1] main{ExitableDirectoryReader(UninvertingDirectoryReader())}
   [junit4]   2> 629400 INFO  (zkCallback-804-thread-2-processing-n:127.0.0.1:54551_solr) [n:127.0.0.1:54551_solr    ] o.a.s.c.c.ZkStateReader A cluster state change: [WatchedEvent state:SyncConnected type:NodeDataChanged path:/collections/tlog_replica_test_kill_tlog_replica/state.json] for collection [tlog_replica_test_kill_tlog_replica] has occurred - updating... (live nodes size: [2])
   [junit4]   2> 629400 INFO  (zkCallback-804-thread-1-processing-n:127.0.0.1:54551_solr) [n:127.0.0.1:54551_solr    ] o.a.s.c.c.ZkStateReader A cluster state change: [WatchedEvent state:SyncConnected type:NodeDataChanged path:/collections/tlog_replica_test_kill_tlog_replica/state.json] for collection [tlog_replica_test_kill_tlog_replica] has occurred - updating... (live nodes size: [2])
   [junit4]   2> 629400 INFO  (zkCallback-803-thread-2-processing-n:127.0.0.1:54550_solr) [n:127.0.0.1:54550_solr    ] o.a.s.c.c.ZkStateReader A cluster state change: [WatchedEvent state:SyncConnected type:NodeDataChanged path:/collections/tlog_replica_test_kill_tlog_replica/state.json] for collection [tlog_replica_test_kill_tlog_replica] has occurred - updating... (live nodes size: [2])
   [junit4]   2> 629400 INFO  (zkCallback-803-thread-1-processing-n:127.0.0.1:54550_solr) [n:127.0.0.1:54550_solr    ] o.a.s.c.c.ZkStateReader A cluster state change: [WatchedEvent state:SyncConnected type:NodeDataChanged path:/collections/tlog_replica_test_kill_tlog_replica/state.json] for collection [tlog_replica_test_kill_tlog_replica] has occurred - updating... (live nodes size: [2])
   [junit4]   2> 629797 INFO  (qtp1071604251-5142) [n:127.0.0.1:54551_solr c:tlog_replica_test_kill_tlog_replica s:shard1 r:core_node2 x:tlog_replica_test_kill_tlog_replica_shard1_replica_t2] o.a.s.c.ShardLeaderElectionContext Enough replicas found to continue.
   [junit4]   2> 629797 INFO  (qtp1071604251-5142) [n:127.0.0.1:54551_solr c:tlog_replica_test_kill_tlog_replica s:shard1 r:core_node2 x:tlog_replica_test_kill_tlog_replica_shard1_replica_t2] o.a.s.c.ShardLeaderElectionContext I may be the new leader - try and sync
   [junit4]   2> 629797 INFO  (qtp1071604251-5142) [n:127.0.0.1:54551_solr c:tlog_replica_test_kill_tlog_replica s:shard1 r:core_node2 x:tlog_replica_test_kill_tlog_replica_shard1_replica_t2] o.a.s.c.SyncStrategy Sync replicas to https://127.0.0.1:54551/solr/tlog_replica_test_kill_tlog_replica_shard1_replica_t2/
   [junit4]   2> 629797 INFO  (qtp1071604251-5142) [n:127.0.0.1:54551_solr c:tlog_replica_test_kill_tlog_replica s:shard1 r:core_node2 x:tlog_replica_test_kill_tlog_replica_shard1_replica_t2] o.a.s.u.PeerSync PeerSync: core=tlog_replica_test_kill_tlog_replica_shard1_replica_t2 url=https://127.0.0.1:54551/solr START replicas=[https://127.0.0.1:54550/solr/tlog_replica_test_kill_tlog_replica_shard1_replica_t1/] nUpdates=100
   [junit4]   2> 629798 INFO  (qtp1071604251-5142) [n:127.0.0.1:54551_solr c:tlog_replica_test_kill_tlog_replica s:shard1 r:core_node2 x:tlog_replica_test_kill_tlog_replica_shard1_replica_t2] o.a.s.u.PeerSync PeerSync: core=tlog_replica_test_kill_tlog_replica_shard1_replica_t2 url=https://127.0.0.1:54551/solr DONE.  We have no versions.  sync failed.
   [junit4]   2> 629806 INFO  (qtp44117353-5159) [n:127.0.0.1:54550_solr c:tlog_replica_test_kill_tlog_replica s:shard1 r:core_node1 x:tlog_replica_test_kill_tlog_replica_shard1_replica_t1] o.a.s.c.S.Request [tlog_replica_test_kill_tlog_replica_shard1_replica_t1]  webapp=/solr path=/get params={distrib=false&qt=/get&fingerprint=false&getVersions=100&wt=javabin&version=2} status=0 QTime=0
   [junit4]   2> 629806 INFO  (qtp1071604251-5142) [n:127.0.0.1:54551_solr c:tlog_replica_test_kill_tlog_replica s:shard1 r:core_node2 x:tlog_replica_test_kill_tlog_replica_shard1_replica_t2] o.a.s.c.SyncStrategy Leader's attempt to sync with shard failed, moving to the next candidate
   [junit4]   2> 629806 INFO  (qtp1071604251-5142) [n:127.0.0.1:54551_solr c:tlog_replica_test_kill_tlog_replica s:shard1 r:core_node2 x:tlog_replica_test_kill_tlog_replica_shard1_replica_t2] o.a.s.c.ShardLeaderElectionContext We failed sync, but we have no versions - we can't sync in that case - we were active before, so become leader anyway
   [junit4]   2> 629806 INFO  (qtp1071604251-5142) [n:127.0.0.1:54551_solr c:tlog_replica_test_kill_tlog_replica s:shard1 r:core_node2 x:tlog_replica_test_kill_tlog_replica_shard1_replica_t2] o.a.s.c.ShardLeaderElectionContext Found all replicas participating in election, clear LIR
   [junit4]   2> 629807 INFO  (qtp1071604251-5142) [n:127.0.0.1:54551_solr c:tlog_replica_test_kill_tlog_replica s:shard1 r:core_node2 x:tlog_replica_test_kill_tlog_replica_shard1_replica_t2] o.a.s.c.ZkController tlog_replica_test_kill_tlog_replica_shard1_replica_t2 stopping background replication from leader
   [junit4]   2> 629814 INFO  (qtp1071604251-5142) [n:127.0.0.1:54551_solr c:tlog_replica_test_kill_tlog_replica s:shard1 r:core_node2 x:tlog_replica_test_kill_tlog_replica_shard1_replica_t2] o.a.s.c.ShardLeaderElectionContext I am the new leader: https://127.0.0.1:54551/solr/tlog_replica_test_kill_tlog_replica_shard1_replica_t2/ shard1
   [junit4]   2> 629920 INFO  (zkCallback-803-thread-1-processing-n:127.0.0.1:54550_solr) [n:127.0.0.1:54550_solr    ] o.a.s.c.c.ZkStateReader A cluster state change: [WatchedEvent state:SyncConnected type:NodeDataChanged path:/collections/tlog_replica_test_kill_tlog_replica/state.json] for collection [tlog_replica_test_kill_tlog_replica] has occurred - updating... (live nodes size: [2])
   [junit4]   2> 629920 INFO  (zkCallback-804-thread-2-processing-n:127.0.0.1:54551_solr) [n:127.0.0.1:54551_solr    ] o.a.s.c.c.ZkStateReader A cluster state change: [WatchedEvent state:SyncConnected type:NodeDataChanged path:/collections/tlog_replica_test_kill_tlog_replica/state.json] for collection [tlog_replica_test_kill_tlog_replica] has occurred - updating... (live nodes size: [2])
   [junit4]   2> 629920 INFO  (zkCallback-804-thread-1-processing-n:127.0.0.1:54551_solr) [n:127.0.0.1:54551_solr    ] o.a.s.c.c.ZkStateReader A cluster state change: [WatchedEvent state:SyncConnected type:NodeDataChanged path:/collections/tlog_replica_test_kill_tlog_replica/state.json] for collection [tlog_replica_test_kill_tlog_replica] has occurred - updating... (live nodes size: [2])
   [junit4]   2> 629920 INFO  (zkCallback-803-thread-2-processing-n:127.0.0.1:54550_solr) [n:127.0.0.1:54550_solr    ] o.a.s.c.c.ZkStateReader A cluster state change: [WatchedEvent state:SyncConnected type:NodeDataChanged path:/collections/tlog_replica_test_kill_tlog_replica/state.json] for collection [tlog_replica_test_kill_tlog_replica] has occurred - updating... (live nodes size: [2])
   [junit4]   2> 629967 INFO  (qtp1071604251-5142) [n:127.0.0.1:54551_solr c:tlog_replica_test_kill_tlog_replica s:shard1 r:core_node2 x:tlog_replica_test_kill_tlog_replica_shard1_replica_t2] o.a.s.c.ZkController I am the leader, no recovery necessary
   [junit4]   2> 629974 INFO  (qtp1071604251-5142) [n:127.0.0.1:54551_solr c:tlog_replica_test_kill_tlog_replica s:shard1 r:core_node2 x:tlog_replica_test_kill_tlog_replica_shard1_replica_t2] o.a.s.s.HttpSolrCall [admin] webapp=null path=/admin/cores params={qt=/admin/cores&coreNodeName=core_node2&collection.configName=conf&newCollection=true&name=tlog_replica_test_kill_tlog_replica_shard1_replica_t2&action=CREATE&numShards=1&collection=tlog_replica_test_kill_tlog_replica&shard=shard1&wt=javabin&version=2&replicaType=TLOG} status=0 QTime=1935
   [junit4]   2> 630076 INFO  (zkCallback-804-thread-1-processing-n:127.0.0.1:54551_solr) [n:127.0.0.1:54551_solr    ] o.a.s.c.c.ZkStateReader A cluster state change: [WatchedEvent state:SyncConnected type:NodeDataChanged path:/collections/tlog_replica_test_kill_tlog_replica/state.json] for collection [tlog_replica_test_kill_tlog_replica] has occurred - updating... (live nodes size: [2])
   [junit4]   2> 630076 INFO  (zkCallback-803-thread-2-processing-n:127.0.0.1:54550_solr) [n:127.0.0.1:54550_solr    ] o.a.s.c.c.ZkStateReader A cluster state change: [WatchedEvent state:SyncConnected type:NodeDataChanged path:/collections/tlog_replica_test_kill_tlog_replica/state.json] for collection [tlog_replica_test_kill_tlog_replica] has occurred - updating... (live nodes size: [2])
   [junit4]   2> 630076 INFO  (zkCallback-804-thread-2-processing-n:127.0.0.1:54551_solr) [n:127.0.0.1:54551_solr    ] o.a.s.c.c.ZkStateReader A cluster state change: [WatchedEvent state:SyncConnected type:NodeDataChanged path:/collections/tlog_replica_test_kill_tlog_replica/state.json] for collection [tlog_replica_test_kill_tlog_replica] has occurred - updating... (live nodes size: [2])
   [junit4]   2> 630076 INFO  (zkCallback-803-thread-1-processing-n:127.0.0.1:54550_solr) [n:127.0.0.1:54550_solr    ] o.a.s.c.c.ZkStateReader A cluster state change: [WatchedEvent state:SyncConnected type:NodeDataChanged path:/collections/tlog_replica_test_kill_tlog_replica/state.json] for collection [tlog_replica_test_kill_tlog_replica] has occurred - updating... (live nodes size: [2])
   [junit4]   2> 630308 INFO  (qtp44117353-5146) [n:127.0.0.1:54550_solr c:tlog_replica_test_kill_tlog_replica s:shard1 r:core_node1 x:tlog_replica_test_kill_tlog_replica_shard1_replica_t1] o.a.s.c.ZkController tlog_replica_test_kill_tlog_replica_shard1_replica_t1 starting background replication from leader
   [junit4]   2> 630309 INFO  (qtp44117353-5146) [n:127.0.0.1:54550_solr c:tlog_replica_test_kill_tlog_replica s:shard1 r:core_node1 x:tlog_replica_test_kill_tlog_replica_shard1_replica_t1] o.a.s.c.ReplicateFromLeader Will start replication from leader with poll interval: 00:00:03
   [junit4]   2> 630313 INFO  (qtp44117353-5146) [n:127.0.0.1:54550_solr c:tlog_replica_test_kill_tlog_replica s:shard1 r:core_node1 x:tlog_replica_test_kill_tlog_replica_shard1_replica_t1] o.a.s.h.ReplicationHandler Poll scheduled at an interval of 3000ms
   [junit4]   2> 630321 INFO  (qtp44117353-5146) [n:127.0.0.1:54550_solr c:tlog_replica_test_kill_tlog_replica s:shard1 r:core_node1 x:tlog_replica_test_kill_tlog_replica_shard1_replica_t1] o.a.s.s.HttpSolrCall [admin] webapp=null path=/admin/cores params={qt=/admin/cores&coreNodeName=core_node1&collection.configName=conf&newCollection=true&name=tlog_replica_test_kill_tlog_replica_shard1_replica_t1&action=CREATE&numShards=1&collection=tlog_replica_test_kill_tlog_replica&shard=shard1&wt=javabin&version=2&replicaType=TLOG} status=0 QTime=2271
   [junit4]   2> 630326 INFO  (qtp1071604251-5143) [n:127.0.0.1:54551_solr    ] o.a.s.h.a.CollectionsHandler Wait for new collection to be active for at most 30 seconds. Check all shard replicas
   [junit4]   2> 630422 INFO  (zkCallback-804-thread-2-processing-n:127.0.0.1:54551_solr) [n:127.0.0.1:54551_solr    ] o.a.s.c.c.ZkStateReader A cluster state change: [WatchedEvent state:SyncConnected type:NodeDataChanged path:/collections/tlog_replica_test_kill_tlog_replica/state.json] for collection [tlog_replica_test_kill_tlog_replica] has occurred - updating... (live nodes size: [2])
   [junit4]   2> 630422 INFO  (zkCallback-803-thread-2-processing-n:127.0.0.1:54550_solr) [n:127.0.0.1:54550_solr    ] o.a.s.c.c.ZkStateReader A cluster state change: [WatchedEvent state:SyncConnected type:NodeDataChanged path:/collections/tlog_replica_test_kill_tlog_replica/state.json] for collection [tlog_replica_test_kill_tlog_replica] has occurred - updating... (live nodes size: [2])
   [junit4]   2> 630422 INFO  (zkCallback-804-thread-1-processing-n:127.0.0.1:54551_solr) [n:127.0.0.1:54551_solr    ] o.a.s.c.c.ZkStateReader A cluster state change: [WatchedEvent state:SyncConnected type:NodeDataChanged path:/collections/tlog_replica_test_kill_tlog_replica/state.json] for collection [tlog_replica_test_kill_tlog_replica] has occurred - updating... (live nodes size: [2])
   [junit4]   2> 630422 INFO  (zkCallback-803-thread-1-processing-n:127.0.0.1:54550_solr) [n:127.0.0.1:54550_solr    ] o.a.s.c.c.ZkStateReader A cluster state change: [WatchedEvent state:SyncConnected type:NodeDataChanged path:/collections/tlog_replica_test_kill_tlog_replica/state.json] for collection [tlog_replica_test_kill_tlog_replica] has occurred - updating... (live nodes size: [2])
   [junit4]   2> 631327 INFO  (qtp1071604251-5143) [n:127.0.0.1:54551_solr    ] o.a.s.s.HttpSolrCall [admin] webapp=null path=/admin/collections params={pullReplicas=0&replicationFactor=0&collection.configName=conf&maxShardsPerNode=100&name=tlog_replica_test_kill_tlog_replica&nrtReplicas=0&action=CREATE&numShards=1&tlogReplicas=2&wt=javabin&version=2} status=0 QTime=3624
   [junit4]   2> 631337 INFO  (qtp44117353-5149) [n:127.0.0.1:54550_solr c:tlog_replica_test_kill_tlog_replica s:shard1 r:core_node1 x:tlog_replica_test_kill_tlog_replica_shard1_replica_t1] o.a.s.c.S.Request [tlog_replica_test_kill_tlog_replica_shard1_replica_t1]  webapp=/solr path=/select params={q=*:*&wt=javabin&version=2} hits=0 status=0 QTime=0
   [junit4]   2> 631345 INFO  (qtp1071604251-5160) [n:127.0.0.1:54551_solr c:tlog_replica_test_kill_tlog_replica s:shard1 r:core_node2 x:tlog_replica_test_kill_tlog_replica_shard1_replica_t2] o.a.s.c.S.Request [tlog_replica_test_kill_tlog_replica_shard1_replica_t2]  webapp=/solr path=/select params={q=*:*&wt=javabin&version=2} hits=0 status=0 QTime=0
   [junit4]   2> 631357 INFO  (qtp44117353-5154) [n:127.0.0.1:54550_solr c:tlog_replica_test_kill_tlog_replica s:shard1 r:core_node1 x:tlog_replica_test_kill_tlog_replica_shard1_replica_t1] o.a.s.u.p.LogUpdateProcessorFactory [tlog_replica_test_kill_tlog_replica_shard1_replica_t1]  webapp=/solr path=/update params={update.distrib=FROMLEADER&distrib.from=https://127.0.0.1:54551/solr/tlog_replica_test_kill_tlog_replica_shard1_replica_t2/&wt=javabin&version=2}{add=[1 (1573452305175412736)]} 0 2
   [junit4]   2> 631357 INFO  (qtp1071604251-5155) [n:127.0.0.1:54551_solr c:tlog_replica_test_kill_tlog_replica s:shard1 r:core_node2 x:tlog_replica_test_kill_tlog_replica_shard1_replica_t2] o.a.s.u.p.LogUpdateProcessorFactory [tlog_replica_test_kill_tlog_replica_shard1_replica_t2]  webapp=/solr path=/update params={wt=javabin&version=2}{add=[1 (1573452305175412736)]} 0 9
   [junit4]   2> 631360 INFO  (qtp44117353-5145) [n:127.0.0.1:54550_solr c:tlog_replica_test_kill_tlog_replica s:shard1 r:core_node1 x:tlog_replica_test_kill_tlog_replica_shard1_replica_t1] o.a.s.u.p.LogUpdateProcessorFactory [tlog_replica_test_kill_tlog_replica_shard1_replica_t1]  webapp=/solr path=/update params={update.distrib=FROMLEADER&waitSearcher=true&openSearcher=true&commit=true&softCommit=false&distrib.from=https://127.0.0.1:54551/solr/tlog_replica_test_kill_tlog_replica_shard1_replica_t2/&commit_end_point=true&wt=javabin&version=2&expungeDeletes=false}{commit=} 0 0
   [junit4]   2> 631364 INFO  (qtp1071604251-5163) [n:127.0.0.1:54551_solr c:tlog_replica_test_kill_tlog_replica s:shard1 r:core_node2 x:tlog_replica_test_kill_tlog_replica_shard1_replica_t2] o.a.s.u.DirectUpdateHandler2 start commit{_version_=1573452305192189952,optimize=false,openSearcher=true,waitSearcher=true,expungeDeletes=false,softCommit=false,prepareCommit=false}
   [junit4]   2> 631364 INFO  (qtp1071604251-5163) [n:127.0.0.1:54551_solr c:tlog_replica_test_kill_tlog_replica s:shard1 r:core_node2 x:tlog_replica_test_kill_tlog_replica_shard1_replica_t2] o.a.s.u.SolrIndexWriter Calling setCommitData with IW:org.apache.solr.update.SolrIndexWriter@2faf6a30 commitCommandVersion:1573452305192189952
   [junit4]   2> 631370 INFO  (qtp1071604251-5163) [n:127.0.0.1:54551_solr c:tlog_replica_test_kill_tlog_replica s:shard1 r:core_node2 x:tlog_replica_test_kill_tlog_replica_shard1_replica_t2] o.a.s.s.SolrIndexSearcher Opening [Searcher@79088d6c[tlog_replica_test_kill_tlog_replica_shard1_replica_t2] main]
   [junit4]   2> 631371 INFO  (qtp1071604251-5163) [n:127.0.0.1:54551_solr c:tlog_replica_test_kill_tlog_replica s:shard1 r:core_node2 x:tlog_replica_test_kill_tlog_replica_shard1_replica_t2] o.a.s.u.DirectUpdateHandler2 end_commit_flush
   [junit4]   2> 631372 INFO  (searcherExecutor-2403-thread-1-processing-n:127.0.0.1:54551_solr x:tlog_replica_test_kill_tlog_replica_shard1_replica_t2 s:shard1 c:tlog_replica_test_kill_tlog_replica r:core_node2) [n:127.0.0.1:54551_solr c:tlog_replica_test_kill_tlog_replica s:shard1 r:core_node2 x:tlog_replica_test_kill_tlog_replica_shard1_replica_t2] o.a.s.c.SolrCore [tlog_replica_test_kill_tlog_replica_shard1_replica_t2] Registered new searcher Searcher@79088d6c[tlog_replica_test_kill_tlog_replica_shard1_replica_t2] main{ExitableDirectoryReader(UninvertingDirectoryReader(Uninverting(_0(7.0.0):C1)))}
   [junit4]   2> 631373 INFO  (qtp1071604251-5163) [n:127.0.0.1:54551_solr c:tlog_replica_test_kill_tlog_replica s:shard1 r:core_node2 x:tlog_replica_test_kill_tlog_replica_shard1_replica_t2] o.a.s.u.p.LogUpdateProcessorFactory [tlog_replica_test_kill_tlog_replica_shard1_replica_t2]  webapp=/solr path=/update params={update.distrib=FROMLEADER&waitSearcher=true&openSearcher=true&commit=true&softCommit=false&distrib.from=https://127.0.0.1:54551/solr/tlog_replica_test_kill_tlog_replica_shard1_replica_t2/&commit_end_point=true&wt=javabin&version=2&expungeDeletes=false}{commit=} 0 8
   [junit4]   2> 631373 INFO  (qtp1071604251-5141) [n:127.0.0.1:54551_solr c:tlog_replica_test_kill_tlog_replica s:shard1 r:core_node2 x:tlog_replica_test_kill_tlog_replica_shard1_replica_t2] o.a.s.u.p.LogUpdateProcessorFactory [tlog_replica_test_kill_tlog_replica_shard1_replica_t2]  webapp=/solr path=/update params={_stateVer_=tlog_replica_test_kill_tlog_replica:6&waitSearcher=true&commit=true&softCommit=false&wt=javabin&version=2}{commit=} 0 14
   [junit4]   2> 631380 INFO  (qtp44117353-5162) [n:127.0.0.1:54550_solr c:tlog_replica_test_kill_tlog_replica s:shard1 r:core_node1 x:tlog_replica_test_kill_tlog_replica_shard1_replica_t1] o.a.s.c.S.Request [tlog_replica_test_kill_tlog_replica_shard1_replica_t1]  webapp=/solr path=/select params={q=*:*&wt=javabin&version=2} hits=0 status=0 QTime=0
   [junit4]   2> 631481 INFO  (qtp44117353-5161) [n:127.0.0.1:54550_solr c:tlog_replica_test_kill_tlog_replica s:shard1 r:core_node1 x:tlog_replica_test_kill_tlog_replica_shard1_replica_t1] o.a.s.c.S.Request [tlog_replica_test_kill_tlog_replica_shard1_replica_t1]  webapp=/solr path=/select params={q=*:*&wt=javabin&version=2} hits=0 status=0 QTime=0
   [junit4]   2> 631583 INFO  (qtp44117353-5149) [n:127.0.0.1:54550_solr c:tlog_replica_test_kill_tlog_replica s:shard1 r:core_node1 x:tlog_replica_test_kill_tlog_replica_shard1_replica_t1] o.a.s.c.S.Request [tlog_replica_test_kill_tlog_replica_shard1_replica_t1]  webapp=/solr path=/select params={q=*:*&wt=javabin&version=2} hits=0 status=0 QTime=0
   [junit4]   2> 631684 INFO  (qtp44117353-5148) [n:127.0.0.1:54550_solr c:tlog_replica_test_kill_tlog_replica s:shard1 r:core_node1 x:tlog_replica_test_kill_tlog_replica_shard1_replica_t1] o.a.s.c.S.Request [tlog_replica_test_kill_tlog_replica_shard1_replica_t1]  webapp=/solr path=/select params={q=*:*&wt=javabin&version=2} hits=0 status=0 QTime=0
   [junit4]   2> 631717 INFO  (OverseerCollectionConfigSetProcessor-98340768801947654-127.0.0.1:54551_solr-n_0000000000) [n:127.0.0.1:54551_solr    ] o.a.s.c.OverseerTaskQueue Response ZK path: /overseer/collection-queue-work/qnr-0000000000 doesn't exist.  Requestor may have disconnected from ZooKeeper
   [junit4]   2> 631785 INFO  (qtp44117353-5154) [n:127.0.0.1:54550_solr c:tlog_replica_test_kill_tlog_replica s:shard1 r:core_node1 x:tlog_replica_test_kill_tlog_replica_shard1_replica_t1] o.a.s.c.S.Request [tlog_replica_test_kill_tlog_replica_shard1_replica_t1]  webapp=/solr path=/select params={q=*:*&wt=javabin&version=2} hits=0 status=0 QTime=0
   [junit4]   2> 631886 INFO  (qtp44117353-5145) [n:127.0.0.1:54550_solr c:tlog_replica_test_kill_tlog_replica s:shard1 r:core_node1 x:tlog_replica_test_kill_tlog_replica_shard1_replica_t1] o.a.s.c.S.Request [tlog_replica_test_kill_tlog_replica_shard1_replica_t1]  webapp=/solr path=/select params={q=*:*&wt=javabin&version=2} hits=0 status=0 QTime=0
   [junit4]   2> 631988 INFO  (qtp44117353-5159) [n:127.0.0.1:54550_solr c:tlog_replica_test_kill_tlog_replica s:shard1 r:core_node1 x:tlog_replica_test_kill_tlog_replica_shard1_r

[...truncated too long message...]

 WARNING: Will linger awaiting termination of 1 leaked thread(s).
   [junit4]   2> NOTE: test params are: codec=Asserting(Lucene70): {multiDefault=FSTOrd50, cat=FSTOrd50, id=PostingsFormat(name=Direct)}, docValues:{range_facet_l_dv=DocValuesFormat(name=Direct), price=DocValuesFormat(name=Lucene70), intDefault=DocValuesFormat(name=Lucene70), weight=DocValuesFormat(name=Asserting), id_i1=DocValuesFormat(name=Lucene70), range_facet_i_dv=DocValuesFormat(name=Asserting), intDvoDefault=DocValuesFormat(name=Direct), range_facet_l=DocValuesFormat(name=Asserting), timestamp=DocValuesFormat(name=Asserting)}, maxPointsInLeafNode=252, maxMBSortInHeap=7.8551256803730425, sim=RandomSimilarity(queryNorm=true): {}, locale=es-CU, timezone=Pacific/Galapagos
   [junit4]   2> NOTE: Windows 10 10.0 amd64/Oracle Corporation 1.8.0_131 (64-bit)/cpus=3,threads=1,free=179637176,total=532152320
   [junit4]   2> NOTE: All tests run in this JVM: [TestSuggestSpellingConverter, FileUtilsTest, CustomCollectionTest, SolrIndexConfigTest, TestCollectionAPI, TestPKIAuthenticationPlugin, IgnoreCommitOptimizeUpdateProcessorFactoryTest, TestDistribDocBasedVersion, TestManagedResourceStorage, BigEndianAscendingWordDeserializerTest, TestDocTermOrds, FieldMutatingUpdateProcessorTest, BasicDistributedZk2Test, TestReloadAndDeleteDocs, TestGeoJSONResponseWriter, TestCloudPivotFacet, TestSearchPerf, ConcurrentDeleteAndCreateCollectionTest, TestManagedSynonymFilterFactory, UtilsToolTest, BasicAuthIntegrationTest, CollectionStateFormat2Test, CheckHdfsIndexTest, AtomicUpdatesTest, TestRandomFaceting, CollectionsAPIAsyncDistributedZkTest, TestQueryUtils, TestComplexPhraseLeadingWildcard, HdfsChaosMonkeyNothingIsSafeTest, TestDistribIDF, SmileWriterTest, TestStressInPlaceUpdates, TestLegacyFieldReuse, SolrRequestParserTest, TestImplicitCoreProperties, TestHighFrequencyDictionaryFactory, TestMergePolicyConfig, HLLUtilTest, EnumFieldTest, TestReload, TestPartialUpdateDeduplication, DOMUtilTest, PKIAuthenticationIntegrationTest, TestSolrCoreParser, TestWordDelimiterFilterFactory, TestUninvertingReader, DataDrivenBlockJoinTest, OverriddenZkACLAndCredentialsProvidersTest, TestShortCircuitedRequests, TestInitParams, SolrPluginUtilsTest, TestIndexSearcher, DeleteStatusTest, RankQueryTest, SolrMetricReporterTest, TestExceedMaxTermLength, TestCrossCoreJoin, TestSimpleTextCodec, UpdateRequestProcessorFactoryTest, LukeRequestHandlerTest, SaslZkACLProviderTest, SpellCheckComponentTest, TermVectorComponentTest, TestPullReplica, TestSmileRequest, SolrCloudReportersTest, TestFastOutputStream, AnalysisErrorHandlingTest, CloneFieldUpdateProcessorFactoryTest, TestBackupRepositoryFactory, AutoCommitTest, TestCharFilters, TestSearcherReuse, JsonLoaderTest, HdfsDirectoryTest, DocValuesNotIndexedTest, RemoteQueryErrorTest, TestSolrQueryResponse, TestStressLucene, OpenCloseCoreStressTest, BlockJoinFacetRandomTest, PluginInfoTest, CoreMergeIndexesAdminHandlerTest, TestDocSet, MoreLikeThisHandlerTest, TestNumericTerms32, SolrGangliaReporterTest, TestTlogReplica, TestCloudInspectUtil, TestRestoreCore, ConvertedLegacyTest, SearchHandlerTest, RollingRestartTest, TestNumericRangeQuery32, SearchHandlerTest, IndexSchemaRuntimeFieldTest, TestUnifiedSolrHighlighter, LoggingHandlerTest, TestHalfAndHalfDocValues, TestFastWriter, DistribDocExpirationUpdateProcessorTest, TestExpandComponent, UpdateParamsTest, UpdateLogTest, TestConfigSetImmutable, SpellingQueryConverterTest, TestOnReconnectListenerSupport, TestFileDictionaryLookup, TestConfigSetsAPIExclusivity, DebugComponentTest, TestRemoteStreaming, TestPointFields, TestSolrCLIRunExample, TestFiltering, TolerantUpdateProcessorTest, TestRTGBase, TestLeaderElectionWithEmptyReplica, TestAnalyzedSuggestions, TestCoreDiscovery, TestCloudSchemaless, TestCoreAdminApis, TestManagedSchemaAPI, CloudMLTQParserTest, TestExactStatsCache, PingRequestHandlerTest, MoveReplicaHDFSTest, TestNoOpRegenerator, FacetPivotSmallTest, TestFieldCacheReopen, TestJettySolrRunner, NodeMutatorTest, AutoScalingHandlerTest, DistributedQueryComponentOptimizationTest, StatsComponentTest, HdfsRecoverLeaseTest, TestJsonFacets, TestSolrQueryParser, ChaosMonkeyNothingIsSafeWithPullReplicasTest, TestBM25SimilarityFactory, TestLeaderInitiatedRecoveryThread, SOLR749Test, TestLuceneMatchVersion, TestSolrDeletionPolicy1, TestQueryTypes, SpellCheckCollatorTest, TestDynamicFieldResource, ExternalFileFieldSortTest, DeleteLastCustomShardedReplicaTest, MoveReplicaTest, TestSolr4Spatial, TemplateUpdateProcessorTest, SystemInfoHandlerTest, BlockDirectoryTest, TestHashQParserPlugin, CacheHeaderTest, TermsComponentTest, GraphQueryTest, TestPostingsSolrHighlighter, LeaderInitiatedRecoveryOnCommitTest, HttpSolrCallGetCoreTest, DocValuesMultiTest, TestSolrJ, LargeFieldTest, BadComponentTest, TestUniqueKeyFieldResource, TestElisionMultitermQuery, TestSolrIndexConfig, TestLegacyTerms, TestJoin, LeaderFailoverAfterPartitionTest, LeaderElectionIntegrationTest, TestSha256AuthenticationProvider, HdfsRestartWhileUpdatingTest, TestCloudRecovery, AnalyticsQueryTest, ChaosMonkeySafeLeaderTest, UnloadDistributedZkTest, CollectionsAPIDistributedZkTest, OverseerTest, ShardRoutingTest, BasicZkTest, RecoveryZkTest, FullSolrCloudDistribCmdsTest, TestReplicationHandler, ClusterStateUpdateTest, ZkSolrClientTest, TestZkChroot, ZkCLITest, ShardRoutingCustomTest, TestDistributedGrouping, TestRecovery, TestHashPartitioner, ZkControllerTest, TestRealTimeGet, TestStressReorder, DistributedTermsComponentTest, SolrCoreTest, PeerSyncTest, HighlighterTest, ShowFileRequestHandlerTest, SolrIndexSplitterTest, SignatureUpdateProcessorFactoryTest, TestExtendedDismaxParser, SuggesterFSTTest, TestTrie, PolyFieldTest, WordBreakSolrSpellCheckerTest, SolrCoreCheckLockOnStartupTest, QueryEqualityTest, XsltUpdateRequestHandlerTest, DisMaxRequestHandlerTest, DocumentAnalysisRequestHandlerTest, DocumentBuilderTest, PathHierarchyTokenizerFactoryTest, FastVectorHighlighterTest, TestCollationField, MBeansHandlerTest, TestComponentsName, AlternateDirectoryTest, ResponseLogComponentTest, MinimalSchemaTest, TestConfig, TestSolrCoreProperties, SpellPossibilityIteratorTest, TestCodecSupport, TestLMDirichletSimilarityFactory, TimeZoneUtilsTest, ScriptEngineTest, TestSystemIdResolver, ClusterStateTest, TestUtils, ZkNodePropsTest, DistributedIntervalFacetingTest, TestHighlightDedupGrouping, TestEmbeddedSolrServerConstructors, ActionThrottleTest, AliasIntegrationTest, CdcrReplicationDistributedZkTest, CdcrRequestHandlerTest, CdcrVersionReplicationTest, CleanupOldIndexTest, CloudExitableDirectoryReaderTest, CollectionsAPISolrJTest, DistribJoinFromCollectionTest, ForceLeaderTest, LeaderElectionContextKeyTest, LeaderFailureAfterFreshStartTest, OutOfBoxZkACLAndCredentialsProvidersTest, OverseerCollectionConfigSetProcessorTest, OverseerModifyCollectionTest, OverseerRolesTest, OverseerStatusTest, PeerSyncReplicationTest, RecoveryAfterSoftCommitTest, SharedFSAutoReplicaFailoverTest, SimpleCollectionCreateDeleteTest, SolrCLIZkUtilsTest, SolrCloudExampleTest, TestAuthenticationFramework, TestCloudDeleteByQuery, TestCloudJSONFacetJoinDomain, TestCloudPseudoReturnFields, TestClusterProperties, TestCryptoKeys, TestDeleteCollectionOnDownNodes, TestDownShardTolerantSearch, TestExclusionRuleCollectionAccess, TestHdfsCloudBackupRestore, TestLockTree, TestRandomFlRTGCloud, TestRandomRequestDistribution, TestRebalanceLeaders, TestSolrCloudWithKerberosAlt, TestTolerantUpdateProcessorCloud, TlogReplayBufferedWhileIndexingTest, VMParamsZkACLAndCredentialsProvidersTest, TestPolicyCloud, BlobRepositoryCloudTest, CachingDirectoryFactoryTest, TestConfigOverlay, TestConfigSets, TestInfoStreamLogging, TestNRTOpen, TestShardHandlerFactory, TestSolrConfigHandler, TestSolrXml, TestSolrCloudSnapshots, TestReplicationHandlerBackup, TestSQLHandlerNonCloud, TestSolrConfigHandlerCloud, DistributedFacetPivotLargeTest, DistributedFacetPivotWhiteBoxTest, DistributedSuggestComponentTest, SuggestComponentContextFilterQueryTest, SuggestComponentTest]
   [junit4]   2> NOTE: reproduce with: ant test  -Dtestcase=SuggestComponentTest -Dtests.seed=CEA6879DE649CF57 -Dtests.slow=true -Dtests.locale=es-CU -Dtests.timezone=Pacific/Galapagos -Dtests.asserts=true -Dtests.file.encoding=ISO-8859-1
   [junit4] ERROR   0.00s J1 | SuggestComponentTest (suite) <<<
   [junit4]    > Throwable #1: java.io.IOException: Could not remove the following files (in the order of attempts):
   [junit4]    >    C:\Users\jenkins\workspace\Lucene-Solr-7.0-Windows\solr\build\solr-core\test\J1\temp\solr.handler.component.SuggestComponentTest_CEA6879DE649CF57-001\init-core-data-001: java.nio.file.DirectoryNotEmptyException: C:\Users\jenkins\workspace\Lucene-Solr-7.0-Windows\solr\build\solr-core\test\J1\temp\solr.handler.component.SuggestComponentTest_CEA6879DE649CF57-001\init-core-data-001
   [junit4]    >    C:\Users\jenkins\workspace\Lucene-Solr-7.0-Windows\solr\build\solr-core\test\J1\temp\solr.handler.component.SuggestComponentTest_CEA6879DE649CF57-001\init-core-data-001\suggest_fuzzy_doc_manal_build: java.nio.file.AccessDeniedException: C:\Users\jenkins\workspace\Lucene-Solr-7.0-Windows\solr\build\solr-core\test\J1\temp\solr.handler.component.SuggestComponentTest_CEA6879DE649CF57-001\init-core-data-001\suggest_fuzzy_doc_manal_build
   [junit4]    >    C:\Users\jenkins\workspace\Lucene-Solr-7.0-Windows\solr\build\solr-core\test\J1\temp\solr.handler.component.SuggestComponentTest_CEA6879DE649CF57-001: java.nio.file.DirectoryNotEmptyException: C:\Users\jenkins\workspace\Lucene-Solr-7.0-Windows\solr\build\solr-core\test\J1\temp\solr.handler.component.SuggestComponentTest_CEA6879DE649CF57-001
   [junit4]    > 	at __randomizedtesting.SeedInfo.seed([CEA6879DE649CF57]:0)
   [junit4]    > 	at org.apache.lucene.util.IOUtils.rm(IOUtils.java:329)
   [junit4]    > 	at java.lang.Thread.run(Thread.java:748)
   [junit4] Completed [599/727 (3!)] on J1 in 8.73s, 12 tests, 1 error <<< FAILURES!

[...truncated 43839 lines...]

Mime
View raw message