lucene-dev mailing list archives

Site index · List index
Message view « Date » · « Thread »
Top « Date » · « Thread »
From Policeman Jenkins Server <jenk...@thetaphi.de>
Subject [JENKINS-EA] Lucene-Solr-7.x-Windows (32bit/jdk-9-ea+178) - Build # 57 - Unstable!
Date Wed, 19 Jul 2017 22:06:55 GMT
Build: https://jenkins.thetaphi.de/job/Lucene-Solr-7.x-Windows/57/
Java: 32bit/jdk-9-ea+178 -server -XX:+UseParallelGC --illegal-access=deny

1 tests failed.
FAILED:  org.apache.solr.handler.admin.MetricsHandlerTest.testPropertyFilter

Error Message:


Stack Trace:
java.lang.AssertionError
	at __randomizedtesting.SeedInfo.seed([63B55C731D2A34BA:1D8A232D2A45484]:0)
	at org.junit.Assert.fail(Assert.java:92)
	at org.junit.Assert.assertTrue(Assert.java:43)
	at org.junit.Assert.assertNotNull(Assert.java:526)
	at org.junit.Assert.assertNotNull(Assert.java:537)
	at org.apache.solr.handler.admin.MetricsHandlerTest.testPropertyFilter(MetricsHandlerTest.java:201)
	at java.base/jdk.internal.reflect.NativeMethodAccessorImpl.invoke0(Native Method)
	at java.base/jdk.internal.reflect.NativeMethodAccessorImpl.invoke(NativeMethodAccessorImpl.java:62)
	at java.base/jdk.internal.reflect.DelegatingMethodAccessorImpl.invoke(DelegatingMethodAccessorImpl.java:43)
	at java.base/java.lang.reflect.Method.invoke(Method.java:564)
	at com.carrotsearch.randomizedtesting.RandomizedRunner.invoke(RandomizedRunner.java:1713)
	at com.carrotsearch.randomizedtesting.RandomizedRunner$8.evaluate(RandomizedRunner.java:907)
	at com.carrotsearch.randomizedtesting.RandomizedRunner$9.evaluate(RandomizedRunner.java:943)
	at com.carrotsearch.randomizedtesting.RandomizedRunner$10.evaluate(RandomizedRunner.java:957)
	at com.carrotsearch.randomizedtesting.rules.SystemPropertiesRestoreRule$1.evaluate(SystemPropertiesRestoreRule.java:57)
	at org.apache.lucene.util.TestRuleSetupTeardownChained$1.evaluate(TestRuleSetupTeardownChained.java:49)
	at org.apache.lucene.util.AbstractBeforeAfterRule$1.evaluate(AbstractBeforeAfterRule.java:45)
	at org.apache.lucene.util.TestRuleThreadAndTestName$1.evaluate(TestRuleThreadAndTestName.java:48)
	at org.apache.lucene.util.TestRuleIgnoreAfterMaxFailures$1.evaluate(TestRuleIgnoreAfterMaxFailures.java:64)
	at org.apache.lucene.util.TestRuleMarkFailure$1.evaluate(TestRuleMarkFailure.java:47)
	at com.carrotsearch.randomizedtesting.rules.StatementAdapter.evaluate(StatementAdapter.java:36)
	at com.carrotsearch.randomizedtesting.ThreadLeakControl$StatementRunner.run(ThreadLeakControl.java:368)
	at com.carrotsearch.randomizedtesting.ThreadLeakControl.forkTimeoutingTask(ThreadLeakControl.java:817)
	at com.carrotsearch.randomizedtesting.ThreadLeakControl$3.evaluate(ThreadLeakControl.java:468)
	at com.carrotsearch.randomizedtesting.RandomizedRunner.runSingleTest(RandomizedRunner.java:916)
	at com.carrotsearch.randomizedtesting.RandomizedRunner$5.evaluate(RandomizedRunner.java:802)
	at com.carrotsearch.randomizedtesting.RandomizedRunner$6.evaluate(RandomizedRunner.java:852)
	at com.carrotsearch.randomizedtesting.RandomizedRunner$7.evaluate(RandomizedRunner.java:863)
	at com.carrotsearch.randomizedtesting.rules.StatementAdapter.evaluate(StatementAdapter.java:36)
	at com.carrotsearch.randomizedtesting.rules.SystemPropertiesRestoreRule$1.evaluate(SystemPropertiesRestoreRule.java:57)
	at org.apache.lucene.util.AbstractBeforeAfterRule$1.evaluate(AbstractBeforeAfterRule.java:45)
	at com.carrotsearch.randomizedtesting.rules.StatementAdapter.evaluate(StatementAdapter.java:36)
	at org.apache.lucene.util.TestRuleStoreClassName$1.evaluate(TestRuleStoreClassName.java:41)
	at com.carrotsearch.randomizedtesting.rules.NoShadowingOrOverridesOnMethodsRule$1.evaluate(NoShadowingOrOverridesOnMethodsRule.java:40)
	at com.carrotsearch.randomizedtesting.rules.NoShadowingOrOverridesOnMethodsRule$1.evaluate(NoShadowingOrOverridesOnMethodsRule.java:40)
	at com.carrotsearch.randomizedtesting.rules.StatementAdapter.evaluate(StatementAdapter.java:36)
	at com.carrotsearch.randomizedtesting.rules.StatementAdapter.evaluate(StatementAdapter.java:36)
	at org.apache.lucene.util.TestRuleAssertionsRequired$1.evaluate(TestRuleAssertionsRequired.java:53)
	at org.apache.lucene.util.TestRuleMarkFailure$1.evaluate(TestRuleMarkFailure.java:47)
	at org.apache.lucene.util.TestRuleIgnoreAfterMaxFailures$1.evaluate(TestRuleIgnoreAfterMaxFailures.java:64)
	at org.apache.lucene.util.TestRuleIgnoreTestSuites$1.evaluate(TestRuleIgnoreTestSuites.java:54)
	at com.carrotsearch.randomizedtesting.rules.StatementAdapter.evaluate(StatementAdapter.java:36)
	at com.carrotsearch.randomizedtesting.ThreadLeakControl$StatementRunner.run(ThreadLeakControl.java:368)
	at java.base/java.lang.Thread.run(Thread.java:844)




Build Log:
[...truncated 12882 lines...]
   [junit4] Suite: org.apache.solr.handler.admin.MetricsHandlerTest
   [junit4]   2> Creating dataDir: C:\Users\jenkins\workspace\Lucene-Solr-7.x-Windows\solr\build\solr-core\test\J0\temp\solr.handler.admin.MetricsHandlerTest_63B55C731D2A34BA-001\init-core-data-001
   [junit4]   2> 2609463 WARN  (SUITE-MetricsHandlerTest-seed#[63B55C731D2A34BA]-worker)
[    ] o.a.s.SolrTestCaseJ4 startTrackingSearchers: numOpens=1 numCloses=1
   [junit4]   2> 2609464 INFO  (SUITE-MetricsHandlerTest-seed#[63B55C731D2A34BA]-worker)
[    ] o.a.s.SolrTestCaseJ4 Using PointFields (NUMERIC_POINTS_SYSPROP=true) w/NUMERIC_DOCVALUES_SYSPROP=false
   [junit4]   2> 2609469 INFO  (SUITE-MetricsHandlerTest-seed#[63B55C731D2A34BA]-worker)
[    ] o.a.s.SolrTestCaseJ4 Randomized ssl (false) and clientAuth (false) via: @org.apache.solr.util.RandomizeSSL(reason="",
value=0.0/0.0, ssl=0.0/0.0, clientAuth=0.0/0.0)
   [junit4]   2> 2609470 INFO  (SUITE-MetricsHandlerTest-seed#[63B55C731D2A34BA]-worker)
[    ] o.a.s.SolrTestCaseJ4 ####initCore
   [junit4]   2> 2609471 INFO  (SUITE-MetricsHandlerTest-seed#[63B55C731D2A34BA]-worker)
[    ] o.a.s.c.SolrResourceLoader [null] Added 2 libs to classloader, from paths: [/C:/Users/jenkins/workspace/Lucene-Solr-7.x-Windows/solr/core/src/test-files/solr/collection1/lib,
/C:/Users/jenkins/workspace/Lucene-Solr-7.x-Windows/solr/core/src/test-files/solr/collection1/lib/classes]
   [junit4]   2> 2609535 INFO  (SUITE-MetricsHandlerTest-seed#[63B55C731D2A34BA]-worker)
[    ] o.a.s.c.SolrConfig Using Lucene MatchVersion: 7.1.0
   [junit4]   2> 2609575 INFO  (SUITE-MetricsHandlerTest-seed#[63B55C731D2A34BA]-worker)
[    ] o.a.s.s.IndexSchema [null] Schema name=test
   [junit4]   2> 2609730 INFO  (SUITE-MetricsHandlerTest-seed#[63B55C731D2A34BA]-worker)
[    ] o.a.s.s.IndexSchema Loaded schema test/1.0 with uniqueid field id
   [junit4]   2> 2609832 INFO  (SUITE-MetricsHandlerTest-seed#[63B55C731D2A34BA]-worker)
[    ] o.a.s.m.r.SolrJmxReporter JMX monitoring for 'solr.node' (registry 'solr.node') enabled
at server: com.sun.jmx.mbeanserver.JmxMBeanServer@cdd48d
   [junit4]   2> 2609837 INFO  (SUITE-MetricsHandlerTest-seed#[63B55C731D2A34BA]-worker)
[    ] o.a.s.m.r.SolrJmxReporter JMX monitoring for 'solr.jvm' (registry 'solr.jvm') enabled
at server: com.sun.jmx.mbeanserver.JmxMBeanServer@cdd48d
   [junit4]   2> 2609837 INFO  (SUITE-MetricsHandlerTest-seed#[63B55C731D2A34BA]-worker)
[    ] o.a.s.m.r.SolrJmxReporter JMX monitoring for 'solr.jetty' (registry 'solr.jetty') enabled
at server: com.sun.jmx.mbeanserver.JmxMBeanServer@cdd48d
   [junit4]   2> 2609839 INFO  (coreLoadExecutor-11023-thread-1) [    ] o.a.s.c.SolrResourceLoader
[null] Added 2 libs to classloader, from paths: [/C:/Users/jenkins/workspace/Lucene-Solr-7.x-Windows/solr/core/src/test-files/solr/collection1/lib,
/C:/Users/jenkins/workspace/Lucene-Solr-7.x-Windows/solr/core/src/test-files/solr/collection1/lib/classes]
   [junit4]   2> 2609877 INFO  (coreLoadExecutor-11023-thread-1) [    ] o.a.s.c.SolrConfig
Using Lucene MatchVersion: 7.1.0
   [junit4]   2> 2609911 INFO  (coreLoadExecutor-11023-thread-1) [    ] o.a.s.s.IndexSchema
[collection1] Schema name=test
   [junit4]   2> 2610020 INFO  (coreLoadExecutor-11023-thread-1) [    ] o.a.s.s.IndexSchema
Loaded schema test/1.0 with uniqueid field id
   [junit4]   2> 2610034 INFO  (coreLoadExecutor-11023-thread-1) [    ] o.a.s.c.CoreContainer
Creating SolrCore 'collection1' using configuration from instancedir C:\Users\jenkins\workspace\Lucene-Solr-7.x-Windows\solr\core\src\test-files\solr\collection1,
trusted=true
   [junit4]   2> 2610034 INFO  (coreLoadExecutor-11023-thread-1) [    ] o.a.s.m.r.SolrJmxReporter
JMX monitoring for 'solr.core.collection1' (registry 'solr.core.collection1') enabled at server:
com.sun.jmx.mbeanserver.JmxMBeanServer@cdd48d
   [junit4]   2> 2610034 INFO  (coreLoadExecutor-11023-thread-1) [    ] o.a.s.c.SolrCore
solr.RecoveryStrategy.Builder
   [junit4]   2> 2610034 INFO  (coreLoadExecutor-11023-thread-1) [    ] o.a.s.c.SolrCore
[[collection1] ] Opening new SolrCore at [C:\Users\jenkins\workspace\Lucene-Solr-7.x-Windows\solr\core\src\test-files\solr\collection1],
dataDir=[C:\Users\jenkins\workspace\Lucene-Solr-7.x-Windows\solr\build\solr-core\test\J0\temp\solr.handler.admin.MetricsHandlerTest_63B55C731D2A34BA-001\init-core-data-001\]
   [junit4]   2> 2610036 INFO  (coreLoadExecutor-11023-thread-1) [    ] o.a.s.u.RandomMergePolicy
RandomMergePolicy wrapping class org.apache.lucene.index.LogDocMergePolicy: [LogDocMergePolicy:
minMergeSize=1000, mergeFactor=43, maxMergeSize=9223372036854775807, maxMergeSizeForForcedMerge=9223372036854775807,
calibrateSizeByDeletes=false, maxMergeDocs=2147483647, maxCFSSegmentSizeMB=8.796093022207999E12,
noCFSRatio=0.2508045625667384]
   [junit4]   2> 2610157 INFO  (coreLoadExecutor-11023-thread-1) [    ] o.a.s.u.UpdateHandler
Using UpdateLog implementation: org.apache.solr.update.UpdateLog
   [junit4]   2> 2610157 INFO  (coreLoadExecutor-11023-thread-1) [    ] o.a.s.u.UpdateLog
Initializing UpdateLog: dataDir= defaultSyncLevel=FLUSH numRecordsToKeep=100 maxNumLogsToKeep=10
numVersionBuckets=65536
   [junit4]   2> 2610159 INFO  (coreLoadExecutor-11023-thread-1) [    ] o.a.s.u.CommitTracker
Hard AutoCommit: disabled
   [junit4]   2> 2610159 INFO  (coreLoadExecutor-11023-thread-1) [    ] o.a.s.u.CommitTracker
Soft AutoCommit: disabled
   [junit4]   2> 2610161 INFO  (coreLoadExecutor-11023-thread-1) [    ] o.a.s.u.RandomMergePolicy
RandomMergePolicy wrapping class org.apache.lucene.index.AlcoholicMergePolicy: [AlcoholicMergePolicy:
minMergeSize=0, mergeFactor=10, maxMergeSize=55222658, maxMergeSizeForForcedMerge=9223372036854775807,
calibrateSizeByDeletes=true, maxMergeDocs=2147483647, maxCFSSegmentSizeMB=8.796093022207999E12,
noCFSRatio=0.1]
   [junit4]   2> 2610161 INFO  (coreLoadExecutor-11023-thread-1) [    ] o.a.s.s.SolrIndexSearcher
Opening [Searcher@6ddf3a[collection1] main]
   [junit4]   2> 2610162 INFO  (coreLoadExecutor-11023-thread-1) [    ] o.a.s.h.c.SpellCheckComponent
Initializing spell checkers
   [junit4]   2> 2610170 INFO  (coreLoadExecutor-11023-thread-1) [    ] o.a.s.s.DirectSolrSpellChecker
init: {name=direct,classname=DirectSolrSpellChecker,field=lowerfilt,minQueryLength=3}
   [junit4]   2> 2610229 INFO  (coreLoadExecutor-11023-thread-1) [    ] o.a.s.h.ReplicationHandler
Commits will be reserved for  10000
   [junit4]   2> 2610230 INFO  (searcherExecutor-11024-thread-1) [    ] o.a.s.h.c.SpellCheckComponent
Loading spell index for spellchecker: default
   [junit4]   2> 2610230 INFO  (coreLoadExecutor-11023-thread-1) [    ] o.a.s.u.UpdateLog
Could not find max version in index or recent updates, using new clock 1573389163596611584
   [junit4]   2> 2610231 INFO  (searcherExecutor-11024-thread-1) [    ] o.a.s.h.c.SpellCheckComponent
Loading spell index for spellchecker: direct
   [junit4]   2> 2610231 INFO  (searcherExecutor-11024-thread-1) [    ] o.a.s.h.c.SpellCheckComponent
Loading spell index for spellchecker: wordbreak
   [junit4]   2> 2610231 INFO  (searcherExecutor-11024-thread-1) [    ] o.a.s.h.c.SpellCheckComponent
Loading spell index for spellchecker: multipleFields
   [junit4]   2> 2610232 INFO  (searcherExecutor-11024-thread-1) [    ] o.a.s.h.c.SpellCheckComponent
Loading spell index for spellchecker: jarowinkler
   [junit4]   2> 2610233 INFO  (searcherExecutor-11024-thread-1) [    ] o.a.s.h.c.SpellCheckComponent
Loading spell index for spellchecker: external
   [junit4]   2> 2610234 INFO  (SUITE-MetricsHandlerTest-seed#[63B55C731D2A34BA]-worker)
[    ] o.a.s.SolrTestCaseJ4 ####initCore end
   [junit4]   2> 2610234 INFO  (searcherExecutor-11024-thread-1) [    ] o.a.s.h.c.SpellCheckComponent
Loading spell index for spellchecker: freq
   [junit4]   2> 2610237 INFO  (searcherExecutor-11024-thread-1) [    ] o.a.s.h.c.SpellCheckComponent
Loading spell index for spellchecker: fqcn
   [junit4]   2> 2610237 INFO  (TEST-MetricsHandlerTest.testPropertyFilter-seed#[63B55C731D2A34BA])
[    ] o.a.s.SolrTestCaseJ4 ###Starting testPropertyFilter
   [junit4]   2> 2610237 INFO  (searcherExecutor-11024-thread-1) [    ] o.a.s.h.c.SpellCheckComponent
Loading spell index for spellchecker: perDict
   [junit4]   2> 2610238 INFO  (TEST-MetricsHandlerTest.testPropertyFilter-seed#[63B55C731D2A34BA])
[    ] o.a.s.SolrTestCaseJ4 ###Ending testPropertyFilter
   [junit4]   2> 2610240 INFO  (searcherExecutor-11024-thread-1) [    ] o.a.s.c.SolrCore
[collection1] Registered new searcher Searcher@6ddf3a[collection1] main{ExitableDirectoryReader(UninvertingDirectoryReader())}
   [junit4]   2> NOTE: reproduce with: ant test  -Dtestcase=MetricsHandlerTest -Dtests.method=testPropertyFilter
-Dtests.seed=63B55C731D2A34BA -Dtests.slow=true -Dtests.locale=cy -Dtests.timezone=America/Knox_IN
-Dtests.asserts=true -Dtests.file.encoding=US-ASCII
   [junit4] FAILURE 0.01s J0 | MetricsHandlerTest.testPropertyFilter <<<
   [junit4]    > Throwable #1: java.lang.AssertionError
   [junit4]    > 	at __randomizedtesting.SeedInfo.seed([63B55C731D2A34BA:1D8A232D2A45484]:0)
   [junit4]    > 	at org.apache.solr.handler.admin.MetricsHandlerTest.testPropertyFilter(MetricsHandlerTest.java:201)
   [junit4]    > 	at java.base/jdk.internal.reflect.NativeMethodAccessorImpl.invoke0(Native
Method)
   [junit4]    > 	at java.base/jdk.internal.reflect.NativeMethodAccessorImpl.invoke(NativeMethodAccessorImpl.java:62)
   [junit4]    > 	at java.base/jdk.internal.reflect.DelegatingMethodAccessorImpl.invoke(DelegatingMethodAccessorImpl.java:43)
   [junit4]    > 	at java.base/java.lang.reflect.Method.invoke(Method.java:564)
   [junit4]    > 	at java.base/java.lang.Thread.run(Thread.java:844)
   [junit4]   2> 2610242 INFO  (TEST-MetricsHandlerTest.test-seed#[63B55C731D2A34BA]) [
   ] o.a.s.SolrTestCaseJ4 ###Starting test
   [junit4]   2> 2610258 INFO  (TEST-MetricsHandlerTest.test-seed#[63B55C731D2A34BA]) [
   ] o.a.s.c.TransientSolrCoreCacheDefault Allocating transient cache for 2147483647 transient
cores
   [junit4]   2> 2610312 INFO  (TEST-MetricsHandlerTest.test-seed#[63B55C731D2A34BA]) [
   ] o.a.s.SolrTestCaseJ4 ###Ending test
   [junit4]   2> 2610315 INFO  (TEST-MetricsHandlerTest.testCompact-seed#[63B55C731D2A34BA])
[    ] o.a.s.SolrTestCaseJ4 ###Starting testCompact
   [junit4]   2> 2610326 INFO  (TEST-MetricsHandlerTest.testCompact-seed#[63B55C731D2A34BA])
[    ] o.a.s.SolrTestCaseJ4 ###Ending testCompact
   [junit4]   2> 2610326 INFO  (SUITE-MetricsHandlerTest-seed#[63B55C731D2A34BA]-worker)
[    ] o.a.s.SolrTestCaseJ4 ###deleteCore
   [junit4]   2> 2610326 INFO  (SUITE-MetricsHandlerTest-seed#[63B55C731D2A34BA]-worker)
[    ] o.a.s.c.CoreContainer Shutting down CoreContainer instance=15167127
   [junit4]   2> 2610326 INFO  (SUITE-MetricsHandlerTest-seed#[63B55C731D2A34BA]-worker)
[    ] o.a.s.m.SolrMetricManager Closing metric reporters for registry=solr.node, tag=null
   [junit4]   2> 2610327 INFO  (SUITE-MetricsHandlerTest-seed#[63B55C731D2A34BA]-worker)
[    ] o.a.s.m.SolrMetricManager Closing metric reporters for registry=solr.jvm, tag=null
   [junit4]   2> 2610328 INFO  (SUITE-MetricsHandlerTest-seed#[63B55C731D2A34BA]-worker)
[    ] o.a.s.m.SolrMetricManager Closing metric reporters for registry=solr.jetty, tag=null
   [junit4]   2> 2610329 INFO  (coreCloseExecutor-11029-thread-1) [    ] o.a.s.c.SolrCore
[collection1]  CLOSING SolrCore org.apache.solr.core.SolrCore@1a1305d
   [junit4]   2> 2610330 INFO  (coreCloseExecutor-11029-thread-1) [    ] o.a.s.m.SolrMetricManager
Closing metric reporters for registry=solr.core.collection1, tag=27340893
   [junit4]   2> NOTE: leaving temporary files on disk at: C:\Users\jenkins\workspace\Lucene-Solr-7.x-Windows\solr\build\solr-core\test\J0\temp\solr.handler.admin.MetricsHandlerTest_63B55C731D2A34BA-001
   [junit4]   2> NOTE: test params are: codec=Asserting(Lucene70): {}, docValues:{}, maxPointsInLeafNode=1447,
maxMBSortInHeap=7.9126076894929795, sim=RandomSimilarity(queryNorm=true): {}, locale=cy, timezone=America/Knox_IN
   [junit4]   2> NOTE: Windows 10 10.0 x86/Oracle Corporation 9 (32-bit)/cpus=3,threads=1,free=180659152,total=511967232
   [junit4]   2> NOTE: All tests run in this JVM: [TestStressRecovery, ClusterStateTest,
DateFieldTest, AtomicUpdatesTest, TestEmbeddedSolrServerSchemaAPI, TestDistributedSearch,
TestTrieFacet, ShardRoutingTest, SuggesterTest, TestSchemaResource, DistanceFunctionTest,
TestCoreContainer, TestSolrCLIRunExample, BasicDistributedZkTest, TestSegmentSorting, TestHdfsCloudBackupRestore,
TestLFUCache, BJQParserTest, TemplateUpdateProcessorTest, OverseerTest, RequestHandlersTest,
QueryElevationComponentTest, TestConfigSetProperties, SliceStateTest, TestStressCloudBlindAtomicUpdates,
TestClusterProperties, TestFaceting, TestUpdate, SolrInfoBeanTest, TestCodecSupport, CloudMLTQParserTest,
DataDrivenBlockJoinTest, SolrCoreTest, TestReversedWildcardFilterFactory, TestOrdValues, TestConfigsApi,
NotRequiredUniqueKeyTest, HdfsWriteToMultipleCollectionsTest, TestNoOpRegenerator, CachingDirectoryFactoryTest,
TestCloudManagedSchema, HighlighterTest, BlobRepositoryCloudTest, AnalysisErrorHandlingTest,
TestBinaryField, RankQueryTest, TestSlowCompositeReaderWrapper, TestReplicationHandler, TestFuzzyAnalyzedSuggestions,
BadCopyFieldTest, OutputWriterTest, BlockDirectoryTest, NumericFieldsTest, UUIDFieldTest,
TestSubQueryTransformerDistrib, TestRandomRequestDistribution, TestHttpShardHandlerFactory,
TestStressLiveNodes, TestClassicSimilarityFactory, LeaderElectionContextKeyTest, MultiThreadedOCPTest,
CdcrBootstrapTest, RAMDirectoryFactoryTest, TestSolrConfigHandlerCloud, SoftAutoCommitTest,
TestMultiValuedNumericRangeQuery, DistributedQueryComponentCustomSortTest, TestXIncludeConfig,
DistribCursorPagingTest, TestDynamicLoading, TestSolrCoreProperties, MetricsConfigTest, PrimitiveFieldTypeTest,
ExitableDirectoryReaderTest, CollectionTooManyReplicasTest, ResourceLoaderTest, HttpSolrCallGetCoreTest,
ZkCLITest, TestSort, TestCloudSchemaless, XsltUpdateRequestHandlerTest, TestCustomDocTransformer,
ChaosMonkeyNothingIsSafeTest, TestUseDocValuesAsStored2, ScriptEngineTest, TestTrackingShardHandlerFactory,
IndexSchemaTest, CoreSorterTest, DisMaxRequestHandlerTest, HighlighterMaxOffsetTest, SolrIndexMetricsTest,
TestDistributedStatsComponentCardinality, TestExtendedDismaxParser, TestSweetSpotSimilarityFactory,
TestSolrDeletionPolicy2, TestLegacyNumericRangeQueryBuilder, AsyncCallRequestStatusResponseTest,
TestFieldTypeResource, SegmentsInfoRequestHandlerTest, SuggesterWFSTTest, FastVectorHighlighterTest,
TestSolrQueryResponse, SolrSlf4jReporterTest, TestNonDefinedSimilarityFactory, TestNestedDocsSort,
TestNumericTerms32, TestImpersonationWithHadoopAuth, SpatialRPTFieldTypeTest, TestConfigSetsAPIZkFailure,
TestStressReorder, TestFieldCacheWithThreads, TestLazyCores, TestTolerantSearch, TestUtils,
HardAutoCommitTest, ShufflingReplicaListTransformerTest, AddSchemaFieldsUpdateProcessorFactoryTest,
QueryParsingTest, LeaderElectionTest, AlternateDirectoryTest, DistributedFacetExistsSmallTest,
TestNRTOpen, TestFieldCacheReopen, BigEndianAscendingWordDeserializerTest, SmileWriterTest,
TestHashPartitioner, EnumFieldTest, TestCorePropertiesReload, SpatialFilterTest, TestManagedSynonymFilterFactory,
TestPayloadCheckQParserPlugin, TimeZoneUtilsTest, AnalyticsQueryTest, TestPolicyCloud, TestSmileRequest,
OverseerRolesTest, TestPrepRecovery, TestLegacyField, CursorPagingTest, TestMacros, HdfsTlogReplayBufferedWhileIndexingTest,
TestInfoStreamLogging, TestDynamicFieldResource, DeleteShardTest, InfixSuggestersTest, SyncSliceTest,
DeleteNodeTest, TestSearcherReuse, DistributedSuggestComponentTest, LeaderInitiatedRecoveryOnShardRestartTest,
TestJavabinTupleStreamParser, ForceLeaderTest, RegexBoostProcessorTest, FieldAnalysisRequestHandlerTest,
TestConfigOverlay, RecoveryAfterSoftCommitTest, TestSubQueryTransformer, TestFoldingMultitermQuery,
TestCopyFieldCollectionResource, MissingSegmentRecoveryTest, PreAnalyzedUpdateProcessorTest,
InfoHandlerTest, TestQuerySenderNoQuery, TestClusterStateMutator, TestXmlQParserPlugin, TestSchemalessBufferedUpdates,
BlockJoinFacetRandomTest, DistribJoinFromCollectionTest, UpdateLogTest, OverseerCollectionConfigSetProcessorTest,
TestRequestStatusCollectionAPI, TestStressVersions, TestUniqueKeyFieldResource, TestHashQParserPlugin,
TestExactStatsCache, SolrXmlInZkTest, DistributedDebugComponentTest, SimplePostToolTest, BinaryUpdateRequestHandlerTest,
TestIBSimilarityFactory, TestStressLucene, TestCSVLoader, PolyFieldTest, NoCacheHeaderTest,
WordBreakSolrSpellCheckerTest, FieldMutatingUpdateProcessorTest, DirectUpdateHandlerOptimizeTest,
SortByFunctionTest, DebugComponentTest, IndexBasedSpellCheckerTest, TestWriterPerf, TestOmitPositions,
XmlUpdateRequestHandlerTest, TestIndexingPerformance, RequiredFieldsTest, IndexSchemaRuntimeFieldTest,
SolrPluginUtilsTest, ReturnFieldsTest, UpdateRequestProcessorFactoryTest, MBeansHandlerTest,
UniqFieldsUpdateProcessorFactoryTest, TestPartialUpdateDeduplication, CSVRequestHandlerTest,
HighlighterConfigTest, TestQuerySenderListener, ResponseLogComponentTest, SolrIndexConfigTest,
MultiTermTest, TestDocSet, MinimalSchemaTest, ExternalFileFieldSortTest, TestPostingsSolrHighlighter,
DirectSolrConnectionTest, TestLuceneMatchVersion, TestPhraseSuggestions, SpellPossibilityIteratorTest,
EchoParamsTest, TestPerFieldSimilarity, TestLMDirichletSimilarityFactory, TestFastWriter,
URLClassifyProcessorTest, DateMathParserTest, TestSuggestSpellingConverter, DOMUtilTest, FileUtilsTest,
DistributedMLTComponentTest, TestHighlightDedupGrouping, TestSimpleTrackingShardHandler, CdcrReplicationDistributedZkTest,
CdcrReplicationHandlerTest, CdcrVersionReplicationTest, ChaosMonkeySafeLeaderWithPullReplicasTest,
CleanupOldIndexTest, CloudExitableDirectoryReaderTest, CollectionStateFormat2Test, ConcurrentDeleteAndCreateCollectionTest,
ConfigSetsAPITest, ConnectionManagerTest, CreateCollectionCleanupTest, CustomCollectionTest,
DistributedQueueTest, LeaderFailureAfterFreshStartTest, MoveReplicaHDFSUlogDirTest, MoveReplicaTest,
OutOfBoxZkACLAndCredentialsProvidersTest, OverseerModifyCollectionTest, RemoteQueryErrorTest,
ReplicationFactorTest, RestartWhileUpdatingTest, RollingRestartTest, SharedFSAutoReplicaFailoverTest,
SharedFSAutoReplicaFailoverUtilsTest, SimpleCollectionCreateDeleteTest, SolrCLIZkUtilsTest,
TestAuthenticationFramework, TestCloudDeleteByQuery, TestCloudJSONFacetJoinDomain, TestCloudPseudoReturnFields,
TestCloudRecovery, TestCollectionAPI, TestConfigSetsAPI, TestConfigSetsAPIExclusivity, TestDeleteCollectionOnDownNodes,
TestDistribDocBasedVersion, TestLeaderElectionZkExpiry, TestLocalFSCloudBackupRestore, TestMiniSolrCloudCluster,
TestPullReplica, TestRebalanceLeaders, TestSolrCloudWithDelegationTokens, TestSolrCloudWithKerberosAlt,
TestTlogReplica, TestSolrCoreSnapshots, TestHdfsBackupRestoreCore, TestReplicationHandlerBackup,
TestReqParamsAPI, TestSQLHandler, V2ApiIntegrationTest, V2StandaloneTest, CoreAdminRequestStatusTest,
CoreMergeIndexesAdminHandlerTest, MetricsHandlerTest]
   [junit4] Completed [593/728 (1!)] on J0 in 0.90s, 3 tests, 1 failure <<< FAILURES!

[...truncated 36889 lines...]

Mime
View raw message